{"text_format":"1","workbook":"xlsx","n_sheets":21,"sheets":["Title Page","Index","INPUT","OUTPUT","Critical Design Assumptions","O&M Assumptions","Indirect Assumptions","Offgas Assumptions","Basin Constraints","Offgas","Pumps Pipe Structure","Instrumentation and Control","O&M","HVAC","Indirect","Standard Inputs","Cost Equations","Cost Coefficients","Cost Data","Engineering Data","Lookup Tables"],"not_rendered":{"charts":0,"images":0,"macros":1,"external_links":0,"defined_names":741,"comments":15,"pivot_tables":0},"unopened":[],"bounds":{"document_bytes":16777216,"sheet_cells":100000,"rows_first":2000,"rows_last":500,"rows_between":2000,"halvings":0,"cell_chars":16384,"cell_head_chars":4096},"cells_cut":0,"cells_raw":0,"read":"whole","date_system":"1900"}

{"sheet":"Title Page","index":0,"n_rows":12,"n_cols":1,"rows_kept":12,"cut":false,"hidden":false,"merged":[]}
["U.S. EPA Office of Ground Water and Drinking Water"]
["Work Breakdown Structure (WBS) Model for Multi-Stage Bubble Aeration (MSBA) Treatment"]
["Release Date: December 30, 2017"]
["· This model is designed to assist EPA in estimating national compliance costs for drinking water regulations."]
["· As such, the costs are intended to be representative of typical facilities."]
["· The costs, however, do not account for all of the site-specific factors that could affect the cost of any given individual facility."]
["· Use of this model requires Excel 2007 or later."]
["· The model should be opened as Read-only, so that any changes you make are saved under a new file name."]
["· To function properly, macros (\"active content\") must be enabled. If a security warning appears, click \"options\" and \"enable this content.\""]
["· For further information see the following document distributed with this file:"]
{"$rows_left_out":3}
{"sheet":"Index","index":1,"n_rows":211,"n_cols":2,"rows_kept":211,"cut":false,"hidden":false,"merged":[]}
["INDEX"]
["This page provides an index to all user-adjustable inputs and assumptions.  Click on a variable name to go directly to the adjustable cells."]
[]
["User-adjustable Input or Assumption","Variable Name and Link"]
["Access space per pump/blower for custom designed systems","space_pumps_cust"]
["Access space per pump/blower for pre-engineered packages","space_pumps_pre"]
["Additional blower head above water depth","add_blow_head"]
["Additional building after…","add_2nd_building"]
["Administrative LOE as a percent of average technical labor ","Clerical_percent"]
["Air conditioning EER","EER"]
{"$rows_left_out":202}
{"sheet":"INPUT","index":2,"n_rows":76,"n_cols":9,"rows_kept":76,"cut":false,"hidden":false,"merged":[[16,6,17,7],[27,8,27,11],[13,7,14,7]]}
["MULTI-STAGE BUBBLE AERATION SYSTEM DESIGN AND COST INPUT"]
[]
[null,null,null,null,"STEP 1"]
[null,null,null,null,"Select Contaminant",null,null,{"$f":"IF(contam<>1,\"For VOCs, default designs available up to 1 MGD only, because information on using MSBA for these contaminants in larger systems is limited\",\"\")","v":""}]
[]
[null,null,null,null,"STEP 2:",null,null,{"$f":"IF(OR('Standard Inputs'!AA9,'Standard Inputs'!AA17,'Standard Inputs'!AA25,'Standard Inputs'!AA33,'Standard Inputs'!AA41,'Standard Inputs'!AA49,'Standard Inputs'!AA57,'Standard Inputs'!AA65,'Standard Inputs'!AA73,'Standard Inputs'!AA81,'Standard Inputs'!AA89,'Standard Inputs'!AA97,'Standard Inputs'!AA105,'Standard Inputs'!AA113,'Standard Inputs'!AA121),\"<- Using this design\",IF(OR('Standard Inputs'!AB9,'Standard Inputs'!AB17,'Standard Inputs'!AB25,'Standard Inputs'!AB33,'Standard Inputs'!AB41,'Standard Inputs'!AB49,'Standard Inputs'!AB57,'Standard Inputs'!AB65,'Standard Inputs'!AB73,'Standard Inputs'!AB81,'Standard Inputs'!AB97,'Standard Inputs'!AB105,'Standard Inputs'!AB113,'Standard Inputs'!AB121),\"<- You modified this design\",\"\"))","v":""},{"$f":"IF(contam=10,\" Note: standard designs not defined for other contaminants.  Use manual input or set designs on Standard Inputs page.\",\"\")","v":""}]
[null,null,null,null,"Select one of the eight standard designs at right",null,null,{"$f":"IF(OR('Standard Inputs'!AA10,'Standard Inputs'!AA18,'Standard Inputs'!AA26,'Standard Inputs'!AA34,'Standard Inputs'!AA42,'Standard Inputs'!AA50,'Standard Inputs'!AA58,'Standard Inputs'!AA66,'Standard Inputs'!AA74,'Standard Inputs'!AA82,'Standard Inputs'!AA90,'Standard Inputs'!AA98,'Standard Inputs'!AA106,'Standard Inputs'!AA114,'Standard Inputs'!AA122),\"<- Using this design\",IF(OR('Standard Inputs'!AB10,'Standard Inputs'!AB18,'Standard Inputs'!AB26,'Standard Inputs'!AB34,'Standard Inputs'!AB42,'Standard Inputs'!AB50,'Standard Inputs'!AB58,'Standard Inputs'!AB66,'Standard Inputs'!AB74,'Standard Inputs'!AB82,'Standard Inputs'!AB98,'Standard Inputs'!AB106,'Standard Inputs'!AB114,'Standard Inputs'!AB122),\"<- You modified this design\",\"\"))","v":""}]
[null,null,null,null,null,null,null,{"$f":"IF(OR('Standard Inputs'!AA11,'Standard Inputs'!AA19,'Standard Inputs'!AA27,'Standard Inputs'!AA35,'Standard Inputs'!AA43,'Standard Inputs'!AA51,'Standard Inputs'!AA59,'Standard Inputs'!AA67,'Standard Inputs'!AA75,'Standard Inputs'!AA83,'Standard Inputs'!AA91,'Standard Inputs'!AA99,'Standard Inputs'!AA107,'Standard Inputs'!AA115,'Standard Inputs'!AA123),\"<- Using this design\",IF(OR('Standard Inputs'!AB11,'Standard Inputs'!AB19,'Standard Inputs'!AB27,'Standard Inputs'!AB35,'Standard Inputs'!AB43,'Standard Inputs'!AB51,'Standard Inputs'!AB59,'Standard Inputs'!AB67,'Standard Inputs'!AB75,'Standard Inputs'!AB83,'Standard Inputs'!AB99,'Standard Inputs'!AB107,'Standard Inputs'!AB115,'Standard Inputs'!AB123),\"<- You modified this design\",\"\"))","v":"<- Using this design"}]
[null,null,null,null,"OR",null,null,{"$f":"IF(OR('Standard Inputs'!AA12,'Standard Inputs'!AA20,'Standard Inputs'!AA28,'Standard Inputs'!AA36,'Standard Inputs'!AA44,'Standard Inputs'!AA52,'Standard Inputs'!AA60,'Standard Inputs'!AA68,'Standard Inputs'!AA76,'Standard Inputs'!AA84,'Standard Inputs'!AA92,'Standard Inputs'!AA100,'Standard Inputs'!AA108,'Standard Inputs'!AA116,'Standard Inputs'!AA124),\"<- Using this design\",IF(OR('Standard Inputs'!AB12,'Standard Inputs'!AB20,'Standard Inputs'!AB28,'Standard Inputs'!AB36,'Standard Inputs'!AB44,'Standard Inputs'!AB52,'Standard Inputs'!AB60,'Standard Inputs'!AB68,'Standard Inputs'!AB76,'Standard Inputs'!AB84,'Standard Inputs'!AB100,'Standard Inputs'!AB108,'Standard Inputs'!AB116,'Standard Inputs'!AB124),\"<- You modified this design\",\"\"))","v":""}]
[null,null,null,null,null,null,null,{"$f":"IF(OR('Standard Inputs'!AA13,'Standard Inputs'!AA21,'Standard Inputs'!AA29,'Standard Inputs'!AA37,'Standard Inputs'!AA45,'Standard Inputs'!AA53,'Standard Inputs'!AA61,'Standard Inputs'!AA69,'Standard Inputs'!AA77,'Standard Inputs'!AA85,'Standard Inputs'!AA93,'Standard Inputs'!AA101,'Standard Inputs'!AA109,'Standard Inputs'!AA117,'Standard Inputs'!AA125),\"<- Using this design\",IF(OR('Standard Inputs'!AB13,'Standard Inputs'!AB21,'Standard Inputs'!AB29,'Standard Inputs'!AB37,'Standard Inputs'!AB45,'Standard Inputs'!AB53,'Standard Inputs'!AB61,'Standard Inputs'!AB69,'Standard Inputs'!AB77,'Standard Inputs'!AB85,'Standard Inputs'!AB101,'Standard Inputs'!AB109,'Standard Inputs'!AB117,'Standard Inputs'!AB125),\"<- You modified this design\",\"\"))","v":""}," See model documentation for more information on standard designs"]
{"$rows_left_out":67}
{"sheet":"OUTPUT","index":3,"n_rows":299,"n_cols":25,"rows_kept":299,"cut":false,"hidden":false,"merged":[[27,0,29,0],[27,1,29,1],[232,8,232,11],[228,2,228,3],[27,11,29,11],[27,2,29,3],[27,4,29,5],[27,6,29,7],[27,8,29,8],[27,9,29,9],[27,10,29,10],[27,22,28,23],[228,4,228,5],[27,12,29,12],[27,13,27,21],[28,13,28,15],[28,16,28,18],[28,19,28,21]]}
["OUTPUT SUMMARY"]
[null,"Parameter","Value","Units"]
[null,"Technology","MSBA"]
[null,"Contaminant Type",{"$f":"VLOOKUP(contam,contaminant_lookup,2,FALSE)","v":"Radon"}]
[null,"System Size Category",{"$f":"IF(design_flow<1,\"small\",\"large\")","v":"small"}]
[null,"Design Flow",{"$f":"design_flow","v":0.30499999999999999},"MGD (excludes bypass flow)"]
[null,"Average Flow",{"$f":"average_flow","v":9.4E-2},"MGD (excludes bypass flow)"]
[null,"Number of Basins ",{"$f":"num_tanks","v":1},"units"]
[null,"Number of Stages per Basin",{"$f":"stages","v":6},"stages"]
[null,"Basin Length",{"$f":"tank_length","v":8},"feet"]
{"$rows_left_out":290}
{"sheet":"Critical Design Assumptions","index":4,"n_rows":111,"n_cols":7,"rows_kept":111,"cut":false,"hidden":false,"merged":[]}
["Default Critical Design Assumptions"]
["Users may change any of the cells in the Value column; cells in gold are most important and may vary based on contaminant treated and site-specific conditions"]
[]
["Assumption","Range Name","Value","Units","Guidance"]
["Use curve fit for costs","curve",1,"<-- enter 1 to use cost equations, leave blank to use lookup tables for component costs","Keeping this assumption with a value of 1 is strongly recommended; the cost equations method is more appropriate for national cost estimating and will be more accurate for nearly all user-specified designs"]
[]
["Bypass Flow"]
["Percent of Total Flow that is Bypassed","bp_pct",0,null,"Typically, bypass flow ranges between 0% and 50% of inflow. Enter zero to remove bypass piping and components. 0% is default consistent with the type of cost curves that EPA will need for its national cost simulation model."]
[]
["Pumps and Blowers"]
{"$rows_left_out":102}
{"sheet":"O&M Assumptions","index":5,"n_rows":58,"n_cols":5,"rows_kept":58,"cut":false,"hidden":false,"merged":[]}
["Default O&M Assumptions"]
["Users may change any of the cells in the Value column"]
[]
["Assumption","Range Name","Value","Units","Guidance"]
["Pump head","pump_head",75,"psi","Consistent with pumping to distribution at 60-90 psi (Lowry Peer Review Comments)"]
["Efficiency of pumps","pump_effcy",0.75]
["Additional blower head above water depth","add_blow_head",10,"inches"]
["Blower efficiency","blower_effcy",0.7]
["Cost for parts & maintenance for pumps and blowers","pump_maint_rate",0.01,null,"For calculating cost of actual maintenance materials; not to be confused with depreciation; 5% would be too high (Richard E. Hubel, Peter Keenan, American Water Works Service Company, Inc)"]
[]
{"$rows_left_out":49}
{"sheet":"Indirect Assumptions","index":6,"n_rows":134,"n_cols":5,"rows_kept":134,"cut":false,"hidden":false,"merged":[[112,0,113,0],[112,1,113,1],[112,2,112,4],[124,0,125,0],[124,1,125,1],[124,2,124,4]]}
["Default Assumptions for Indirect and Add-On Costs"]
["Users may change any of the cells in the Value column"]
[]
["Assumption","Range Name","Value","Units","Guidance"]
["Permits"]
["Include permit costs?","include_permits",1,"<--- enter 1 for yes, 0 for no"]
["Always include NEPA compliance costs?","include_NEPA",0,"<--- enter 1 for yes, 2 for no","Default of 0 means NEPA compliance is included in the high component cost estimate only. Selecting 1 means NEPA compliance will be included in all estimates. Selecting 0 means NEPA compliance will never be included."]
[]
["Pilot Study"]
["Include pilot study costs?","include_pilot",1,"<--- enter 1 for yes, 0 for no"]
{"$rows_left_out":125}
{"sheet":"Offgas Assumptions","index":7,"n_rows":44,"n_cols":7,"rows_kept":44,"cut":false,"hidden":false,"merged":[[27,0,28,0],[27,1,28,1]]}
["Default Offgas Assumptions"]
["Users may change any of the cells in the Value column"]
[]
["Assumption","Range Name","Value","Units","Guidance"]
["Specific heat of air","cpa",1.01,"kJ/kg-deg C","Rough assumption to account for high temperature and relative humidity in this application"]
["Density of air","PA",1.2470000000000001,"kg/m3","Conservatively using value for 10 deg C"]
["Operating temperature","T",283,"degrees Kelvin","Equilibrium operating temperature. 283 degrees K (10 degrees C) is typical of groundwater. "]
[]
["GAC"]
["GAC Density","GAC_density",30,"lbs/cu ft","Bulk density, not particle density.  GAC density range of 22-30 lb/cubic ft; lignite GAC approximately 22 and bituminous GAC approximately 28 lb/cubic ft (Randal J. Braker, General Manager, Duck River Utility Commission)"]
{"$rows_left_out":35}
{"sheet":"Basin Constraints","index":8,"n_rows":49,"n_cols":5,"rows_kept":49,"cut":false,"hidden":false,"merged":[]}
["Basin Constraint Calculations"]
[]
["Calculation","Range Name","Value","Units","Guidance"]
["From Inputs"]
["Design Production Flow","design_flow",{"$f":"IF(df_units=\"gpm\",(1-bp_pct)*design_flow_I*24*60/1000000,(1-bp_pct)*design_flow_I)","v":0.30499999999999999},"MGD","From input, less bypass"]
["Average Production Flow","average_flow",{"$f":" (1-bp_pct)*IF(af_units=\"gpm\",average_flow_I*24*60/1000000,IF(af_units=\"fraction of design flow\",average_flow_I*design_flow,average_flow_I))","v":9.4E-2},"MGD","From input, less bypass"]
["Design Production Flow Rate","design_flow_rate",{"$f":"design_flow*1000000/(24*60)","v":211.80555555555554},"gpm","Design flow expressed in gpm"]
["Average Production Flow Rate","average_flow_rate",{"$f":"average_flow*1000000/(24*60)","v":65.277777777777771},"gpm","Average flow expressed in gpm"]
["Bypass Flow Rate","bp_flow_rate",{"$f":"bp_pct/(1-bp_pct)*design_flow_rate","v":0},"gpm"]
["Target Contaminant","contam",1,"<--- 1 for Radon, 2 for TCE, 3 for PCE, etc."]
{"$rows_left_out":40}
{"sheet":"Offgas","index":9,"n_rows":74,"n_cols":5,"rows_kept":74,"cut":false,"hidden":false,"merged":[]}
["Offgas Calculations"]
[]
["Calculation","Range Name","Value","Units","Guidance"]
["From Inputs"]
["Off-gas Pollution Control Technology","Offgas_Tech",{"$f":"IF(OR(Offgas_Tech_I=\"none\",Offgas_Tech_I=\"\"),0,IF(Offgas_Tech_I=\"GAC\",1,IF(Offgas_Tech_I=\"thermal oxidation\",2,3)))","v":0},"<--- 0 for none, 1 for GAC, 2 for Thermal Oxidation, 3 for Catalytic Oxidation"]
["Heat recovery type","og_opt1",{"$f":"IF(OR(Offgas_Tech=2,Offgas_Tech=3),IF(og_opt1_I=\"none\",0,IF(og_opt1_I=\"recuperative\",1,2)),\"\")","v":""},"<--- 0 for none, 1 for recuperative, 2 for regenerative"]
["Spent GAC regeneration","og_opt2",{"$f":"IF(Offgas_Tech=1,IF(og_opt2_I=\"throwaway\",0,1),\"\")","v":""},"<--- 0 for throwaway (no regeneration), 1 for off-site regeneration"]
["Percent removal","p_rem_og",{"$f":"IF(p_rem=\"NA\",P_REM_I,p_rem)","v":0.99569335511465951}]
[]
["Off-gas Control System"]
{"$rows_left_out":65}
{"sheet":"Pumps Pipe Structure","index":10,"n_rows":50,"n_cols":5,"rows_kept":50,"cut":false,"hidden":false,"merged":[]}
["Pumps, Piping, and Structure Calculations"]
[]
["Calculation","Range Name","Value","Units","Guidance"]
["Influent Pumping"]
["Flow of each pump","pump_rating",{"$f":"IF(num_pumps_I=\"\",MIN(MAX(average_flow_rate+bp_flow_rate*average_flow_rate/design_flow_rate,(design_flow_rate+bp_flow_rate)/2)*(1+pump_safety_factor),max_pump_size),IF(num_pumps_I=0,0,(design_flow_rate+bp_flow_rate)*(1+pump_safety_factor)/num_pumps_I))","v":132.37847222222223},"gpm","Includes safety factor"]
["Operating pumps","num_pumps",{"$f":"IF(pump_rating=0,0,ROUNDUP((design_flow_rate+bp_flow_rate)*(1+pump_safety_factor)/pump_rating,0))","v":2},"units"]
["Total pumps","total_pumps",{"$f":"IF(pump_rating=0,0,num_pumps+NRD_pumps)","v":2},"units"]
["Maximum pump size","max_pump_size",{"$f":"MAX(VLOOKUP(10^6,pump_cost_cl,1)-1,VLOOKUP(10^6,back_pump_cost_cl,1)-1)","v":10000},"gpm","The largest pump size for which costs are available.  Applies to booster pumps."]
[]
["Blowers"]
{"$rows_left_out":41}
{"sheet":"Instrumentation and Control","index":11,"n_rows":50,"n_cols":5,"rows_kept":50,"cut":false,"hidden":false,"merged":[]}
["Instrumentation and Control Calculations"]
[]
["Calculation","Range Name","Value","Units","Guidance"]
["From Inputs"]
["Component level","component_level",{"$f":"IF(component_level_I=\"high cost\",2,IF(component_level_I=\"mid cost\",1,\"\"))","v":""},"blank = low cost, 1 = mid cost, 2 = high cost"]
["Manual system controls","manual",{"$f":"IF(manual_I=\"manual\",1,IF(manual_I=\"semi-automated\",2,IF(manual_I=\"fully automated\",3,IF(component_level=\"\",1,IF(component_level=2,3,CHOOSE(ss_cat2,3,3,3))))))","v":1},"1 = fully manual system, 2 = semi-automated system, 3 = fully automated system.","Based on system size and component level (see cell comment), unless user overrides on input sheet"]
[]
["Valves and Instrumentation"]
["Size of valves for inlet and outlet lines","in_valve_size",{"$f":"in_out_pipe_diam","v":4},"inches"]
["Size of valves for process line","tank_valve_size",{"$f":"h2o_pipe_diam","v":4},"inches"]
{"$rows_left_out":41}
{"sheet":"O&M","index":12,"n_rows":66,"n_cols":5,"rows_kept":66,"cut":false,"hidden":false,"merged":[]}
["Operation and Maintenance Calculations"]
[]
["Calculation","Range Name","Value","Units","Guidance"]
["Materials"]
["Maintenance Materials"]
["Pumps","pump_materials",{"$f":"pump_maint_rate*OUTPUT!J45","v":148.23228049553799},"/yr"]
["Blowers","blower_materials",{"$f":"IF(num_blowers=0,0,pump_maint_rate*SUMPRODUCT(OUTPUT!J46:J46,OUTPUT!L46:L46))","v":793.50143673567891},"/yr"]
[]
["Labor"]
["General Labor"]
{"$rows_left_out":57}
{"sheet":"HVAC","index":13,"n_rows":133,"n_cols":12,"rows_kept":133,"cut":false,"hidden":false,"merged":[[78,1,78,4],[87,1,87,4]]}
["Building Heating, Ventilating, and Air Conditioning Calculations"]
[]
["Calculation","Range Name","Value","Units","Guidance"]
["General information"]
["System size","ss_cat2",{"$f":"IF(design_flow<1,1,IF(design_flow<10,2,3))","v":1},"1 indicates small system, 2 indicates medium, 3 indicates large","ss_cat2 is used to select ventilation requirements and building type"]
["Buiding 1 length and width","build1_side",{"$f":"build1_fp^0.5","v":10.954451150103322},"ft"]
["Building 2 length and width","build2_side",{"$f":"build2_fp^0.5","v":0},"ft"]
[]
["Ventilation"]
["Building 1 weighted average air changes","air_changes_build1",{"$f":"IF(build2_fp=0,(Air_changes_contactor*basin_fp+Air_changes_pump*pump_fp+Air_changes_pump*blower_hp+Air_changes_office*office_fp)/build1_fp,Air_changes_contactor)","v":4.2182018392148457},"air changes/hr"]
{"$rows_left_out":124}
{"sheet":"Indirect","index":14,"n_rows":89,"n_cols":5,"rows_kept":89,"cut":false,"hidden":false,"merged":[]}
["Indirect and Add-on Cost Calculations"]
[]
["Calculation","Range Name","Value","Units","Guidance"]
["Standby Power"]
["Blowers",null,{"$f":"blower_energy*design_flow/average_flow/365/24*1000","v":4.3774919579744047},"kW"]
["Pumps",null,{"$f":"pump_energy*design_flow/average_flow/365/24*1000","v":9.2052579867553099},"kW"]
["Offgas blowers",null,{"$f":"IF(Offgas_Tech=2,TO_power_yr,IF(Offgas_Tech=3,CO_power_yr,0))*design_flow/average_flow/365/24*1000","v":0},"kW"]
["Lighting",null,{"$f":"(build1_fp*lighting_energy_1+build2_fp*lighting_energy_2)/365/24","v":0.12000000000000001},"kW"]
["Building 1 ventilation",null,{"$f":"0.746*Fan_pressure_drop*build1_fp*Building_height*air_changes_build1/33000","v":5.7214155855532266E-2},"kW"]
["Building 2 ventilation",null,{"$f":"0.746*Fan_pressure_drop*build2_fp*Building_height*air_changes_build2/33000","v":0},"kW"]
{"$rows_left_out":80}
{"sheet":"Standard Inputs","index":15,"n_rows":131,"n_cols":28,"rows_kept":131,"cut":false,"hidden":false,"merged":[[5,0,5,1],[6,26,6,27],[5,2,5,5],[5,20,5,24],[5,13,5,19],[5,6,5,12]]}
["Standard Designs"]
["Default inputs represent typical options used to generate national average compliance costs."]
[]
[]
[]
["Design Indices",null,"System Size",null,null,null,"System Configuration",null,null,null,null,null,null,"Offgas",null,null,null,null,null,null,"Optional"]
["Contaminant Selection","Design #","Design flow (mgd)","Design Flow Units","Average Flow","Average flow units","Design Type","Number of Operating Basins","Air to Water Ratio","Maximum Water Depth","# of Stages","Pilot rate constant (Kla)","Pilot air intensity (AI)","Influent water concentration (ug/L)","Percent removal","VOC Release Limit (lbs/day)","Off-gas Pollution Control Technology","Heat Recovery Type","GAC Regeneration","GAC Bed Life","Number of Pumps","Number of Blowers","Number of Redundant Basins","Component level","System Automation","Contaminant Name","Internal Use"]
[null,null,"design_flow_I","df_units","average_flow_I","af_units","design_type_I","num_op_tanks","air_water_ratio","max_h2odepth","stages","pilot_k","pilot_phi","influent_conc","P_REM_I","max_VOC_release","Offgas_tech_I","og_opt1_I","og_opt2_I","og_opt3","num_pumps_I","num_blowers_I","NRD_I","component_level_I","manual_I"]
[1,1,0.03,"MGD",7.0000000000000001E-3,"MGD","pre-engineered package",1,20,3,6,null,null,null,null,null,null,null,null,null,null,null,null,null,null,"Radon",{"$f":"AND(C9:Y9=inp_used)","v":false},{"$f":"AND(C9:F9=inp_used_minimal)","v":false}]
[1,2,0.124,"MGD",3.5000000000000003E-2,"MGD","pre-engineered package",1,20,3,6,null,null,null,null,null,null,null,null,null,null,null,null,null,null,null,{"$f":"AND(C10:Y10=inp_used)","v":false},{"$f":"AND(C10:F10=inp_used_minimal)","v":false}]
{"$rows_left_out":122}
{"sheet":"Cost Equations","index":16,"n_rows":128,"n_cols":17,"rows_kept":128,"cut":false,"hidden":false,"merged":[]}
["Cost Equations"]
["This sheet is used internally to calculate component costs using the cost equations method; see model documentation for more details on the development of cost equations"]
[]
["Component",null,"Result","Variable",null,2,3,4,5,6,7,8,9,10,11,16,17]
["Aeration Basins"]
["Custom Designed"]
["Concrete, excavation and backfill, cover","no equation"]
["Baffles","baffle_eq",{"$f":"IF(OR(D8>P8,D8<Q8),\"contact vendor\",F8*D8^G8+H8*LN(D8)+I8+J8*EXP(K8*D8)+L8*D8^3+M8*D8^2+N8*D8+O8)","v":180.28288053},{"$f":"baffle_area","v":25},"baffle_eq",{"$f":"VLOOKUP($E8,eq_table_cl,F$4,FALSE)","v":0},0,0,0,0,0,1.4999999999999999E-8,-2.7636700000000002E-4,4.6000189929999999,65.454900705,9963.76,0]
["Pre-engineered package"]
["Stainless Steel","ss_tank_eq",{"$f":"IF(D10=0,0,IF(OR(D10>P10,D10<Q10),\"contact vendor\",F10*D10^G10+H10*LN(D10)+I10+J10*EXP(K10*D10)+L10*D10^3+M10*D10^2+N10*D10+O10))","v":34947.51163572001},{"$f":"tank_sf","v":360},"ss_basin_eq",{"$f":"VLOOKUP($E10,eq_table_cl,F$4,FALSE)","v":0},0,0,0,0,0,1.2317809999999999E-3,-1.01945011,300.50956248900002,1414.82905968,1200,0]
{"$rows_left_out":119}
{"sheet":"Cost Coefficients","index":17,"n_rows":53,"n_cols":17,"rows_kept":53,"cut":false,"hidden":false,"merged":[]}
["Coefficients for Component Cost Equations"]
["This sheet is used internally to calculate component costs using the cost equations method; see model documentation for more details on the development of cost equations"]
[]
[null,"Power: C1*x^C2",null,"Logarithmic: C3*Ln(x) + C4",null,"Exponential: C5*e^(C6*x)",null,"Polynomial: C7*x^3 + C8*x^2 + C9*x + C10",null,null,null,"NOTES"]
["Equation Lookup Name","C1","C2","C3","C4","C5","C6","C7","C8","C9","C10","Pct deviation of fit equation","Modified by","Last modified","Rsq of fit equation","max size used to gen curve","min size for which curve fits are valid"]
["baffle_eq",0,0,0,0,0,0,1.4999999999999999E-8,-2.7636700000000002E-4,4.6000189929999999,65.454900705,7.5975866282759333E-2,null," 6/23/2017 2:09:51 PM",0.99895568601152007,9963.76,0]
["bldg_hi_eq",324.18264690900003,-0.13230006499999999,0,0,0,0,0,0,0,0,3.9891100445136697E-2,null," 6/23/2017 3:04:02 PM",0.95292288207252096,200000.1,0]
["bldg_lo_eq",150.466390674,-9.6925793999999996E-2,0,0,0,0,0,0,0,0,2.5518207619233565E-2,null," 6/23/2017 3:03:10 PM",0.96714729333927008,200000.1,0]
["bldg_mid_eq",184.678993655,-9.8240209999999994E-2,0,0,0,0,0,0,0,0,2.751136169037021E-2,null," 6/23/2017 3:03:32 PM",0.96388247777818237,200000.1,0]
["cent_blow_eq",0,0,0,0,0,0,8.5700000000000001E-7,-5.7551010000000003E-3,20.870654318,27480.641816621999,1.8314057068716118E-2,null," 6/21/2017 4:27:51 PM",0.99879993877279705,5001,0]
{"$rows_left_out":44}
{"sheet":"Cost Data","index":18,"n_rows":1249,"n_cols":7,"rows_kept":1249,"cut":false,"hidden":false,"merged":[]}
["Cost Data"]
["This sheet is used internally and contains component cost data extracted from the central cost database"]
["To maintain vendor confidentiality, the central cost database itself is not provided here"]
[]
["bls118","Alarms (High/Low Pressure Alarms, Level Switch/Alarms, Low Alarms)"]
[43,null,null,"Unit Cost","Useful Life (large)","Useful Life (small)"]
["alarm_cost_cl",0,0,580.58711311592128,15,14]
[]
[]
["bls1141","Centrifugal Pumps (Backwash)"]
{"$rows_left_out":1240}
{"sheet":"Engineering Data","index":19,"n_rows":153,"n_cols":6,"rows_kept":153,"cut":false,"hidden":false,"merged":[]}
["Engineering Data"]
["This sheet is used internally and contains engineering reference and indirect cost data extracted from the central cost database"]
[]
["Architectural Fee"]
["Building cost lookup","Corresponds to the range","Architectural fee"]
[0,"<$250,000",0.09]
[250000,"$250,000 to $500,000",0.08]
[500000,"$500,000 to $1,000,000",7.0000000000000007E-2]
[1000000,"$1,000,000 to $5,000,000",6.2E-2]
[5000000,"$5,000,000 to $10,000,000",5.2999999999999999E-2]
{"$rows_left_out":144}
{"sheet":"Lookup Tables","index":20,"n_rows":39,"n_cols":1,"rows_kept":39,"cut":false,"hidden":false,"merged":[]}
["Lookup Tables and Input Validation"]
["This sheet is used internally to perform certain reference calculations and support input sheet data validation"]
[]
["comp_level_valid"]
["low cost"]
["mid cost"]
["high cost"]
[]
[]
["system_automation_valid"]
{"$rows_left_out":29}