{"text_format":"1","workbook":"xlsx","n_sheets":5,"sheets":["Instructions","Standards_Data","Sketa22_Data","Samples_Data","Final Report"],"not_rendered":{"charts":2,"images":1,"macros":1,"external_links":0,"defined_names":0,"comments":0,"pivot_tables":0},"unopened":[],"bounds":{"document_bytes":16777216,"sheet_cells":100000,"rows_first":2000,"rows_last":500,"rows_between":2000,"halvings":0,"cell_chars":16384,"cell_head_chars":4096},"cells_cut":0,"cells_raw":0,"read":"whole","date_system":"1900"}

{"sheet":"Instructions","index":0,"n_rows":39,"n_cols":9,"rows_kept":39,"cut":false,"hidden":false,"merged":[[3,0,6,11],[1,0,1,10],[0,0,0,3],[0,8,0,10]]}
[null,null,null,null,null,null,null,null,"Office of Water (4303T)\nWashington, DC 20460\nMarch 2019"]
["Automated Draft EPA Methods 1696 and 1697 Data Analysis Tool"]
[]
["The following tool was designed to automate the analysis of data generated from a single instrument run using draft EPA Method 1696 and 1697.  Upon completion of data entry, the Excel macro will automatically perform all calculations for method proficiency, quality assurance and estimation of human-associated genetic marker concentration in test samples.  A summary of findings is located in the “Final Report” tab."]
[]
[]
[]
[]
[]
["Preparation of Export Data File:"]
{"$rows_left_out":30}
{"sheet":"Standards_Data","index":1,"n_rows":45,"n_cols":38,"rows_kept":45,"cut":false,"hidden":false,"merged":[[29,28,29,29],[28,30,28,31]]}
["TABLE 1:  Data Entry Table for HF183/BacR287 or HumM2 NTC and Standard Results"]
[]
["Batch","Run","Sample Type","Assay","Copy","l_Copy","FAM_Cq","VIC_Cq","NTC Pass/Fail",null,null,"Metric","Value",null,null,null,"Legend: \"Standards_Data\" Tab"]
[1,1,"NTC",null,null,null,null,null,{"$f":"IF(OR(G4=\"undetermined\",G4>M$22),1,0)","v":{"$error":"#DIV/0!"}},null,null,"NTC_VIC Mean",{"$f":"AVERAGE(H4:H9)","v":{"$error":"#DIV/0!"}},null,null,"NTC_VIC Mean","No template control VIC mean"]
[1,1,"NTC",null,null," ",null,null,{"$f":"IF(OR(G5=\"undetermined\",G5>M$22),1,0)","v":{"$error":"#DIV/0!"}},null,null,"NTC_VIC std",{"$f":"STDEV(H4:H9)","v":{"$error":"#DIV/0!"}},null,null,"NTC_VIC std","No template control VIC standard deviation"]
[1,1,"NTC",null,null," ",null,null,{"$error":"#DIV/0!"},null,null,"NTC_Criteria",{"$f":"IF(SUM(I4:I9)=6,\"pass\",\"fail\")","v":{"$error":"#DIV/0!"}},null,null,"NTC_Criteria","No template control Pass/Fail criteria"]
[1,1,"NTC",null,null," ",null,null,{"$error":"#DIV/0!"},null,null,"Slope",{"$f":"SLOPE(AF10:AF24,AE10:AE24)","v":{"$error":"#DIV/0!"}},null,null,"Slope","Calibration model slope"]
[1,1,"NTC",null,null," ",null,null,{"$error":"#DIV/0!"},null,null,"Slope_std",{"$f":"SQRT((SUMSQ(AG10:AG24)/(COUNT(AG10:AG24)-2))/DEVSQ(AE10:AE24))","v":{"$error":"#DIV/0!"}},null,null,"Slope_std","Calibration model slope standard deviation",null,null,null,null,null,null,"Outlier Calculations",null,null,null,null,null,null,"Calibration Model Calculations"]
[1,1,"NTC",null,null," ",null,null,{"$error":"#DIV/0!"},null,null,"Slope_95% LB",{"$f":"M7- TINV(0.05,COUNT(AG10:AG24)-2)*M8","v":{"$error":"#DIV/0!"}},null,null,"Slope_95% LB","Calibration model 95% Prediction limit lower bound",null,null,null,null,null,null,"1- h_ii","res","rss_i","sigma_i","r_student","outlier",null,"l_copy","FAM_Cq","res","IAC ROQ Pass/Fail","sum","Cat_i","min(<=1)","max(>1)"]
[1,1,"Standard",null,10,{"$f":"LOG10(E10)","v":1},null,null,null,null,null,"Slope_95% UB",{"$f":"M7 + TINV(0.05,COUNT(AG10:AG24)-2)*M8","v":{"$error":"#DIV/0!"}},null,null,"Slope_95% UB","Calibration model 95% Prediction limit upper bound",null,null,null,null,null,null,{"$f":" IF(G10=\"undetermined\",\" \",1- ( (1/COUNT(F$10:F$24)) + ((F10-AVERAGE(F$10:F$24))^2/DEVSQ(F$10:F$24))))","v":0.8},{"$f":"IF(X10=\" \",\" \",G10-(INTERCEPT(G$10:G$24,F$10:F$24) + SLOPE(G$10:G$24,F$10:F$24)*F10))","v":{"$error":"#DIV/0!"}},{"$f":"IF(Y10=\" \",\" \",DEVSQ(Y$10:Y$24) -(Y10^2/X10))","v":{"$error":"#DIV/0!"}},{"$f":"IF(Z10=\" \",\" \",SQRT(Z10/(COUNT(G$10:G$24)-3)))","v":{"$error":"#DIV/0!"}},{"$f":"IF(AA10=\" \", \" \",Y10/(AA10*SQRT(X10)))","v":{"$error":"#DIV/0!"}},{"$f":"IF(AB10=\" \",\" \",IF(ABS(AB10)>3,\"Yes\",\"No\"))","v":{"$error":"#DIV/0!"}},null,{"$f":"IF(AC10=\"No\",F10,\" \")","v":{"$error":"#DIV/0!"}},{"$f":"IF(AC10=\"No\",G10,\" \")","v":{"$error":"#DIV/0!"}},{"$f":"IF(AF10=\" \",\" \",AF10-(INTERCEPT(AF$10:AF$24,AE$10:AE$24) + SLOPE(AF$10:AF$24,AE$10:AE$24)*AE10))","v":{"$error":"#DIV/0!"}},{"$f":"IF(OR(H10<(M$4-3*M$5),H10>(M$4+3*M$5),H10=\"undetermined\"),0,1)","v":{"$error":"#DIV/0!"}},{"$f":"SUM(AH10:AH12)","v":{"$error":"#DIV/0!"}},{"$f":"IF(H10<$M$18,\"pass\",IF(OR(AF10>$M$17,AF10=40),\"fail\",\"fail\"))","v":{"$error":"#DIV/0!"}},{"$f":"IF(AI10<=1,1,\"\")","v":{"$error":"#DIV/0!"}},{"$f":"IF(AI10>1,1,\"\")","v":{"$error":"#DIV/0!"}}]
{"$rows_left_out":36}
{"sheet":"Sketa22_Data","index":2,"n_rows":26,"n_cols":15,"rows_kept":26,"cut":false,"hidden":false,"merged":[]}
["TABLE 3:  Data Entry Table for Sketa22 MB Results"]
[]
["Batch","Run","Sample Type","Filter No.","Assay","FAM_Cq"]
[1,1,"MB",1,"Sketa22",null,null,"Sketa22 Cq","SS","df","MSS","var.comp",null,"Mean Cq:",{"$f":"AVERAGE(F4:F12)","v":{"$error":"#DIV/0!"}}]
[1,1,"MB",1,"Sketa22",null,null,"Total",{"$f":"IF(COUNTBLANK(F4:F12) =9,0,DEVSQ(F4:F12))","v":0},{"$f":"COUNT(F4:F12)-1","v":-1},{"$f":"I5/J5","v":0},{"$f":"IF((L7 <0),0,L7) +    IF( (L6 <0),0,L6)","v":{"$error":"#DIV/0!"}},null,"Standard Deviation:",{"$f":"SQRT(L5)","v":{"$error":"#DIV/0!"}}]
[1,1,"MB",1,"Sketa22",null,null,"Filter",{"$f":"I5-(I7)","v":0},{"$f":"J5 - J7","v":-1},{"$f":"I6/J6","v":0},{"$f":"(K6-K7)/(((COUNT(F4:F6)+COUNT(F7:F9)+COUNT(F10:F12))-(COUNT(F4:F6)^2+COUNT(F7:F9)^2+COUNT(F10:F12)^2)/(COUNT(F4:F6)+COUNT(F7:F9)+COUNT(F10:F12)))/((IF(COUNTBLANK(F4:F6)=3,0,1))+(IF(COUNTBLANK(F7:F9)=3,0,1))+(IF(COUNTBLANK(F10:F12)=3,0,1))-1))","v":{"$error":"#DIV/0!"}},null,"SPC Proficiency",{"$f":"IF(O$5 <=0.62,\"pass\",\"fail\")","v":{"$error":"#DIV/0!"}}]
[1,1,"MB",2,"Sketa22",null,null,"Residual",{"$f":"IF(COUNTBLANK(F4:F6)=3,0,DEVSQ(F4:F6))+IF(COUNTBLANK(F7:F9)=3,0,DEVSQ(F7:F9))+IF(COUNTBLANK(F10:F12)=3,0,DEVSQ(F10:F12))","v":0},{"$f":"IF(COUNTBLANK(F4:F6)=3,0,COUNT(F4:F6)-1)+IF(COUNTBLANK(F7:F9)=3,0,COUNT(F7:F9)-1)+IF(COUNTBLANK(F10:F12)=3,0,COUNT(F10:F12)-1)","v":0},{"$f":"I7/J7","v":{"$error":"#DIV/0!"}},{"$f":"K7","v":{"$error":"#DIV/0!"}}]
[1,1,"MB",2,"Sketa22"]
[1,1,"MB",2,"Sketa22"]
[1,1,"MB",3,"Sketa22"]
{"$rows_left_out":17}
{"sheet":"Samples_Data","index":3,"n_rows":93,"n_cols":40,"rows_kept":93,"cut":false,"hidden":false,"merged":[]}
["TABLE 5:  Data Entry Table for Environmental Sample Results"]
[]
["Batch","Run","Assay","Sample No.","Sample ID","Filter Rep.","Test Filter No.","FAM_Cq","VIC_Cq","Sketa22_Cq","IAC_Category","IAC_Count","IAC_Criteria","D/ND","LLOQ_Criteria","m_Sketa22_Cq","Sketa22 SPC_Accpt","Sketa22 SPC_Adj","Delta","SPC Test Pass/Fail","SPC Proficiency","All Criteria","Final_FAM_Cq","m_Cq","l_copy","Standard Deviation","n"]
[1,1,null,1,null,1,1,null,null,null,{"$f":"IF(I4<Standards_Data!M$18,\"pass\",IF(OR(H4>Standards_Data!M$17,H4=\"undetermined\"),\"inhb\",\"comp\"))","v":{"$error":"#DIV/0!"}},{"$f":"IF(OR(K4=\"pass\",K4=\"comp\"),1,0)","v":{"$error":"#DIV/0!"}},{"$f":"IF(OR(COUNT(L4:L6)=0,Standards_Data!M$5>Standards_Data!M$23),\" \",IF(SUM(L4:L6) >=2,\"pass\",\"fail\"))","v":{"$error":"#DIV/0!"}},{"$f":"IF(H4=\"undetermined\",0,IF(H4>=Standards_Data!M$25,0,1))","v":0},{"$f":"IF(H4=\"undetermined\",\"ND\",IF(H4>Standards_Data!M$22,\"fail\",\"pass\"))","v":{"$error":"#DIV/0!"}},{"$f":"IF(COUNT(J4:J6)=0,\" \",AVERAGE(J4:J6))","v":" "},{"$f":"IF(P4=\" \",\" \",IF(P4> (Sketa22_Data!O$4+3*Sketa22_Data!O$5),\"fail\",\"pass\"))","v":" "},{"$f":"IF(P4=\" \",\" \",IF(P4> (Sketa22_Data!O$4+3.3),\"fail\",\"pass\"))","v":" "},{"$f":"IF(AND(P4>(Sketa22_Data!O$4+3*Sketa22_Data!O$5), P4<= (Sketa22_Data!O$4+3.3)),P4-(Sketa22_Data!O$4+3*Sketa22_Data!O$5),\" \")","v":{"$error":"#DIV/0!"}},{"$f":"IF(AND(P4>(Sketa22_Data!O$4+3*Sketa22_Data!O$5), P4<= (Sketa22_Data!O$4+3.3)),\"pass\",\" \")","v":{"$error":"#DIV/0!"}},{"$f":"IF(AND(Sketa22_Data!O$5 <0.62,OR(Q4=\"pass\",T4=\"pass\")),\"pass\",\" \")","v":{"$error":"#DIV/0!"}},{"$f":"IF(AND(L4=1,M4=\"pass\",O4=\"pass\",U4=\"pass\",Standards_Data!M$20=\"pass\",Standards_Data!M$21=\"pass\",Standards_Data!M$6=\"pass\",Standards_Data!H$30=\"pass\",Sketa22_Data!G$18=\"pass\"),\"pass\",\"fail\")","v":{"$error":"#DIV/0!"}},{"$f":"IF(V4=\"fail\",\"\",IF(T4=\"pass\",H4-S4,H4))","v":{"$error":"#DIV/0!"}},{"$f":"IF(COUNT(W4:W12)=0,  \" \",AVERAGE(W4:W12))","v":" "},{"$f":"IF( X4=\" \", \" \",(X4-Standards_Data!M$11)/Standards_Data!M$7)","v":" "},{"$f":"IF(Y4=\" \",\" \",SQRT((1/Standards_Data!$M$7^2)*(Standards_Data!$M$12^2+AJ5^2+ (-2*(X4-Standards_Data!$M$11)*SUMSQ(Standards_Data!$AG$10:$AG$24)*AVERAGE(Standards_Data!$AE$10:$AE$24)/(DEVSQ(Standards_Data!$AE$10:$AE$24)*(COUNT(Standards_Data!$AG$10:$AG$24)-2)*Standards_Data!$M$7))+ ((X4-Standards_Data!$M$11)^2*Standards_Data!$M$8^2/(Standards_Data!$M$7^2)))))","v":" "},{"$f":"COUNT(W4:W12)","v":0},null,null,"SS","df","MSS","var.comp",null,"Adj_FAM_Cq",{"$f":"AVERAGE(W4:W12)","v":{"$error":"#DIV/0!"}},null,null,null,"Legend: \"Samples_Data\" Tab"]
[1,1,null,1,null,1,1,null,null,null,{"$f":"IF(I5<Standards_Data!M$18,\"pass\",IF(OR(H5>Standards_Data!M$17,H5=\"undetermined\"),\"inhb\",\"comp\"))","v":{"$error":"#DIV/0!"}},{"$f":"IF(OR(K5=\"pass\",K5=\"comp\"),1,0)","v":{"$error":"#DIV/0!"}},{"$f":"IF(OR(COUNT(L4:L6)=0,Standards_Data!M$5>Standards_Data!M$23),\" \",IF(SUM(L4:L6) >=2,\"pass\",\"fail\"))","v":{"$error":"#DIV/0!"}},{"$f":"IF(H5=\"undetermined\",0,IF(H5>=Standards_Data!M$25,0,1))","v":0},{"$f":"IF(H5=\"undetermined\",\"ND\",IF(H5>Standards_Data!M$22,\"fail\",\"pass\"))","v":{"$error":"#DIV/0!"}},null,null,null,{"$f":"IF(AND(P4>(Sketa22_Data!O$4+3*Sketa22_Data!O$5), P4<= (Sketa22_Data!O$4+3.3)),P4-(Sketa22_Data!O$4+3*Sketa22_Data!O$5),\" \")","v":{"$error":"#DIV/0!"}},{"$f":"IF(AND(P4>(Sketa22_Data!O$4+3*Sketa22_Data!O$5), P4<= (Sketa22_Data!O$4+3.3)),\"pass\",\" \")","v":{"$error":"#DIV/0!"}},{"$f":"IF(AND(Sketa22_Data!O$5 <0.62,OR(Q4=\"pass\",T4=\"pass\")),\"pass\",\" \")","v":{"$error":"#DIV/0!"}},{"$f":"IF(AND(L5=1,M5=\"pass\",O5=\"pass\",U5=\"pass\",Standards_Data!M$20=\"pass\",Standards_Data!M$21=\"pass\",Standards_Data!M$6=\"pass\",Standards_Data!H$30=\"pass\",Sketa22_Data!G$18=\"pass\"),\"pass\",\"fail\")","v":{"$error":"#DIV/0!"}},{"$error":"#DIV/0!"},null,null,null,null,null,"Total",{"$f":"IF(COUNTBLANK(W4:W12) =9,0,DEVSQ(W4:W12))","v":{"$error":"#DIV/0!"}},{"$f":"COUNT(W4:W12)-1","v":-1},{"$f":"AD5/AE5","v":{"$error":"#DIV/0!"}},{"$f":"IF((AG7 <0),0,AG7) +    IF( (AG6 <0),0,AG6)","v":{"$error":"#DIV/0!"}},null,"std.error",{"$f":"IF(COUNT(W4:W12) <=3,0,   IF(AG6 >0,SQRT((AG7/(AE5+1))+(AG6*(COUNT(W4:W6)^2+COUNT(W7:W9)^2+COUNT(W10:W12)^2)/(AE5+1)^2)), STDEV(W4:W12)/SQRT(COUNT(W4:W12)  ) ))","v":0},null,null,"Batch","Batch number"]
[1,1,null,1,null,1,1,null,null,null,{"$f":"IF(I6<Standards_Data!M$18,\"pass\",IF(OR(H6>Standards_Data!M$17,H6=\"undetermined\"),\"inhb\",\"comp\"))","v":{"$error":"#DIV/0!"}},{"$error":"#DIV/0!"},{"$f":"IF(OR(COUNT(L4:L6)=0,Standards_Data!M$5>Standards_Data!M$23),\" \",IF(SUM(L4:L6) >=2,\"pass\",\"fail\"))","v":{"$error":"#DIV/0!"}},{"$f":"IF(H6=\"undetermined\",0,IF(H6>=Standards_Data!M$25,0,1))","v":0},{"$f":"IF(H6=\"undetermined\",\"ND\",IF(H6>Standards_Data!M$22,\"fail\",\"pass\"))","v":{"$error":"#DIV/0!"}},null,null,null,{"$f":"IF(AND(P4>(Sketa22_Data!O$4+3*Sketa22_Data!O$5), P4<= (Sketa22_Data!O$4+3.3)),P4-(Sketa22_Data!O$4+3*Sketa22_Data!O$5),\" \")","v":{"$error":"#DIV/0!"}},{"$f":"IF(AND(P4>(Sketa22_Data!O$4+3*Sketa22_Data!O$5), P4<= (Sketa22_Data!O$4+3.3)),\"pass\",\" \")","v":{"$error":"#DIV/0!"}},{"$f":"IF(AND(Sketa22_Data!O$5 <0.62,OR(Q4=\"pass\",T4=\"pass\")),\"pass\",\" \")","v":{"$error":"#DIV/0!"}},{"$f":"IF(AND(L6=1,M6=\"pass\",O6=\"pass\",U6=\"pass\",Standards_Data!M$20=\"pass\",Standards_Data!M$21=\"pass\",Standards_Data!M$6=\"pass\",Standards_Data!H$30=\"pass\",Sketa22_Data!G$18=\"pass\"),\"pass\",\"fail\")","v":{"$error":"#DIV/0!"}},{"$error":"#DIV/0!"},null,null,null,null,null,"Filter",{"$f":"AD5-(AD7)","v":{"$error":"#DIV/0!"}},{"$f":"AE5 - AE7","v":2},{"$f":"AD6/AE6","v":{"$error":"#DIV/0!"}},{"$f":"(AF6-AF7)/(((COUNT(  W4:W6)+COUNT(  W7:W9)+COUNT(  W10:W12))-(COUNT(  W4:W6)^2+COUNT(  W7:W9)^2+COUNT(  W10:W12)^2)/(COUNT(  W4:W6)+COUNT(  W7:W9)+COUNT(  W10:W12)))/((IF(COUNTBLANK(  W4:W6)=3,0,1))+(IF(COUNTBLANK(  W7:W9)=3,0,1))+(IF(COUNTBLANK(  W10:W12)=3,0,1))-1))","v":{"$error":"#DIV/0!"}},null,null,null,null,null,"Run","Instrument run number"]
[1,1,null,1,null,2,2,null,null,null,{"$f":"IF(I7<Standards_Data!M$18,\"pass\",IF(OR(H7>Standards_Data!M$17,H7=\"undetermined\"),\"inhb\",\"comp\"))","v":{"$error":"#DIV/0!"}},{"$error":"#DIV/0!"},{"$f":"IF(OR(COUNT(L7:L9)=0,Standards_Data!M$5>Standards_Data!M$23),\" \",IF(SUM(L7:L9) >=2,\"pass\",\"fail\"))","v":{"$error":"#DIV/0!"}},{"$f":"IF(H7=\"undetermined\",0,IF(H7>=Standards_Data!M$25,0,1))","v":0},{"$f":"IF(H7=\"undetermined\",\"ND\",IF(H7>Standards_Data!M$22,\"fail\",\"pass\"))","v":{"$error":"#DIV/0!"}},{"$f":"IF(COUNT(J7:J9)=0,\" \",AVERAGE(J7:J9))","v":" "},{"$f":"IF(P7=\" \",\" \",IF(P7> (Sketa22_Data!O$4+3*Sketa22_Data!O$5),\"fail\",\"pass\"))","v":" "},{"$f":"IF(P7=\" \",\" \",IF(P7> (Sketa22_Data!O$4+3.3),\"fail\",\"pass\"))","v":" "},{"$f":"IF(AND(P7>(Sketa22_Data!O$4+3*Sketa22_Data!O$5), P7<= (Sketa22_Data!O$4+3.3)),P7-(Sketa22_Data!O$4+3*Sketa22_Data!O$5),\" \")","v":{"$error":"#DIV/0!"}},{"$f":"IF(AND(P7>(Sketa22_Data!O$4+3*Sketa22_Data!O$5), P7<= (Sketa22_Data!O$4+3.3)),\"pass\",\" \")","v":{"$error":"#DIV/0!"}},{"$f":"IF(AND(Sketa22_Data!O$5 <0.62,OR(Q7=\"pass\",T7=\"pass\")),\"pass\",\" \")","v":{"$error":"#DIV/0!"}},{"$f":"IF(AND(L7=1,M7=\"pass\",O7=\"pass\",U7=\"pass\",Standards_Data!M$20=\"pass\",Standards_Data!M$21=\"pass\",Standards_Data!M$6=\"pass\",Standards_Data!H$30=\"pass\",Sketa22_Data!G$18=\"pass\"),\"pass\",\"fail\")","v":{"$error":"#DIV/0!"}},{"$error":"#DIV/0!"},null,null,null,null,null,"Residual",{"$f":"IF(COUNTBLANK(  W4:W6)=3,0,DEVSQ(  W4:W6))+IF(COUNTBLANK(  W7:W9)=3,0,DEVSQ(  W7:W9))+IF(COUNTBLANK(  W10:W12)=3,0,DEVSQ(  W10:W12))","v":{"$error":"#DIV/0!"}},{"$f":"IF(COUNTBLANK(  W4:W6)=3,0,COUNT(  W4:W6)-1)+IF(COUNTBLANK(  W7:W9)=3,0,COUNT(  W7:W9)-1)+IF(COUNTBLANK(  W10:W12)=3,0,COUNT(  W10:W12)-1)","v":-3},{"$f":"AD7/AE7","v":{"$error":"#DIV/0!"}},{"$f":"AF7","v":{"$error":"#DIV/0!"}},null,null,null,null,null,"Assay","qPCR assay name (HF183 or HumM2)"]
[1,1,null,1,null,2,2,null,null,null,{"$f":"IF(I8<Standards_Data!M$18,\"pass\",IF(OR(H8>Standards_Data!M$17,H8=\"undetermined\"),\"inhb\",\"comp\"))","v":{"$error":"#DIV/0!"}},{"$error":"#DIV/0!"},{"$f":"IF(OR(COUNT(L7:L9)=0,Standards_Data!M$5>Standards_Data!M$23),\" \",IF(SUM(L7:L9) >=2,\"pass\",\"fail\"))","v":{"$error":"#DIV/0!"}},{"$f":"IF(H8=\"undetermined\",0,IF(H8>=Standards_Data!M$25,0,1))","v":0},{"$f":"IF(H8=\"undetermined\",\"ND\",IF(H8>Standards_Data!M$22,\"fail\",\"pass\"))","v":{"$error":"#DIV/0!"}},null,null,null,{"$f":"IF(AND(P7>(Sketa22_Data!O$4+3*Sketa22_Data!O$5), P7<= (Sketa22_Data!O$4+3.3)),P7-(Sketa22_Data!O$4+3*Sketa22_Data!O$5),\" \")","v":{"$error":"#DIV/0!"}},{"$f":"IF(AND(P7>(Sketa22_Data!O$4+3*Sketa22_Data!O$5), P7<= (Sketa22_Data!O$4+3.3)),\"pass\",\" \")","v":{"$error":"#DIV/0!"}},{"$f":"IF(AND(Sketa22_Data!O$5 <0.62,OR(Q7=\"pass\",T7=\"pass\")),\"pass\",\" \")","v":{"$error":"#DIV/0!"}},{"$f":"IF(AND(L8=1,M8=\"pass\",O8=\"pass\",U8=\"pass\",Standards_Data!M$20=\"pass\",Standards_Data!M$21=\"pass\",Standards_Data!M$6=\"pass\",Standards_Data!H$30=\"pass\",Sketa22_Data!G$18=\"pass\"),\"pass\",\"fail\")","v":{"$error":"#DIV/0!"}},{"$error":"#DIV/0!"},null,null,null,null,null,null,null,null,null,null,null,null,null,null,null,"Sample ID","Sample identification"]
[1,1,null,1,null,2,2,null,null,null,{"$f":"IF(I9<Standards_Data!M$18,\"pass\",IF(OR(H9>Standards_Data!M$17,H9=\"undetermined\"),\"inhb\",\"comp\"))","v":{"$error":"#DIV/0!"}},{"$error":"#DIV/0!"},{"$f":"IF(OR(COUNT(L7:L9)=0,Standards_Data!M$5>Standards_Data!M$23),\" \",IF(SUM(L7:L9) >=2,\"pass\",\"fail\"))","v":{"$error":"#DIV/0!"}},{"$f":"IF(H9=\"undetermined\",0,IF(H9>=Standards_Data!M$25,0,1))","v":0},{"$f":"IF(H9=\"undetermined\",\"ND\",IF(H9>Standards_Data!M$22,\"fail\",\"pass\"))","v":{"$error":"#DIV/0!"}},null,null,null,{"$f":"IF(AND(P7>(Sketa22_Data!O$4+3*Sketa22_Data!O$5), P7<= (Sketa22_Data!O$4+3.3)),P7-(Sketa22_Data!O$4+3*Sketa22_Data!O$5),\" \")","v":{"$error":"#DIV/0!"}},{"$f":"IF(AND(P7>(Sketa22_Data!O$4+3*Sketa22_Data!O$5), P7<= (Sketa22_Data!O$4+3.3)),\"pass\",\" \")","v":{"$error":"#DIV/0!"}},{"$f":"IF(AND(Sketa22_Data!O$5 <0.62,OR(Q7=\"pass\",T7=\"pass\")),\"pass\",\" \")","v":{"$error":"#DIV/0!"}},{"$f":"IF(AND(L9=1,M9=\"pass\",O9=\"pass\",U9=\"pass\",Standards_Data!M$20=\"pass\",Standards_Data!M$21=\"pass\",Standards_Data!M$6=\"pass\",Standards_Data!H$30=\"pass\",Sketa22_Data!G$18=\"pass\"),\"pass\",\"fail\")","v":{"$error":"#DIV/0!"}},{"$error":"#DIV/0!"},null,null,null,null,null,null,null,null,null,null,null,null,null,null,null,"Filter No.","Filter number"]
[1,1,null,1,null,3,3,null,null,null,{"$f":"IF(I10<Standards_Data!M$18,\"pass\",IF(OR(H10>Standards_Data!M$17,H10=\"undetermined\"),\"inhb\",\"comp\"))","v":{"$error":"#DIV/0!"}},{"$error":"#DIV/0!"},{"$f":"IF(OR(COUNT(L10:L12)=0,Standards_Data!M$5>Standards_Data!M$23),\" \",IF(SUM(L10:L12) >=2,\"pass\",\"fail\"))","v":{"$error":"#DIV/0!"}},{"$f":"IF(H10=\"undetermined\",0,IF(H10>=Standards_Data!M$25,0,1))","v":0},{"$f":"IF(H10=\"undetermined\",\"ND\",IF(H10>Standards_Data!M$22,\"fail\",\"pass\"))","v":{"$error":"#DIV/0!"}},{"$f":"IF(COUNT(J10:J12)=0,\" \",AVERAGE(J10:J12))","v":" "},{"$f":"IF(P10=\" \",\" \",IF(P10> (Sketa22_Data!O$4+3*Sketa22_Data!O$5),\"fail\",\"pass\"))","v":" "},{"$f":"IF(P10=\" \",\" \",IF(P10> (Sketa22_Data!O$4+3.3),\"fail\",\"pass\"))","v":" "},{"$f":"IF(AND(P10>(Sketa22_Data!O$4+3*Sketa22_Data!O$5), P10<= (Sketa22_Data!O$4+3.3)),P10-(Sketa22_Data!O$4+3*Sketa22_Data!O$5),\" \")","v":{"$error":"#DIV/0!"}},{"$f":"IF(AND(P10>(Sketa22_Data!O$4+3*Sketa22_Data!O$5), P10<= (Sketa22_Data!O$4+3.3)),\"pass\",\" \")","v":{"$error":"#DIV/0!"}},{"$f":"IF(AND(Sketa22_Data!O$5 <0.62,OR(Q10=\"pass\",T10=\"pass\")),\"pass\",\" \")","v":{"$error":"#DIV/0!"}},{"$f":"IF(AND(L10=1,M10=\"pass\",O10=\"pass\",U10=\"pass\",Standards_Data!M$20=\"pass\",Standards_Data!M$21=\"pass\",Standards_Data!M$6=\"pass\",Standards_Data!H$30=\"pass\",Sketa22_Data!G$18=\"pass\"),\"pass\",\"fail\")","v":{"$error":"#DIV/0!"}},{"$error":"#DIV/0!"},null,null,null,null,null,null,null,null,null,null,null,null,null,null,null,"VIC_Cq","Internal amplification control VIC quantification cycle"]
{"$rows_left_out":84}
{"sheet":"Final Report","index":4,"n_rows":66,"n_cols":17,"rows_kept":66,"cut":false,"hidden":false,"merged":[[23,1,24,1],[25,1,27,1],[25,2,26,2],[28,1,29,1],[0,0,0,12]]}
["Human Fecal Source Identification Results Summary"]
[]
[]
["Table 1:  Calibration Model Performance Metrics",null,null,null,null,"Figure 1: Calibration model with 95% Prediction Interval",null,null,null,null,null,null,null,null,null,null,"Legend: \"Final Report\" Tab"]
[null,null,null,"Std. Error",null,null,null,null,null,null,null,null,null,null,null,"Std. Error","Calibration model slope and intercpet standard error"]
[{"$f":"Standards_Data!$D$4","v":0},"Slope",{"$f":"Standards_Data!$M$7","v":{"$error":"#DIV/0!"}},{"$f":"Standards_Data!$M$8","v":{"$error":"#DIV/0!"}},null,null,null,null,null,null,null,null,null,null,null,"E","Calibration model amplification efficiency"]
[null,"Intercept",{"$f":"Standards_Data!$M$11","v":{"$error":"#DIV/0!"}},{"$f":"Standards_Data!$M$12","v":{"$error":"#DIV/0!"}},null,null,null,null,null,null,null,null,null,null,null,"R2","Calibration model correlation coefficient"]
[null,"E",{"$f":"Standards_Data!$M$19","v":{"$error":"#DIV/0!"}},null,null,null,null,null,null,null,null,null,null,null,null,"LLOQ","Calibration model lower limit of quantification"]
[null,"R2",{"$f":"Standards_Data!$M$15","v":{"$error":"#DIV/0!"}},null,null,null,null,null,null,null,null,null,null,null,null,"# of Outliers","Number of outliers"]
[null,"LLOQ",{"$f":"Standards_Data!$M$22","v":{"$error":"#DIV/0!"}},null,null,null,null,null,null,null,null,null,null,null,null,"ROQ (min & max) ","Calibration model range of quantification log10 copies per reaction (min = minimum and max = maximum)"]
{"$rows_left_out":56}