{"text_format":"1","workbook":"xlsx","n_sheets":23,"sheets":["Title Page","Index","INPUT","OUTPUT","Critical Design Assumptions","O&M Assumptions","Indirect Assumptions","Vessel Constraints","Backwash and Regeneration","pH Adjust","Pumps Pipe Structure","Instrumentation and Control","Residuals Management","O&M","HVAC","Indirect","Standard Inputs","AutoSize","Cost Equations","Cost Coefficients","Cost Data","Engineering Data","Lookup Tables"],"not_rendered":{"charts":0,"images":0,"macros":1,"external_links":0,"defined_names":1464,"comments":14,"pivot_tables":0},"unopened":[],"bounds":{"document_bytes":16777216,"sheet_cells":100000,"rows_first":2000,"rows_last":500,"rows_between":2000,"halvings":0,"cell_chars":16384,"cell_head_chars":4096},"cells_cut":0,"cells_raw":0,"read":"whole","date_system":"1900"}

{"sheet":"Title Page","index":0,"n_rows":15,"n_cols":1,"rows_kept":15,"cut":false,"hidden":false,"merged":[]}
["U.S. EPA Office of Ground Water and Drinking Water"]
["Work Breakdown Structure (WBS) Model for Ion Exchange Treatment of Perchlorate in Drinking Water"]
["Release Date: June 30, 2019"]
["· The primary purpose of this model is to assist EPA in estimating national compliance costs."]
["· As such, the costs are intended to be representative of typical facilities."]
["· The default settings, however, do not account for all of the site-specific factors that could affect the cost of any given individual facility or project."]
["· Still, other uses of the model might be reasonable if sufficient care is taken by the user to account for site- or project-specific factors."]
["· The model results are point estimates shown to the nearest $1, but this precision is not meant to imply that the results are accurate to $1."]
["· Instead, users should review all documentation, modify inputs/assumptions as appropriate to their specific purpose, and form their own informed opinions about the accuracy and suitability of the results."]
["· Use of this model requires Excel 2007 or later."]
["· The model should be opened as Read-only, so that any changes you make are saved under a new file name."]
["· To function properly, macros (\"active content\") must be enabled. If a security warning appears, click \"options\" and \"enable this content.\""]
["· For further information see the following document distributed with this file:"]
["USEPA. 2019. Work Breakdown Structure-Based Cost Model for Ion Exchange Treatment of Perchlorate in Drinking Water . Office of Water."]
["· To begin using the model, go to the INPUT sheet."]

{"sheet":"Index","index":1,"n_rows":360,"n_cols":2,"rows_kept":360,"cut":false,"hidden":false,"merged":[]}
["INDEX"]
["This page provides an index to all user-adjustable inputs and assumptions.  Click on a variable name to go directly to the adjustable cells."]
[]
["User-adjustable Input or Assumption","Variable Name and Link"]
["Access space for cartridge filters","space_other_equip"]
["Access space per pump for custom designed systems","space_pumps_cust"]
["Access space per pump for pre-engineered packages","space_pumps_pre"]
["Add a redundant unit per x parallel lines","redund_freq"]
["Add coagulant to holding tank?","coag_res"]
["Additional building after…","add_2nd_building"]
["Additional conductivity meters","add_cond"]
["Additional freeboard","sec_cont_freeboard"]
["Additional redundant cartridge filter per x MGD inflow","addl_redund_cart_per_flow"]
["Additional sampling ports","add_ports"]
["Additional turbididy meters","add_turb"]
["Additional turbididy meters for small systems","add_turb_small"]
["Administrative LOE as a percent of average technical labor ","Clerical_percent"]
["Air conditioning EER","EER"]
["Alternate media disposal cost (including transportation)","alt_media_disp"]
["Always include NEPA compliance costs?","include_NEPA"]
["Annual cooling degree days","cool_DD"]
["Annual heating degree days","heat_DD"]
["Annual resin loss","resin_loss_annual"]
["Apply POTW discharge base charge (i.e., $/month)","POTW_base_fee"]
["Apply POTW discharge TSS charge (i.e., $/lb of TSS over limit below)","POTW_TSS_fee"]
["Apply POTW discharge volume charge (i.e., $/1000 gallons)","POTW_volume_fee"]
["Average annual pan evaporation rate","pan_evap"]
["Average annual precipitation","precip"]
["Average Flow","average_flow_I"]
["Backwash frequency outside of regeneration/initial rinse","add_backwash_freq"]
["Backwash loading rate","h2oflush_backwash_rate"]
["Backwash time","backwash_time"]
["Backwash/Rinse Pumping","no_backwash_I"]
["Backwash/Rinse Storage","no_back_tank_I"]
["Basin excavation depth above which deeper boreholes are needed","deep_bore_need"]
["Bed depth","bed_depth"]
["Bedding depth below pipe","bedding_depth"]
["Bedding depth surrounding the pipe","bedding_pct"]
["Borehole depth for deep basins","bore_depth_max"]
["Borehole depth for shallow basins","bore_depth_min"]
["Borehole depth without basins","bore_depth_nobasin"]
["Borehole needed every x square feet","hole_per_sf"]
["Boreholes per job","hole_per_job"]
["Brine concentration in lbs/gal","brine_conc"]
["Brine delivery method","brine_method_I"]
["Brine loading rate in lbs/square ft","brine_load"]
["Builder's risk insurance percentage","br_ins_pct"]
["Bypass percentage","bp_pct"]
["Characteristics of holding tank solids or evaporation pond solids","solids_haz_I"]
["Characteristics of spent resin","media_haz_I"]
["Chemical resistant coating coverage","sec_cont_coating_cvg"]
["Chemical storage height","storage_height"]
["Chemical tank mixer horsepower","cmix_hp_per"]
["City Index","city_index"]
["Clean holding tanks/basins when solids accumulation =x% of capacity","htank_clean_pct"]
["Clearance space beneath the ceiling","ceiling_clearance"]
["Climate for estimating evaporation pond greenhouse gas emissions","GHG_pond_climate"]
["Coefficient of passive pressure","Coeff_Kp"]
["Component level","component_level_I"]
["Computer workstations per x operators","workstation_ratio"]
["Concrete pad thickness","pad_thick"]
["Concrete pad thickness for small systems","pad_thick_small"]
["Concrete thickness for holding basins","conc_thick"]
["Conductivity meters per vessel","cond_tank"]
["Cooling table for buildings 500 square feet or greater","cooling_table"]
["Cooling table for buildings less than 500 ft2","cooling_table_shed"]
["Cooling ventilation/infiltration load","cool_viload"]
["Cost estimating method","curve"]
["Cost for parts & maintenance for booster pumps","booster_pump_maintenance"]
["Days of chemical storage","cstore_days"]
["Days of winter (i.e., days of storage during periods with no net evaporation)","winter_days"]
["Default number of residuals basins","hbasins_default"]
["Design Flow","design_flow_I"]
["Design safety factor for standby power","std_safety_factor"]
["Desired treated water alkalinity as CaCO3","alk_I"]
["Desired treated water pH","pHf"]
["Diameter","comm_diam"]
["Dilute HCl rinse bed volumes","HCl_BV"]
["Discharge option for spent backwash/rinse or regenerant","res_s2_opt_I"]
["Disposal method for non-hazardous secondary solids","solids_method"]
["Distance to discharge point or evaporation pond","add_res_pipe_length"]
["Drive controllers per backwash pump","S_back_pump"]
["Drive controllers per booster pump","S_booster_pump"]
["Drive controllers per chemical feeder","S_chem_feed"]
["Drive controllers per coagulant feeder","S_feeder"]
["Drive controllers per eductor","S_eductor"]
["Drive controllers per metering pump","S_cm_pump"]
["Drive controllers per regenerant mixer","S_mixer"]
["Drive controllers per regenerant pump","S_regen_pump"]
["Drive controllers per residuals pump","S_res_pump"]
["Electric resistance heating efficiency","resist_eff"]
["Electrical percentage","elect_pct"]
["Engineering percentage for large systems","eng_pct_large"]
["Engineering percentage for medium systems","eng_pct_medium"]
["Engineering percentage for small systems","eng_pct_small"]
["Ethernet modules","plc_ethernet "]
["Evaporation pond dike cross-sectional area","dike_xsection"]
["Evaporation pond freeboard","ep_freeboard"]
["Evaporation pond safety factor","ep_safety_factor"]
["Evaporation pond solids density","ep_solids_density"]
["Evaporation pond solids removal frequency","dredging_freq"]
["Evaporation ratio","evap_ratio"]
["Ferric chloride bulk density","FeCl3_dens"]
["Ferric chloride bulk density","coag_density"]
["Ferric chloride dosage","coag_dose"]
["Ferric chloride molecular weight","FeCl3_mw"]
["Ferric chloride sludge production factor","coag_spf"]
["Financing percentage","finance_pct"]
["Financing percentage for small systems","finance_pct_small"]
["Fire Buffer for Buildings","fire_buffer"]
["Flow meters for backwash line","fm_back"]
["Flow meters for influent and effluent line","tot_fm_in"]
["Flow meters for process line per vessel","fm_proc"]
["Flow meters for residuals line","tot_fm_res"]
["For chemical supply systems","uloe_chem_maint"]
["For instruments (includes calibration)","uloe_inst_maint"]
["For pumps","uloe_pump_maint"]
["For valves","uloe_valve_maint"]
["Free board above media at full expansion","free_board"]
["Frost depth","frost"]
["HCl quantity to trigger RMP requirement","HCl_quant_RMP"]
["HCl strength to trigger RMP requirement","HCl_strength_RMP"]
["Head loss sensors per cartridge filter","headloss_cart"]
["Head loss sensors per vessel","head_tank"]
["Head loss sensors per vessel for small systems","head_tank_small"]
["Heat pump cooling mode EER","hp_EER"]
["Heat pump heating coefficient of performance","COP"]
["Heating Oil Heat Content","diesel_heat_content"]
["Heating table for buildings 500 square feet or greater","heating_table"]
["Heating table for buildings less than 500 ft2","heating_table_shed"]
["Heating ventilation/infiltration load","heat_viload"]
["Height or length (straight) of vessel","comm_height_length"]
["High/Low alarms per backwash tank","alarm_back"]
["High/Low alarms per HCl tank","alarm_acid"]
["High/Low alarms per holding tank","alarm_res"]
["High/Low alarms per NaOH tank","alarm_caustic"]
["High/Low alarms per regenerant mixing tank","alarm_brine"]
["Holding basin depth to volume ratio","holding_ratio"]
["Holding basin freeboard","holding_freeboard"]
["Holding tank for spent backwash/rinse","res_s1_opt_I"]
["Holding tank mixer horsepower (if coagulant is used)","hmix_hp_per"]
["Holding tank/basin capacity factor","res_cap_factor"]
["Holding tank/basin solids density","ht_solids_density"]
["Holding tank/basin suspended solids removal efficiency with coagulant","coag_TSSrem"]
["Holding tank/basin suspended solids removal efficiency without coagulant","htank_TSSrem"]
["Hours per resin changeout","uloe_throwaway"]
["Hydrochloric acid molecular weight","HCl_mw"]
["Hydrochloric acid weight percent as delivered","HCl_pct"]
["I/O port table","port_table"]
["Include a separate day tank if daily volume is x or greater","day_tank_needed"]
["Include architectural fee for small systems?","include_arch_small"]
["Include architectural fee?","include_arch"]
["Include buildings?","include_buildings_I"]
["Include cartridge filters","include_cart"]
["Include concrete pad in total capital cost?","include_pad"]
["Include construction management cost for pre-engineered packages?","include_cm_pre"]
["Include construction management cost?","include_cm"]
["Include contingency costs for high cost systems?","include_conting_high"]
["Include contingency costs for low cost systems?","include_conting_low"]
["Include contingency costs for medium cost systems?","include_conting_medium"]
["Include cooling in standby power","need_cool"]
["Include geotechnical costs for high cost systems?","include_geo_high"]
["Include geotechnical costs for low cost systems?","include_geo_low"]
["Include geotechnical costs for medium cost systems?","include_geo_medium"]
["Include heating in standby power","need_heat"]
["Include HVAC?","include_HVAC_I"]
["Include land?","include_land_I"]
["Include mixers for chemical tanks","include_cmix"]
["Include performance bond cost?","include_bond"]
["Include permit costs?","include_permits"]
["Include pilot study costs?","include_pilot"]
["Include secondary containment","include_sec_cont"]
["Include sitework costs?","include_sitework"]
["Include standby power costs for small systems?","include_standby_small"]
["Include standby power costs?","include_standby"]
["Include yard piping costs?","include_yardpipe"]
["Influent water temperature","t_I"]
["Influent water total dissolved solids","TDS_I"]
["Installation, Transportatation, and O&P percentage","inst_pct"]
["Instrumentation and control percentage","i_c_pct"]
["Labor hours per cartridge filter","hrs_filter"]
["Legal percentage","legal_pct"]
["Level switch/alarms per vessel","level_switch"]
["Level switch/alarms per vessel for small systems","level_switch_small"]
["Life of cartridge filters","cart_life"]
["Lighting power per sf, high-quality buildings","lighting_power_high"]
["Lighting power per sf, low-quality buildings and sheds","lighting_power_low"]
["Lighting power per sf, mid-quality buildings","lighting_power_mid"]
["Linear feet bored per day","hole_per_day"]
["Loading rate maximum in gpm/square ft","load_max"]
["Loading rate minimum","load_min"]
["Mangerial LOE as a percent of average technical labor ","Manager_percent"]
["Maximum access space per vessel or tank for custom designed systems","max_space_vessels_cust"]
["Maximum access space per vessel or tank for pre-engineered systems","max_space_vessels_pre"]
["Maximum bed depth for autosize","max_bed_depth"]
["Maximum curb thickness","sec_cont_max_thick"]
["Maximum evaporation pond cell area","max_ep_cell_area"]
["Maximum hazardous waste shipment size","max_haz_ship"]
["Maximum liquid hazardous waste shipment size","max_lhaz_ship"]
["Maximum radioactive (non-hazardous) waste shipment size","max_rad_ship"]
["Maximum radioactive hazardous waste shipment size","max_hazrad_ship"]
["Maximum vessel diameter","max_diam_override"]
["Maximum vessel height (circular vessels)","max_height"]
["Maximum vessel length (longitudinal vessels)","max_length"]
["Media regeneration or throwaway operation?","throwaway_I"]
["Media unit cost in $/cubic ft","resin_unit_cost"]
["Mid-efficiency oil furnace efficiency","diesel_eff"]
["Miles to hazardous solid waste disposal site","haz_miles"]
["Miles to non-hazardous solid waste disposal site","non_haz_miles"]
["Miles to radioactive (non-hazardous) waste disposal site","rad_miles"]
["Miles to radioactive hazardous waste disposal site","hazrad_miles"]
["Minimum average flow as percentage of design","min_avg_flow"]
["Minimum bed depth for autosize","min_bed_depth"]
["Minimum chemical feed pump size","min_chem_flow"]
["Minimum chemical tank mixer horsepower","min_cmix_hp"]
["Minimum holding tank mixer horsepower","min_hmix_hp"]
["Minimum number of boreholes","min_holes"]
["Minimum number of cartridge filters above 1 MGD","min_cart"]
["Minimum number of pond cells","min_ep_cells"]
["Minimum number of vessels in series (i.e., parallel or series operation)","num_tanks_I"]
["Minimum residuals pipe diameter","min_res_pipe_size"]
["Minimum settling time when coagulant is used","res_coag_settle_time"]
["Minimum standby power generator size","min_standby"]
["Minimum trench depth to top of pipe","min_trench_depth"]
["Minutes per 100 sf per day","uloe_fp"]
["Minutes per instrument per day","uloe_inst"]
["Minutes per pump per day","uloe_pump"]
["Minutes per regeneration/backwash for automated systems","uloe_autoregen"]
["Minutes per valve per week","uloe_valve"]
["Miscellaneous allowance percentage","misc_pct"]
["Mixer size for regenerant tanks","mixer_size"]
["Mobilization percentage for large systems","mob_pct_large"]
["Mobilization percentage for medium systems","mob_pct_medium"]
["Mobilization percentage for small systems","mob_pct_small"]
["Molarity of dilute HCl rinse","dil_HCl_M"]
["Molarity of FeCl3 in tetrachloroferrate solution","FeCl3_M"]
["Molarity of HCl in tetrachloroferrate solution","HCl_M"]
["Natural gas condensing furnace efficiency","gas_eff"]
["Natural gas non-condensing furnace efficiency","gas_non_eff"]
["Non fire Buffer for buildings","non_fire_buffer"]
["Number of bed volumes before media disposal","BV_regen"]
["Number of booster pumps","lines_pump_I"]
["Number of check valves on acid line per metering pump","acid_chv_pump"]
["Number of check valves on backwash line per backwash pump","back_chv_pump"]
["Number of check valves on bypass line","tot_bp_chv"]
["Number of check valves on bypass line for small systems","tot_bp_chv_small"]
["Number of check valves on caustic line per metering pump","caustic_chv_pump"]
["Number of check valves on influent line","tot_in_chv"]
["Number of check valves on polymer line per metering pump","polymer_chv_pump"]
["Number of check valves on regenerant line per regenerant pump","brine_chv_pump"]
["Number of check valves on residuals line if no pumping","res_chv_no_pump"]
["Number of check valves on residuals line per residuals pump","res_chv_pump"]
["Number of CPUs","plc_cpu"]
["Number of electrical enclosures","elec_encl"]
["Number of manual valves on influent and effluent line","tot_man_valves"]
["Number of manual valves on process line per vessel","proc_man_vessel"]
["Number of mechanical ventilation days per year 2nd building (large system)","fan_days_build2_large"]
["Number of mechanical ventilation days per year 2nd building (medium system)","fan_days_build2_medium"]
["Number of mechanical ventilation days per year 2nd building (small system)","fan_days_build2_small"]
["Number of mechanical ventilation days per year first building (large system)","fan_days_build1_large"]
["Number of mechanical ventilation days per year first building (medium system)","fan_days_build1_medium"]
["Number of mechanical ventilation days per year first building (small system)","fan_days_build1_small"]
["Number of redundant cartridge filters","init_NRD_cart"]
["Number of redundant polymer metering pumps","NRD_cm_pump"]
["Number of redundant vessels for small systems with multiple vessels","NRD_small"]
["Number of redundant vessels for small systems with only one vessel","NRD_small_1"]
["Number of redundant vessels to be added","NRD_I"]
["Number of shifts","shifts_day"]
["Office space per employee","space_office"]
["Office space per employee","space_office_small"]
["Operator interfaces","plc_interface"]
["ORP sensors","ORP_sensor"]
["Overexcavation for evaporation pond","ep_overexcavate"]
["Overexcavation for storage basins","overexcavate"]
["pH meters for systems with corrosion control","pH_corr"]
["pH meters for systems without corrosion control","pH_nocorr"]
["Pipe length from water source to the boundary of the 10 foot buffer","yard_in"]
["Pipe length the boundary of the 10 foot buffer to distribution network","yard_out"]
["Polymer dosage","polymer_dose"]
["Polymer sludge production factor","polymer_spf"]
["Polymer solution density","polymer_density"]
["POTW rate structure","POTW_rate_type"]
["POTW TSS discharge limit (over which fee would be imposed)","POTW_TSS_limit"]
["Pressure drop across the fan","Fan_pressure_drop"]
["Printers per x computer workstations","printer_ratio"]
["Pump efficiency for booster pumps","booster_pump_efficiency"]
["Pump head for backwash pumps","backwash_pump_head"]
["Pump head for booster pumps","booster_pump_head"]
["Ratio of  length to diameter for horizontal vessels","length_diam_ratio"]
["Recording operating paramenters for automated systems","uloe_inst_auto"]
["Reduction factor","Reduction"]
["Redundant backwash pumps","NRD_back_pumps"]
["Redundant booster pumps","NRD_pumps"]
["Redundant pumps for acid rinse (FeCl4 only)","NRD_rinse_pumps"]
["Redundant pumps for pH adjustment","NRD_pH_pumps"]
["Redundant pumps for regenerant mixing (FeCl4 only)","NRD_mix_pumps"]
["Redundant regenerant pumps","NRD_regen_pumps"]
["Redundant residuals pumps","NRD_res_pump"]
["Regenerant reuse","regen_reuse"]
["Regeneration solution (1 for brine, 2 for tetrachloroferrate)","regen_sol"]
["Residual solids storage height (for drying pad)","solids_storage_height"]
["Residual solids transfer method","res_transfer_method"]
["Residuals pump head","res_pump_psi"]
["Resin density","media_density"]
["Resin expansion during backwash","bed_expansion"]
["Resin life","resin_life"]
["Resin name","resin_name"]
["R-value for ceilings","R_ceiling"]
["R-value for walls","R_wall"]
["Safety factor for pumps","pump_safety_factor"]
["Safety factor for tetrachloroferrate mixing equipment","FeCl4_safety_factor"]
["Sales tax percentage","tax_pct"]
["Salt density","salt_density"]
["Sampling ports for bypass line","ports_bp"]
["Sampling ports per vessel","ports_tank"]
["Saturated brine concentration","brine_conc_sat"]
["Smallest size of salt saturator","min_saltbox"]
["Sodium hydroxide weight percent as delivered","NaOH_pct"]
["Soil density","soil_dens"]
["Standard oil furnace efficiency","diesel_non_eff"]
["System automation","manual_I"]
["Target Bed Depth (Designs < 1MGD)","target_bed_depth_under"]
["Target Bed Depth (Horizontal Designs)","target_bed_depth_horiz"]
["Target Bed Depth (Vertical Designs > 1 MGD)","target_bed_depth_over"]
["Technology complexity factor","complexity"]
["Technology footprint above which boreholes are needed","bore_need"]
["Temperature meters","temp_meters"]
["Temperature meters for small systems","temp_meters_small"]
["Test pit depth","pit_depth"]
["Test pit length","pit_length"]
["Test pit width","pit_width"]
["Tetrachloroferrate bed volumes","FeCl4_BV"]
["Theoretical total empty bed contact time (EBCT)","EBCT_I"]
["Time for regeneration in minutes","time_regen"]
["Time to empty holding tank","transfer_time"]
["Top and bottom dished vessel sections height and access space ","Top_bottom_Vessel_space"]
["Treated water corrosion control?","pH_adj"]
["Treated water pH","pHo"]
["Trench inside angle","trench_angle"]
["TSS in system influent","influent_TSS"]
["TSS in treated water","effluent_TSS"]
["Turbidity meters per vessel","turb_tank"]
["Turbidity meters per vessel for small systems","turb_tank_small"]
["Type of coagulant added","coag_type"]
["Underdrain space for horizontal vessels","horiz_underdrain"]
["UPSs","ups"]
["Valve table","valve_table"]
["Ventilation air change rate for chemical storage","Air_changes_chem_storage"]
["Ventilation air change rate for contactor","Air_changes_contactor"]
["Ventilation air change rate for offices","Air_changes_office"]
["Ventilation air change rate for pump room","Air_changes_pump"]
["Vessel geometry","tank_geom_I"]
["Vessel thickness of wall","Vessel_thickness"]
["Volume required as a percentage of the largest tank","sec_cont_pct_of_largest"]
["Volume required as a percentage of total storage","sec_cont_pct_of_total"]
["Volume Tolerance, horizontal vessels","vol_tol_horiz"]
["Volume Tolerance, vertical vessels <1 mgd","vol_tol_vert_small"]
["Volume Tolerance, vertical vessels >1 mgd","vol_tol_vert_med"]
["Water rinse bed volumes","rinse_BV"]
["Water rinse loading rate","rinse_rate"]

{"sheet":"INPUT","index":2,"n_rows":82,"n_cols":7,"rows_kept":82,"cut":false,"hidden":false,"merged":[[15,4,16,5],[15,6,16,6],[64,6,64,11]]}
["ANION EXCHANGE SYSTEM DESIGN AND COSTS INPUTS FOR PERCHLORATE"]
[]
[null,null,"STEP 1"]
[null,null,"Select Resin Type",null,null,{"$f":"IF(resin_type<>5,\"\",\"For alternative resin, the buttons shown in Step 2 will enter flows only, and clear all other inputs. Advanced users can change this behavior by entering inputs on the Standard Inputs sheet\")","v":""}]
[]
[null,null,"STEP 2:",null,null,{"$f":"IF(OR('Standard Inputs'!AE9,'Standard Inputs'!AE17,'Standard Inputs'!AE25,'Standard Inputs'!AE33),\"<- Using this design\",IF(OR('Standard Inputs'!AF9,'Standard Inputs'!AF17,'Standard Inputs'!AF25,'Standard Inputs'!AF33),\"<- You modified this design\",\"\"))","v":""},"The standard design buttons are for EPA's use in estimating national costs, but other users might find them useful as a starting point. See documentation for more information"]
[null,null,"Select one of the eight standard designs at right OR select \"CLEAR FOR MANUAL ENTRY\"",null,null,{"$f":"IF(OR('Standard Inputs'!AE10,'Standard Inputs'!AE18,'Standard Inputs'!AE26,'Standard Inputs'!AE34),\"<- Using this design\",IF(OR('Standard Inputs'!AF10,'Standard Inputs'!AF18,'Standard Inputs'!AF26,'Standard Inputs'!AF34),\"<- You modified this design\",\"\"))","v":""}]
[null,null,null,null,null,{"$f":"IF(OR('Standard Inputs'!AE11,'Standard Inputs'!AE19,'Standard Inputs'!AE27,'Standard Inputs'!AE35),\"<- Using this design\",IF(OR('Standard Inputs'!AF11,'Standard Inputs'!AF19,'Standard Inputs'!AF27,'Standard Inputs'!AF35),\"<- You modified this design\",\"\"))","v":""}]
[null,null,null,null,null,{"$f":"IF(OR('Standard Inputs'!AE12,'Standard Inputs'!AE20,'Standard Inputs'!AE28,'Standard Inputs'!AE36),\"<- Using this design\",IF(OR('Standard Inputs'!AF12,'Standard Inputs'!AF20,'Standard Inputs'!AF28,'Standard Inputs'!AF36),\"<- You modified this design\",\"\"))","v":""}]
[null,null,null,null,null,{"$f":"IF(OR('Standard Inputs'!AE13,'Standard Inputs'!AE21,'Standard Inputs'!AE29,'Standard Inputs'!AE37),\"<- Using this design\",IF(OR('Standard Inputs'!AF13,'Standard Inputs'!AF21,'Standard Inputs'!AF29,'Standard Inputs'!AF37),\"<- You modified this design\",\"\"))","v":""}]
[null,null,null,null,null,{"$f":"IF(OR('Standard Inputs'!AE14,'Standard Inputs'!AE22,'Standard Inputs'!AE30,'Standard Inputs'!AE38),\"<- Using this design\",IF(OR('Standard Inputs'!AF14,'Standard Inputs'!AF22,'Standard Inputs'!AF30,'Standard Inputs'!AF38),\"<- You modified this design\",\"\"))","v":""}]
[null,null,null,null,null,{"$f":"IF(OR('Standard Inputs'!AE15,'Standard Inputs'!AE23,'Standard Inputs'!AE31,'Standard Inputs'!AE39),\"<- Using this design\",IF(OR('Standard Inputs'!AF15,'Standard Inputs'!AF23,'Standard Inputs'!AF31,'Standard Inputs'!AF39),\"<- You modified this design\",\"\"))","v":""}]
[null,null,null,null,null,{"$f":"IF(OR('Standard Inputs'!AE16,'Standard Inputs'!AE24,'Standard Inputs'!AE32,'Standard Inputs'!AE40),\"<- Using this design\",IF(OR('Standard Inputs'!AF16,'Standard Inputs'!AF24,'Standard Inputs'!AF32,'Standard Inputs'!AF40),\"<- You modified this design\",\"\"))","v":"<- Using this design"}]
[null,null,null,null,null,{"$f":"IF(COUNTIF(F6:F13,\"\")=8,\"Using a manual design\",\"\")","v":""},{"$f":"IF(COUNTIF(F6:F13,\"\")=8,\"Fill in all gold cells below, then consider using AutoSize button\",\"\")","v":""}]
[null,null,"STEP 3:"]
[null,null,"(Optional for standard designs)",null,{"$f":"IF(input_complete,IF('Standard Inputs'!AE51,\"Input Complete -- Results Ready\",\"Input Complete -- Press 'Generate Results'\"),\"Input Incomplete -- Check for Error Messages Below\")","v":"Input Complete -- Results Ready"},null,{"$f":"IF(AND(B50,B52,B51,B53,B55),\"\",\"Fill in all gold cells below. If errors persist, consider using AutoSize button.\")","v":""}]
[null,{"$f":"AND(B32,B36,B50,B51,B52,B53,B55,B63,B81)","v":true},"Enter or change values in the gold and blue cells below, under \"Manual Inputs\""]
[]
[null,null,"STEP 4:",null,null,null,"Results summary (see OUTPUT sheet for details)"]
[null,null,{"$f":"IF(E16=\"input complete -- results ready\",\"Results are ready (no need to click button)\",\"Click here to generate results -->\")","v":"Results are ready (no need to click button)"},null,null,null,{"$f":"\"Direct Capital Cost: \"&IF(input_status<>\"input complete -- results ready\",input_status,IF(Missing_Cost,\"Missing cost!\",IF(cost_buildup_error,\"Cost buildup error!\",IF(ISERROR(direct_cost),\"Calculation error!\",TEXT(direct_cost,\"$0,0\")))))","v":"Direct Capital Cost: $14,796,279"}]
[null,null,null,null,null,null,{"$f":"\"Total Capital Cost: \" & IF(input_status<>\"input complete -- results ready\",input_status,IF(Missing_Cost,\"Missing cost!\",IF(cost_buildup_error,\"Cost buildup error!\",IF(ISERROR(system_cost),\"Calculation error!\",TEXT(system_cost,\"$0,0\")))))","v":"Total Capital Cost: $21,756,278"}]
[null,null,null,null,null,null,{"$f":"\"Annualized Capital Cost: \"&IF(input_status<>\"Input Complete -- Results Ready\",input_status,IF(Missing_Cost,\"Missing Price!\",IF(cost_buildup_error,\"Cost buildup error!\",IF(ISERROR(Annualized_Capital_Cost),\"Calculation error!\",TEXT(Annualized_Capital_Cost,\"$0,0\")&\" per year\"&\" (over \"&useful_life&\" years at \"&Discount_rate*100&\"%)\"))))","v":"Annualized Capital Cost: $1,685,101 per year (over 34.6 years at 7%)"}]
[null,null,null,null,null,null,{"$f":"\"Annual O&M Cost: \"&IF(input_status<>\"Input Complete -- Results Ready\",input_status,IF(ISERROR(OM_cost),\"Calculation error!\",TEXT(OM_cost,\"$0,0\")&\" per year\"))","v":"Annual O&M Cost: $3,307,458 per year"}]
[null,null,"MANUAL INPUTS",null,null,null,{"$f":"\"Total Annualized Cost: \"&IF(input_status<>\"input complete -- results ready\",input_status,IF(Missing_Cost,\"Missing Price!\",IF(cost_buildup_error,\"Cost buildup error!\",IF(ISERROR(Annualized_Cost),\"Calculation error!\",TEXT(Annualized_Cost,\"$0,0\")&\" per year\"))))","v":"Total Annualized Cost: $4,992,559 per year"}]
[null,null,"Cells in gold are required; cells in blue are optional",null,null,null,{"$f":"IF(Missing_Cost,\"A price is not available for at least one required component. See Use? column on OUTPUT sheet.\",IF(cost_buildup_error,\"There is an Excel error in the price for at least one component. Please see the Use? column on OUTPUT sheet.\",\"\"))","v":""}]
[null,null,null,null,null,"Select units"]
[null,null,"Design Flow","design_flow_I",75.072000000000003,"MGD"]
[null,null,"Average Flow","average_flow_I",37.536000000000001,"MGD"]
[null,null,"For information:"]
[null,null,"Treatment system design flow",null,{"$f":"IF(ISERROR(design_flow),\"\",IF(df_units=\"gpm\",design_flow_rate, design_flow))","v":75.072000000000003},{"$f":"df_units","v":"MGD"},{"$f":"\"Current bypass percentage is \"&TEXT(bp_pct,\"0%\")&\".  Go to Critical Design Assumptions to change this value.\"","v":"Current bypass percentage is 0%.  Go to Critical Design Assumptions to change this value."}]
[null,null,"Bypass design flow",null,{"$f":"IF(ISERROR(design_flow),\"\",IF(df_units=\"gpm\",bp_flow_rate, bp_flow_rate*60*24/10^6))","v":0},{"$f":"df_units","v":"MGD"},"Adjust bypass percentage"]
[null,{"$f":"IF(F32=\"Flow Input OK\",TRUE)","v":true},null,null,null,{"$f":"IF(OR(df_units=\"\",af_units=\"\"),\"Choose units for design and average flow\",IF(average_flow>design_flow,\"The average flow should not be greater than the design flow\",IF(OR(design_flow_I=0,average_flow_I=0),\"Input incomplete\",IF(average_flow<design_flow*min_avg_flow,\"The average flow must be at least \" & min_avg_flow & \" times design flow\",\"Flow Input OK\"))))","v":"Flow Input OK"}]
[]
[null,null,"Media regeneration or throwaway operation?","throwaway_I","throwaway","<-- pick one"]
[null,null,{"$f":"\"Number of bed volumes before \"&IF(regen_type=1,\"regeneration\",\"media disposal\")","v":"Number of bed volumes before media disposal"},"BV_regen",250000,"bed volumes","Important: bed volumes vary based on water quality and system configuration.  Select data for input carefully, based on the scenario being modeled."]
[null,{"$f":"IF(F36=\"Regeneration Input OK\",TRUE)","v":true},null,null,null,{"$f":"IF(OR(throwaway_I=\"\",BV_regen=0),\"Input incomplete\",\"Regeneration Input OK\")","v":"Regeneration Input OK"}]
[]
[null,null,"Minimum number of vessels in series (i.e., parallel or series operation)","num_tanks_I",2,"<-- enter 1 for parallel, 2 or more for series"]
[null,null,"Theoretical total empty bed contact time (EBCT)","EBCT_I",3,"minutes"]
[null,null,"For information: EBCT per Vessel",null,{"$f":"IF(ISERROR(EBCT_tank),\"\",EBCT_tank)","v":1.5},"minutes"]
[null,null,"The next four inputs may be entered manually, or calculated with Auto Size button"]
[null,null,"Bed depth","bed_depth",2.4,"feet"]
[null,null,"Vessel geometry","tank_geom_I","horizontal","<-- pick one"]
[null,null,{"$f":"IF(tank_geom=1,\"Height (straight)\",IF(tank_geom=2,\"Length (straight)\",\"\"))","v":"Length (straight)"},"comm_height_length",34,{"$f":"IF(tank_geom<>\"\",\"feet\",\"\")","v":"feet"}]
[null,null,"Diameter","comm_diam",10,{"$f":"IF(tank_geom<>\"\",\"feet\",\"\")","v":"feet"}]
[null,null,"For information:  "]
[null,null,"Number of treatment trains",null,{"$f":"IF(ISERROR(num_treat_lines),\"\",num_treat_lines)","v":13},"trains"]
[null,null,"Number of operating vessels",null,{"$f":"IF(ISERROR(op_num_tanks),\"\",op_num_tanks)","v":26},"vessels"]
[null,null,"Total vessels (incl. redundancy, below)",null,{"$f":"IF(ISERROR(final_num_tanks),\"\",final_num_tanks)","v":30},"vessels"]
[null,{"$f":"IF(F50=\"bed depth ok\",TRUE)","v":true},null,null,null,{"$f":"IF(OR(num_tanks_I=\"\",EBCT_I=\"\",bed_depth=\"\",comm_height_length=\"\",comm_diam=\"\",tank_geom_I=\"\"),\"Input incomplete\",IF(bed_depth>max_bed_depth,\"Warning: bed depth too great\",IF(bed_depth>2*comm_diam,\"Warning: bed depth should be less than twice the vessel diameter\",IF(bed_depth<min_bed_depth,\"Warning: bed depth too shallow\",\"Bed Depth OK\"))))","v":"Bed Depth OK"},"Adjust bed depth constraints"]
[null,{"$f":"IF(OR(F51=\"height ok\",F51=\"length ok\"),TRUE)","v":true},null,null,null,{"$f":"IF(F50=\"Input incomplete\",\"\",IF(tank_geom=1,IF(IF(AND(comm_diam>=min_diam,comm_diam<=max_diam_std_size),(OR(comm_height_length>=max_comm_height,comm_height_length>max_height)),comm_height_length>max_height),\"Warning: vessel too high\",IF(IF(AND(comm_diam>=min_diam,comm_diam<=max_diam_std_size),(AND(comm_height_length>=min_comm_height,comm_height_length>=height)),comm_height_length>=height),\"Height OK\",\"Warning: vessel not high enough\")),IF(tank_geom=2,IF(comm_height_length>max_length,\"Warning: vessel too long\",\"Length OK\"),\"Invalid tank geometry input\")))","v":"Length OK"},"Adjust vessel size constraints"]
[null,{"$f":"IF(F52=\"diameter ok\",TRUE)","v":true},null,null,null,{"$f":"IF(F50=\"Input incomplete\",\"\",IF(tank_geom=1,IF(comm_diam>max_diam,\"Warning: vessel diameter too great\",IF(comm_diam<diameter,\"Warning: vessel diameter too small\",\"Diameter OK\")),IF(tank_geom=2,IF(comm_diam>max_diam,\"Warning: vessel diameter too great\",IF(comm_diam>max_height,\"Warning: vessel diameter too great\",IF(comm_SA<SA,\"Warning: vessel surface area too small\",IF(comm_diam<height,\"Warning: vessel diameter too small\",\"Diameter OK\")))),\"\")))","v":"Diameter OK"}]
[null,{"$f":"IF(F53=\"volume ok\",TRUE)","v":true},null,null,null,{"$f":"IF(F50=\"Input incomplete\",\"\",IF(input_vol_vess<media_volume_expanded,\"Warning: vessel too small for this bed depth\",\"Volume OK\"))","v":"Volume OK"}]
[null,null,null,null,null,{"$f":"IF(F50=\"Input incomplete\",\"\",IF(input_vol_vess<media_volume_expanded,CHOOSE(tank_geom,\"Hint: reduce bed depth or increase diameter or height\",\"Hint: reduce bed depth or increase diameter\"),\"\"))","v":""}]
[null,{"$f":"IF(F55=\"loading ok\",TRUE)","v":true},null,null,null,{"$f":"IF(F50=\"Input incomplete\",\"\",IF(tank_geom=1,IF(comm_load_rate>load_max,\"Warning: design exceeds maximum loading\",IF(comm_load_rate<load_min,\"Warning: design below minimum loading\",\"Loading OK\")),IF(comm_load_rate>load_max,\"Warning: design exceeds maximum loading\",IF(comm_load_rate<load_min,\"Warning: design below minimum loading\",\"Loading OK\"))))","v":"Loading OK"},"Adjust loading constraints"]
[null,null,null,null,null,{"$f":"IF(F50=\"Input incomplete\",\"\",IF(tank_geom=1,IF(comm_load_rate>load_max,\"Hint: increase vessel diameter or decrease bed depth\",IF(comm_load_rate<load_min,\"Hint: reduce vessel diameter or increase bed depth\",\"\")),IF(comm_load_rate>load_max,\"Hint: increase vessel length and diameter or decrease bed depth\",IF(comm_load_rate<load_min,\"Hint: reduce vessel length and diameter or increase bed depth\",\"\"))))","v":""}]
[]
[null,null,"Brine delivery method","brine_method_I",null,{"$f":"IF(OR(regen_type=2,AND(regen_type=1,regen_sol=2)),\"not required\",\"<-- pick one\")","v":"not required"}]
[null,null,{"$f":"\"Discharge option for \"&IF(regen_type=2,\"spent backwash/rinse\",\"spent regenerant\")","v":"Discharge option for spent backwash/rinse"},"res_s2_opt_I","POTW","<-- pick one"]
[null,null,{"$f":"\"Holding tank for \"&IF(regen_type=2,\"spent backwash/rinse\",\"spent regenerant\")","v":"Holding tank for spent backwash/rinse"},"res_s1_opt_I","no holding tank",{"$f":"IF(res_s2_opt=3,\"not required\",IF(res_s2_opt=4,\"required\",\"<--pick one\"))","v":"<--pick one"},{"$f":"IF(res_s1_opt_I=\"Holding tank\",\"Model selects between holding tank or basin based upon priority lookups on the Output sheet\",\"\")","v":""}]
[null,null,"Characteristics of spent resin","media_haz_I","non-hazardous","<-- pick one"]
[null,null,{"$f":"IF(res_s2_opt=3,\"Characteristics of evaporation pond solids\",\"Characteristics of holding tank solids\")","v":"Characteristics of holding tank solids"},"solids_haz_I",null,{"$f":"IF(OR(res_s1_opt=2,res_s2_opt=2),\"not required\",\"<-- pick one\")","v":"not required"}]
[null,{"$f":"IF(F63=\"Residuals Input OK\",TRUE)","v":true},null,null,null,{"$f":"IF(OR(media_haz_I=\"\",AND(AND(regen_type=1,regen_sol=1),brine_method_I=\"\"),res_s2_opt_I=\"\",AND(res_s2_opt<>3,res_s1_opt_I=\"\"),AND(res_s1_opt<>2,solids_haz_I=\"\")),\"Input incomplete\",\"Residuals Input OK\")","v":"Residuals Input OK"}]
[]
[null,null,"Number of booster pumps","lines_pump_I",null,"pumps","Enter 0 to exclude booster pumps (i.e., use existing pumps). Clear cell to accept model defaults (no pumps for systems <1 MGD, otherwise sized per average and design flows)"]
[null,null,"For information: # of booster pumps",null,{"$f":"IF(ISERROR(booster_pumps),\"\",booster_pumps)","v":7},"pumps"]
[null,null,"Number of redundant vessels to be added","NRD_I",null,"units","Leave blank to accept redundancy frequency specified in critical design assumptions"]
[null,null,"For information: Redundant vessels",null,{"$f":"IF(ISERROR(NRD),\"\",NRD)","v":4}]
[null,null,"Treated water corrosion control?","pH_adj",null,"<-- pick or leave blank","Leave blank to exclude pH adjustment for corrosion control"]
[null,null,"Backwash/Rinse Pumping","no_backwash_I",null,"<-- pick or leave blank","Leave blank to accept model defaults (systems <1 MGD backwash using existing supply or treated water pumps, other systems add new backwash pumps)"]
[null,null,"Backwash/Rinse Storage","no_back_tank_I",null,"<-- pick or leave blank","Leave blank to accept model defaults (only systems between 1 and 10 MGD require separate backwash tanks)"]
[null,null,"For information: # of backwash pumps",null,{"$f":"IF(ISERROR(backwash_pumps),\"\",backwash_pumps)","v":2},"units"]
[null,null,"# of backwash tanks",null,{"$f":"IF(ISERROR(back_tanks),\"\",back_tanks)","v":0},"units"]
[null,null,"Component level","component_level_I",null,"<-- pick or leave blank","Leave blank to use low cost components"]
[null,null,"System automation","manual_I","fully automated","<-- pick or leave blank","Leave blank to allow model to pick based on component level"]
[null,null,"Include buildings?","include_buildings_I",null,"<-- pick or leave blank","Leave blank to include buildings"]
[null,null,"Include HVAC?","include_HVAC_I",null,"<-- pick or leave blank","Leave blank to allow model to pick based on component level and building type"]
[null,null,"Include land?","include_land_I",null,"<-- pick or leave blank","Leave blank to include land"]
[null,null,"For information: Component level",null,{"$f":"IF(component_level=2,\"high cost\",IF(component_level=1,\"mid cost\",\"low cost\"))","v":"low cost"}]
[null,null,"Automation",null,{"$f":"IF(manual=1,\"manual\",IF(manual=2,\"semi-automated\",IF(manual=3,\"fully automated\")))","v":"fully automated"}]
[null,{"$f":"IF(F81=\"Optional Inputs OK\",TRUE)","v":true},null,null,null,{"$f":"IF(ISERROR(pump_rating),\"Input incomplete\",IF(pump_rating>max_pump_size,\"Warning: insufficent number of pumps.\",\"Optional Inputs OK\"))","v":"Optional Inputs OK"}]
[null,null,null,null,null,{"$f":"IF(OR(F81=\"input incomplete\",F81=\"Optional Inputs OK\"),\"\",IF(pump_rating>max_pump_size,\"Hint: increase number of pumps or leave that input blank\",\"\"))","v":""}]

{"sheet":"OUTPUT","index":3,"n_rows":474,"n_cols":25,"rows_kept":474,"cut":false,"hidden":false,"merged":[[28,0,30,0],[28,1,30,1],[28,2,30,3],[28,13,28,21],[28,22,29,23],[28,12,30,12],[392,8,392,11],[388,2,388,3],[28,11,30,11],[388,4,388,5],[28,4,30,5],[28,6,30,7],[28,8,30,8],[28,9,30,9],[28,10,30,10]]}
["OUTPUT SUMMARY"]
[null,"Parameter","Value","Units"]
[null,"Technology Name","AX"]
[null,"System Size Category",{"$f":"IF(design_flow<1,\"small\",\"large\")","v":"large"}]
[null,"Resin type",{"$f":"VLOOKUP(resin_type,resin_type_table,2)","v":"Perchlorate-selective"}]
[null,"Design Flow",{"$f":"design_flow","v":75.072000000000003},"MGD (excludes bypass flow)"]
[null,"Average Flow",{"$f":"average_flow","v":37.536000000000001},"MGD (excludes bypass flow)"]
[null,"# of treatment trains",{"$f":"num_treat_lines","v":13},"trains"]
[null,"# of vessels in series",{"$f":"Num_tanks","v":2},"(i.e., parallel or series operation)"]
[null,"Total EBCT",{"$f":"EBCT","v":3},"minutes"]
[null,"EBCT per vessel",{"$f":"EBCT_tank","v":1.5},"minutes"]
[null,"Bed depth",{"$f":"bed_depth","v":2.4},"feet"]
[null,"Vessel geometry",{"$f":"tank_geom_I","v":"horizontal"}]
[null,{"$f":"IF(tank_geom=1,\"Height (straight)\",IF(tank_geom=2,\"Length (straight)\",\"\"))","v":"Length (straight)"},{"$f":"comm_height_length","v":34},"feet"]
[null,"Diameter",{"$f":"comm_diam","v":10},"feet"]
[null,{"$f":"\"Resulting Costs (in year \"&TEXT(current_year_cl,0)&\" dollars)\"","v":"Resulting Costs (in year 2017 dollars)"}]
[null,"Direct Capital Cost",{"$f":"IF(input_status<>\"input complete -- results ready\",\"Action required\",IF(Missing_Cost,\"Missing cost!\",IF(cost_buildup_error,\"Error in buildup!\",direct_cost)))","v":14796279.383619362},"Details",{"$f":"IF(input_status<>\"input complete -- results ready\",IF(input_complete,\"Press Generate Results\",\"Check INPUT sheet for errors\"),IF(Missing_Cost,\"A price is not available for at least one required component. See Use? column below.\",IF(cost_buildup_error,\"There is an Excel error in the price for at least one component. See Use? column below.\",\"\")))","v":""}]
[null,"Add-on Cost",{"$f":"IF(input_status<>\"input complete -- results ready\",\"Action required\",addon_cost)","v":179759.51130697236},"Details"]
[null,"Indirect Capital Cost",{"$f":"IF(input_status<>\"input complete -- results ready\",\"Action required\",indirect_cost)","v":6780239.3423384391},"Details"]
[null,"Total Capital Cost",{"$f":"IF(input_status<>\"input complete -- results ready\",\"Action required\",IF(Missing_Cost,\"Missing cost!\",IF(cost_buildup_error,\"Error in buildup!\",system_cost)))","v":21756278.237264775},"Details"]
[null,{"$f":"\"Annualized Capital Cost \"&IF(OR(input_status<>\"input complete -- results ready\",Missing_Cost,cost_buildup_error),\"\",\"(per year over \"&useful_life&\" years at \"&Discount_rate*100&\"%)\")","v":"Annualized Capital Cost (per year over 34.6 years at 7%)"},{"$f":"IF(input_status<>\"input complete -- results ready\",\"Action required\",Annualized_Capital_Cost)","v":1685100.7574088592},"Details"]
[null,"Annual O&M Cost (per year)",{"$f":"IF(input_status<>\"input complete -- results ready\",\"Action required\",OM_cost)","v":3307458.3289217763},"Details"]
[null,{"$f":"\"Total Annualized Cost (per year)\"","v":"Total Annualized Cost (per year)"},{"$f":"IF(input_status<>\"input complete -- results ready\",\"Action required\",IF(Missing_Cost,\"Missing cost!\",IF(cost_buildup_error,\"Error in buildup!\",Annualized_Cost)))","v":4992559.0863306355},"Details"]
[null,"Per 1,000 gallons average flow",{"$f":"IF(input_status<>\"input complete -- results ready\",\"Action required\",IF(Missing_Cost,\"Missing cost!\",IF(cost_buildup_error,\"Error in buildup!\",C447)))","v":0.36440334804291147}]
[null,"Per household per year",{"$f":"IF(input_status<>\"input complete -- results ready\",\"Action required\",IF(Missing_Cost,\"Missing cost!\",IF(cost_buildup_error,\"Error in buildup!\",C448)))","v":60.609011337225098}]
[]
[]
["Direct Capital Cost Details (items in italics, without a 1 in the \"Use?\" column, represent alternate costs and are excluded from total)"]
["WBS #","Item","Design Quanitity",null,"Design Size",null,"Size used in estimate",null,"Unit Cost","Total Cost","Useful Life","Use?","Full Line Item Name","Baseline priority selection",null,null,null,null,null,null,null,null,"Useful Life"]
[null,null,null,null,null,null,null,null,null,null,null,null,null,"Small (<1 mgd)",null,null,"Medium (1-10 mgd)",null,null,"Large (>10 mgd)"]
[null,null,null,null,null,null,null,null,null,null,null,null,null,"Low","Typical","High","Low","Typical","High","Low","Typical","High","Count?","Depreciation"]
[1,"Pressure Vessels"]
[1.1000000000000001,"Stainless Steel",{"$f":"final_num_tanks","v":30},"units",{"$f":"comm_vol_gal","v":19974.246091523906},"gal",{"$f":"IF(curve=1,comm_vol_gal,VLOOKUP(comm_vol_gal,ss_pv_cost_cl,2))","v":19974.246091523906},"gal",{"$f":"IF(curve=1,ss_pv_eq,VLOOKUP(comm_vol_gal,ss_pv_cost_cl,3))","v":278631.6185616781},{"$f":"IF(I33=\"contact vendor\",\"--\",C33*I33)","v":8358948.556850343},{"$f":"VLOOKUP(comm_vol_gal,ss_pv_cost_cl,IF(ss_cat=\"large\",4,5))","v":35},0,{"$f":"$B$32&\" - \"&B33","v":"Pressure Vessels - Stainless Steel"},4,4,1,4,4,1,4,4,1,{"$f":"IF(ISERROR(K33*L33),0,IF(K33<1,0,L33))","v":0},{"$f":"IF(W33,J33/K33,0)","v":0}]
[1.1000000000000001,"Carbon Steel - Stainless Internals",{"$f":"final_num_tanks","v":30},"units",{"$f":"comm_vol_gal","v":19974.246091523906},"gal",{"$f":"IF(curve=1,comm_vol_gal,VLOOKUP(comm_vol_gal,cs_pv_cost_cl,2))","v":19974.246091523906},"gal",{"$f":"IF(curve=1,cs_pv_eq,VLOOKUP(comm_vol_gal,cs_pv_cost_cl,3))","v":191016.79735363959},{"$f":"IF(I34=\"contact vendor\",\"--\",C34*I34)","v":5730503.9206091873},{"$f":"VLOOKUP(comm_vol_gal,cs_pv_cost_cl,IF(ss_cat=\"large\",4,5))","v":35},0,{"$f":"$B$32&\" - \"&B34","v":"Pressure Vessels - Carbon Steel - Stainless Internals"},3,3,2,3,3,2,3,3,2,0,0]
[1.1000000000000001,"Carbon Steel - Plastic Internals",{"$f":"final_num_tanks","v":30},"units",{"$f":"comm_vol_gal","v":19974.246091523906},"gal",{"$f":"IF(curve=1,comm_vol_gal,VLOOKUP(comm_vol_gal,csp_pv_cost_cl,2))","v":19974.246091523906},"gal",{"$f":"IF(curve=1,csp_pv_eq,VLOOKUP(comm_vol_gal,csp_pv_cost_cl,3))","v":108788.34939962468},{"$f":"IF(I35=\"contact vendor\",\"--\",C35*I35)","v":3263650.4819887406},{"$f":"VLOOKUP(comm_vol_gal,csp_pv_cost_cl,IF(ss_cat=\"large\",4,5))","v":35},1,{"$f":"$B$32&\" - \"&B35","v":"Pressure Vessels - Carbon Steel - Plastic Internals"},2,1,3,2,1,3,2,1,3,1,93247.156628249737]
[1.1000000000000001,"Fiberglass",{"$f":"final_num_tanks","v":30},"units",{"$f":"comm_vol_gal","v":19974.246091523906},"gal",{"$f":"IF(curve=1,comm_vol_gal,VLOOKUP(comm_vol_gal,fg_pv_cost_cl,2))","v":19974.246091523906},"gal",{"$f":"IF(curve=1,fg_pv_eq,VLOOKUP(comm_vol_gal,fg_pv_cost_cl,3))","v":"contact vendor"},{"$f":"IF(I36=\"contact vendor\",\"--\",C36*I36)","v":"--"},{"$f":"VLOOKUP(comm_vol_gal,fg_pv_cost_cl,IF(ss_cat=\"large\",4,5))","v":25},0,{"$f":"$B$32&\" - \"&B36","v":"Pressure Vessels - Fiberglass"},1,2,4,1,2,4,1,2,4,0,0]
[2,"Ion Exchange Resin",null,null,null,null,null,null,null,null,null,null,null,null,null,null,null,null,null,null,null,null,0,0]
[2.1,{"$f":"VLOOKUP(\"resin_name\",resin_table,resin_type+1,FALSE)","v":"Perchlorate-selective"},{"$f":"resin_volume_total","v":24480},"cf","NA",null,"NA",null,{"$f":"IF(resin_type=5,VLOOKUP(\"resin_unit_cost\",resin_table,resin_type+1,FALSE),VLOOKUP(B38,an_ClO4_cost_cl,3,FALSE))","v":242.38451871703288},{"$f":"IF(I38=\"contact vendor\",\"--\",C38*I38)","v":5933573.0181929646},{"$f":"VLOOKUP(B38,an_ClO4_cost_cl,IF(ss_cat=\"large\",4,5),FALSE)","v":"N/A"},1,{"$f":"$B$37&\" - \"&B38","v":"Ion Exchange Resin - Perchlorate-selective"},1,1,1,1,1,1,1,1,1,0,0]
[3,"Tanks",null,null,null,null,null,null,null,null,null,null,null,null,null,null,null,null,null,null,null,null,0,0]
[3.1,"Backwash/Rinse Tanks",null,null,null,null,null,null,null,null,null,null,null,null,null,null,null,null,null,null,null,null,0,0]
["3.1.1","Steel",{"$f":"back_tanks","v":0},"units",{"$f":"IF(back_tanks=0,\"NA\",back_tank_vol)","v":"NA"},{"$f":"IF(back_tanks=0,\"\",\"gal\")","v":""},{"$f":"IF(back_tanks=0,\"NA\",IF(curve=1,back_tank_vol,VLOOKUP(back_tank_vol,st_bwt_cost_cl,2)))","v":"NA"},{"$f":"IF(back_tanks=0,\"\",\"gal\")","v":""},{"$f":"IF(back_tanks=0,\"NA\",IF(curve=1,st_bwt_eq,VLOOKUP(back_tank_vol,st_bwt_cost_cl,3)))","v":"NA"},{"$f":"IF(back_tanks=0,\"--\",IF(I41=\"contact vendor\",\"--\",C41*I41))","v":"--"},{"$f":"IF(back_tanks=0,\"NA\",VLOOKUP(back_tank_vol,st_bwt_cost_cl,IF(ss_cat=\"large\",4,5)))","v":"NA"},null,{"$f":"$B$40&\" - \"&B41","v":"Backwash/Rinse Tanks - Steel"},3,3,1,3,3,1,3,3,1,0,0]
["3.1.1","Fiberglass",{"$f":"back_tanks","v":0},"units",{"$f":"IF(back_tanks=0,\"NA\",back_tank_vol)","v":"NA"},{"$f":"IF(back_tanks=0,\"\",\"gal\")","v":""},{"$f":"IF(back_tanks=0,\"NA\",IF(curve=1,back_tank_vol,VLOOKUP(back_tank_vol,fg_bwt_cost_cl,2)))","v":"NA"},{"$f":"IF(back_tanks=0,\"\",\"gal\")","v":""},{"$f":"IF(back_tanks=0,\"NA\",IF(curve=1,fg_bwt_eq,VLOOKUP(back_tank_vol,fg_bwt_cost_cl,3)))","v":"NA"},{"$f":"IF(back_tanks=0,\"--\",IF(I42=\"contact vendor\",\"--\",C42*I42))","v":"--"},{"$f":"IF(back_tanks=0,\"NA\",VLOOKUP(back_tank_vol,fg_bwt_cost_cl,IF(ss_cat=\"large\",4,5)))","v":"NA"},null,{"$f":"$B$40&\" - \"&B42","v":"Backwash/Rinse Tanks - Fiberglass"},2,1,2,2,1,2,2,1,2,0,0]
["3.1.1","Plastic/HDPE",{"$f":"back_tanks","v":0},"units",{"$f":"IF(back_tanks=0,\"NA\",back_tank_vol)","v":"NA"},{"$f":"IF(back_tanks=0,\"\",\"gal\")","v":""},{"$f":"IF(back_tanks=0,\"NA\",IF(curve=1,back_tank_vol,VLOOKUP(back_tank_vol,hdpe_bwt_cost_cl,2)))","v":"NA"},{"$f":"IF(back_tanks=0,\"\",\"gal\")","v":""},{"$f":"IF(back_tanks=0,\"NA\",IF(curve=1,hdpe_bwt_eq,VLOOKUP(back_tank_vol,hdpe_bwt_cost_cl,3)))","v":"NA"},{"$f":"IF(back_tanks=0,\"--\",IF(I43=\"contact vendor\",\"--\",C43*I43))","v":"--"},{"$f":"IF(back_tanks=0,\"NA\",VLOOKUP(back_tank_vol,hdpe_bwt_cost_cl,IF(ss_cat=\"large\",4,5)))","v":"NA"},null,{"$f":"$B$40&\" - \"&B43","v":"Backwash/Rinse Tanks - Plastic/HDPE"},1,2,3,1,2,3,1,2,3,0,0]
[3.2,"Regenerant Mixing Tanks",null,null,null,null,null,null,null,null,null,null,null,null,null,null,null,null,null,null,null,null,0,0]
["3.2.1","Plastic/XLPE",{"$f":"mix_tanks","v":0},"units",{"$f":"IF(mix_tanks=0,\"NA\",mix_tank_vol)","v":"NA"},{"$f":"IF(mix_tanks=0,\"\",\"gal\")","v":""},{"$f":"IF(mix_tanks=0,\"NA\",IF(curve=1,mix_tank_vol,VLOOKUP(mix_tank_vol,pl_cst_cost_cl,2)))","v":"NA"},{"$f":"IF(mix_tanks=0,\"\",\"gal\")","v":""},{"$f":"IF(mix_tanks=0,\"NA\",IF(curve=1,pl_cst_eq,VLOOKUP(mix_tank_vol,pl_cst_cost_cl,3)))","v":"NA"},{"$f":"IF(mix_tanks=0,\"--\",IF(I45=\"contact vendor\",\"--\",C45*I45))","v":"--"},{"$f":"IF(mix_tanks=0,\"NA\",VLOOKUP(mix_tank_vol,pl_cst_cost_cl,IF(ss_cat=\"large\",4,5)))","v":"NA"},null,{"$f":"$B$44&\" - \"&B45","v":"Regenerant Mixing Tanks - Plastic/XLPE"},1,2,3,1,2,3,1,2,3,0,0]
["3.2.1","Fiberglass",{"$f":"mix_tanks","v":0},"units",{"$f":"IF(mix_tanks=0,\"NA\",mix_tank_vol)","v":"NA"},{"$f":"IF(mix_tanks=0,\"\",\"gal\")","v":""},{"$f":"IF(mix_tanks=0,\"NA\",IF(curve=1,mix_tank_vol,VLOOKUP(mix_tank_vol,fg_cst_cost_cl,2)))","v":"NA"},{"$f":"IF(mix_tanks=0,\"\",\"gal\")","v":""},{"$f":"IF(mix_tanks=0,\"NA\",IF(curve=1,fg_cst_eq,VLOOKUP(mix_tank_vol,fg_cst_cost_cl,3)))","v":"NA"},{"$f":"IF(mix_tanks=0,\"--\",IF(I46=\"contact vendor\",\"--\",C46*I46))","v":"--"},{"$f":"IF(mix_tanks=0,\"NA\",VLOOKUP(mix_tank_vol,fg_cst_cost_cl,IF(ss_cat=\"large\",4,5)))","v":"NA"},null,{"$f":"$B$44&\" - \"&B46","v":"Regenerant Mixing Tanks - Fiberglass"},2,1,2,2,1,2,2,1,2,0,0]
["3.2.1","Stainless Steel",{"$f":"mix_tanks","v":0},"units",{"$f":"IF(mix_tanks=0,\"NA\",mix_tank_vol)","v":"NA"},{"$f":"IF(mix_tanks=0,\"\",\"gal\")","v":""},{"$f":"IF(mix_tanks=0,\"NA\",IF(curve=1,mix_tank_vol,VLOOKUP(mix_tank_vol,ss_cst_cost_cl,2)))","v":"NA"},{"$f":"IF(mix_tanks=0,\"\",\"gal\")","v":""},{"$f":"IF(mix_tanks=0,\"NA\",IF(curve=1,ss_cst_eq,VLOOKUP(mix_tank_vol,ss_cst_cost_cl,3)))","v":"NA"},{"$f":"IF(mix_tanks=0,\"--\",IF(I47=\"contact vendor\",\"--\",C47*I47))","v":"--"},{"$f":"IF(mix_tanks=0,\"NA\",VLOOKUP(mix_tank_vol,ss_cst_cost_cl,IF(ss_cat=\"large\",4,5)))","v":"NA"},null,{"$f":"$B$44&\" - \"&B47","v":"Regenerant Mixing Tanks - Stainless Steel"},3,3,1,3,3,1,3,3,1,0,0]
["3.2.2","Secondary Containment - Concrete Curbing",{"$f":"IF(OR(include_sec_cont=0,mix_tanks=0),0,mix_curb_concrete)","v":0},"cy","NA",null,"NA",null,{"$f":"IF(C48=0,\"NA\",VLOOKUP(0,conc_basin_cost_cl,3))","v":"NA"},{"$f":"IF(C48=0,\"--\",IF(I48=\"contact vendor\",\"--\",C48*I48))","v":"--"},{"$f":"IF(C48=0,\"NA\",VLOOKUP(0,conc_basin_cost_cl,IF(ss_cat=\"large\",4,5)))","v":"NA"},null,{"$f":"$B$44&\" - \"&B48","v":"Regenerant Mixing Tanks - Secondary Containment - Concrete Curbing"},1,1,1,1,1,1,1,1,1,{"$f":"IF(ISERROR(K48*L48),0,IF(K48<1,0,L48))","v":0},{"$f":"IF(W48,J48/K48,0)","v":0}]
["3.2.3","Secondary Containment - Chemical Resistant Coating",{"$f":"IF(OR(include_sec_cont=0,mix_tanks=0),0,mix_coating_gal)","v":0},"gal","NA",null,"NA",null,{"$f":"IF(C49=0,\"NA\",VLOOKUP(0,conc_coating_cost_cl,3))","v":"NA"},{"$f":"IF(C49=0,\"--\",IF(I49=\"contact vendor\",\"--\",C49*I49))","v":"--"},{"$f":"IF(C49=0,\"NA\",VLOOKUP(0,conc_coating_cost_cl,IF(ss_cat=\"large\",4,5)))","v":"NA"},null,{"$f":"$B$44&\" - \"&B49","v":"Regenerant Mixing Tanks - Secondary Containment - Chemical Resistant Coating"},1,1,1,1,1,1,1,1,1,{"$f":"IF(ISERROR(K49*L49),0,IF(K49<1,0,L49))","v":0},{"$f":"IF(W49,J49/K49,0)","v":0}]
[3.3,"Acid Storage Tanks",null,null,null,null,null,null,null,null,null,null,null,null,null,null,null,null,null,null,null,null,0,0]
["3.3.1","Plastic/XLPE",{"$f":"HCl_tanks","v":0},"units",{"$f":"IF(HCl_tanks=0,\"NA\",HCl_tank_vol)","v":"NA"},{"$f":"IF(HCl_tanks=0,\"\",\"gal\")","v":""},{"$f":"IF(HCl_tanks=0,\"NA\",IF(curve=1,HCl_tank_vol,VLOOKUP(HCl_tank_vol,pl_cst_cost_cl,2)))","v":"NA"},{"$f":"IF(HCl_tanks=0,\"\",\"gal\")","v":""},{"$f":"IF(HCl_tanks=0,\"NA\",IF(curve=1,pl_at_eq,VLOOKUP(HCl_tank_vol,pl_cst_cost_cl,3)))","v":"NA"},{"$f":"IF(HCl_tanks=0,\"--\",IF(I51=\"contact vendor\",\"--\",C51*I51))","v":"--"},{"$f":"IF(HCl_tanks=0,\"NA\",VLOOKUP(HCl_tank_vol,pl_cst_cost_cl,IF(ss_cat=\"large\",4,5)))","v":"NA"},null,{"$f":"$B$50&\" - \"&B51","v":"Acid Storage Tanks - Plastic/XLPE"},1,2,2,1,2,2,1,2,2,0,0]
["3.3.1","Fiberglass",{"$f":"HCl_tanks","v":0},"units",{"$f":"IF(HCl_tanks=0,\"NA\",HCl_tank_vol)","v":"NA"},{"$f":"IF(HCl_tanks=0,\"\",\"gal\")","v":""},{"$f":"IF(HCl_tanks=0,\"NA\",IF(curve=1,HCl_tank_vol,VLOOKUP(HCl_tank_vol,fg_cst_cost_cl,2)))","v":"NA"},{"$f":"IF(HCl_tanks=0,\"\",\"gal\")","v":""},{"$f":"IF(HCl_tanks=0,\"NA\",IF(curve=1,fg_at_eq,VLOOKUP(HCl_tank_vol,fg_cst_cost_cl,3)))","v":"NA"},{"$f":"IF(HCl_tanks=0,\"--\",IF(I52=\"contact vendor\",\"--\",C52*I52))","v":"--"},{"$f":"IF(HCl_tanks=0,\"NA\",VLOOKUP(HCl_tank_vol,fg_cst_cost_cl,IF(ss_cat=\"large\",4,5)))","v":"NA"},null,{"$f":"$B$50&\" - \"&B52","v":"Acid Storage Tanks - Fiberglass"},2,1,1,2,1,1,2,1,1,0,0]
["3.3.2","Secondary Containment - Concrete Curbing",{"$f":"IF(OR(include_sec_cont=0,HCl_tanks=0),0,hcl_curb_concrete)","v":0},"cy","NA",null,"NA",null,{"$f":"IF(C53=0,\"NA\",VLOOKUP(0,conc_basin_cost_cl,3))","v":"NA"},{"$f":"IF(C53=0,\"--\",IF(I53=\"contact vendor\",\"--\",C53*I53))","v":"--"},{"$f":"IF(C53=0,\"NA\",VLOOKUP(0,conc_basin_cost_cl,IF(ss_cat=\"large\",4,5)))","v":"NA"},null,{"$f":"$B$50&\" - \"&B53","v":"Acid Storage Tanks - Secondary Containment - Concrete Curbing"},1,1,1,1,1,1,1,1,1,0,0]
["3.3.3","Secondary Containment - Chemical Resistant Coating",{"$f":"IF(OR(include_sec_cont=0,HCl_tanks=0),0,hcl_coating_gal)","v":0},"gal","NA",null,"NA",null,{"$f":"IF(C54=0,\"NA\",VLOOKUP(0,conc_coating_cost_cl,3))","v":"NA"},{"$f":"IF(C54=0,\"--\",IF(I54=\"contact vendor\",\"--\",C54*I54))","v":"--"},{"$f":"IF(C54=0,\"NA\",VLOOKUP(0,conc_coating_cost_cl,IF(ss_cat=\"large\",4,5)))","v":"NA"},null,"Acid Storage Tanks - Secondary Containment - Chemical Resistant Coating",1,1,1,1,1,1,1,1,1,0,0]
[3.4,"Caustic Storage Tanks",null,null,null,null,null,null,null,null,null,null,null,null,null,null,null,null,null,null,null,null,0,0]
["3.4.1","Plastic/XLPE",{"$f":"NaOH_tanks","v":0},"units",{"$f":"IF(NaOH_tanks=0,\"NA\",NaOH_tank_vol)","v":"NA"},{"$f":"IF(NaOH_tanks=0,\"\",\"gal\")","v":""},{"$f":"IF(NaOH_tanks=0,\"NA\",IF(curve=1,NaOH_tank_vol,VLOOKUP(NaOH_tank_vol,pl_cst_cost_cl,2)))","v":"NA"},{"$f":"IF(NaOH_tanks=0,\"\",\"gal\")","v":""},{"$f":"IF(NaOH_tanks=0,\"NA\",IF(curve=1,pl_ct_eq,VLOOKUP(NaOH_tank_vol,pl_cst_cost_cl,3)))","v":"NA"},{"$f":"IF(NaOH_tanks=0,\"--\",IF(I56=\"contact vendor\",\"--\",C56*I56))","v":"--"},{"$f":"IF(NaOH_tanks=0,\"NA\",VLOOKUP(NaOH_tank_vol,pl_cst_cost_cl,IF(ss_cat=\"large\",4,5)))","v":"NA"},null,{"$f":"$B$55&\" - \"&B56","v":"Caustic Storage Tanks - Plastic/XLPE"},1,2,3,1,2,3,1,2,3,0,0]
["3.4.1","Fiberglass",{"$f":"NaOH_tanks","v":0},"units",{"$f":"IF(NaOH_tanks=0,\"NA\",NaOH_tank_vol)","v":"NA"},{"$f":"IF(NaOH_tanks=0,\"\",\"gal\")","v":""},{"$f":"IF(NaOH_tanks=0,\"NA\",IF(curve=1,NaOH_tank_vol,VLOOKUP(NaOH_tank_vol,fg_cst_cost_cl,2)))","v":"NA"},{"$f":"IF(NaOH_tanks=0,\"\",\"gal\")","v":""},{"$f":"IF(NaOH_tanks=0,\"NA\",IF(curve=1,fg_ct_eq,VLOOKUP(NaOH_tank_vol,fg_cst_cost_cl,3)))","v":"NA"},{"$f":"IF(NaOH_tanks=0,\"--\",IF(I57=\"contact vendor\",\"--\",C57*I57))","v":"--"},{"$f":"IF(NaOH_tanks=0,\"NA\",VLOOKUP(NaOH_tank_vol,fg_cst_cost_cl,IF(ss_cat=\"large\",4,5)))","v":"NA"},null,{"$f":"$B$55&\" - \"&B57","v":"Caustic Storage Tanks - Fiberglass"},2,1,2,2,1,2,2,1,2,0,0]
["3.4.1","Stainless Steel",{"$f":"NaOH_tanks","v":0},"units",{"$f":"IF(NaOH_tanks=0,\"NA\",NaOH_tank_vol)","v":"NA"},{"$f":"IF(NaOH_tanks=0,\"\",\"gal\")","v":""},{"$f":"IF(NaOH_tanks=0,\"NA\",IF(curve=1,NaOH_tank_vol,VLOOKUP(NaOH_tank_vol,ss_cst_cost_cl,2)))","v":"NA"},{"$f":"IF(NaOH_tanks=0,\"\",\"gal\")","v":""},{"$f":"IF(NaOH_tanks=0,\"NA\",IF(curve=1,ss_ct_eq,VLOOKUP(NaOH_tank_vol,ss_cst_cost_cl,3)))","v":"NA"},{"$f":"IF(NaOH_tanks=0,\"--\",IF(I58=\"contact vendor\",\"--\",C58*I58))","v":"--"},{"$f":"IF(NaOH_tanks=0,\"NA\",VLOOKUP(NaOH_tank_vol,ss_cst_cost_cl,IF(ss_cat=\"large\",4,5)))","v":"NA"},null,{"$f":"$B$55&\" - \"&B58","v":"Caustic Storage Tanks - Stainless Steel"},3,3,1,3,3,1,3,3,1,0,0]
["3.4.2","Heat Tracing",{"$f":"NaOH_tanks","v":0},"units",{"$f":"IF(NaOH_tanks=0,\"NA\",NaOH_tank_vol)","v":"NA"},{"$f":"IF(NaOH_tanks=0,\"\",\"gal\")","v":""},{"$f":"IF(NaOH_tanks=0,\"NA\",IF(curve=1,NaOH_tank_vol,VLOOKUP(NaOH_tank_vol,cst_heat_cost_cl,2)))","v":"NA"},{"$f":"IF(NaOH_tanks=0,\"\",\"gal\")","v":""},{"$f":"IF(NaOH_tanks=0,\"NA\",IF(curve=1,ct_heat_eq,VLOOKUP(NaOH_tank_vol,cst_heat_cost_cl,3)))","v":"NA"},{"$f":"IF(NaOH_tanks=0,\"--\",IF(I59=\"contact vendor\",\"--\",C59*I59))","v":"--"},{"$f":"IF(NaOH_tanks=0,\"NA\",VLOOKUP(NaOH_tank_vol,cst_heat_cost_cl,IF(ss_cat=\"large\",4,5)))","v":"NA"},null,{"$f":"$B$55&\" - \"&B59","v":"Caustic Storage Tanks - Heat Tracing"},1,1,1,1,1,1,1,1,1,0,0]
["3.4.3","Insulation",{"$f":"NaOH_tanks","v":0},"units",{"$f":"IF(NaOH_tanks=0,\"NA\",NaOH_tank_vol)","v":"NA"},{"$f":"IF(NaOH_tanks=0,\"\",\"gal\")","v":""},{"$f":"IF(NaOH_tanks=0,\"NA\",IF(curve=1,NaOH_tank_vol,VLOOKUP(NaOH_tank_vol,cst_insul_cost_cl,2)))","v":"NA"},{"$f":"IF(NaOH_tanks=0,\"\",\"gal\")","v":""},{"$f":"IF(NaOH_tanks=0,\"NA\",IF(curve=1,ct_insul_eq,VLOOKUP(NaOH_tank_vol,cst_insul_cost_cl,3)))","v":"NA"},{"$f":"IF(NaOH_tanks=0,\"--\",IF(I60=\"contact vendor\",\"--\",C60*I60))","v":"--"},{"$f":"IF(NaOH_tanks=0,\"NA\",VLOOKUP(NaOH_tank_vol,cst_insul_cost_cl,IF(ss_cat=\"large\",4,5)))","v":"NA"},null,{"$f":"$B$55&\" - \"&B60","v":"Caustic Storage Tanks - Insulation"},1,1,1,1,1,1,1,1,1,0,0]
["3.4.4","Secondary Containment - Concrete Curbing",{"$f":"IF(OR(include_sec_cont=0,NaOH_tanks=0),0,ct_curb_concrete)","v":0},"cy","NA",null,"NA",null,{"$f":"IF(C61=0,\"NA\",VLOOKUP(0,conc_basin_cost_cl,3))","v":"NA"},{"$f":"IF(C61=0,\"--\",IF(I61=\"contact vendor\",\"--\",C61*I61))","v":"--"},{"$f":"IF(C61=0,\"NA\",VLOOKUP(0,conc_basin_cost_cl,IF(ss_cat=\"large\",4,5)))","v":"NA"},null,{"$f":"$B$55&\" - \"&B61","v":"Caustic Storage Tanks - Secondary Containment - Concrete Curbing"},1,1,1,1,1,1,1,1,1,{"$f":"IF(ISERROR(K61*L61),0,IF(K61<1,0,L61))","v":0},{"$f":"IF(W61,J61/K61,0)","v":0}]
["3.4.5","Secondary Containment - Chemical Resistant Coating",{"$f":"IF(OR(include_sec_cont=0,NaOH_tanks=0),0,ct_coating_gal)","v":0},"gal","NA",null,"NA",null,{"$f":"IF(C62=0,\"NA\",VLOOKUP(0,conc_coating_cost_cl,3))","v":"NA"},{"$f":"IF(C62=0,\"--\",IF(I62=\"contact vendor\",\"--\",C62*I62))","v":"--"},{"$f":"IF(C62=0,\"NA\",VLOOKUP(0,conc_coating_cost_cl,IF(ss_cat=\"large\",4,5)))","v":"NA"},null,"Caustic Storage Tanks - Secondary Containment - Chemical Resistant Coating",1,1,1,1,1,1,1,1,1,0,0]
[3.5,"Caustic Day Tanks",null,null,null,null,null,null,null,null,null,null,null,null,null,null,null,null,null,null,null,null,0,0]
["3.5.1","Plastic/XLPE",{"$f":"NaOH_day_tanks","v":0},"units",{"$f":"IF(C64=0,\"NA\",NaOH_day_tank_vol)","v":"NA"},{"$f":"IF(C64=0,\"\",\"gal\")","v":""},{"$f":"IF(C64=0,\"NA\",IF(curve=1,NaOH_day_tank_vol,VLOOKUP(NaOH_day_tank_vol,pl_cst_cost_cl,2)))","v":"NA"},{"$f":"IF(C64=0,\"\",\"gal\")","v":""},{"$f":"IF(C64=0,\"NA\",IF(curve=1,pl_day_eq,VLOOKUP(NaOH_day_tank_vol,pl_cst_cost_cl,3)))","v":"NA"},{"$f":"IF(C64=0,\"--\",IF(I64=\"contact vendor\",\"--\",C64*I64))","v":"--"},{"$f":"IF(C64=0,\"NA\",VLOOKUP(NaOH_day_tank_vol,pl_cst_cost_cl,IF(ss_cat=\"large\",4,5)))","v":"NA"},null,{"$f":"$B$63&\" - \"&B64","v":"Caustic Day Tanks - Plastic/XLPE"},1,2,3,1,2,3,1,2,3,0,0]
["3.5.1","Fiberglass",{"$f":"NaOH_day_tanks","v":0},"units",{"$f":"IF(C65=0,\"NA\",NaOH_day_tank_vol)","v":"NA"},{"$f":"IF(C65=0,\"\",\"gal\")","v":""},{"$f":"IF(C65=0,\"NA\",IF(curve=1,NaOH_day_tank_vol,VLOOKUP(NaOH_day_tank_vol,fg_cst_cost_cl,2)))","v":"NA"},{"$f":"IF(C65=0,\"\",\"gal\")","v":""},{"$f":"IF(C65=0,\"NA\",IF(curve=1,fg_day_eq,VLOOKUP(NaOH_day_tank_vol,fg_cst_cost_cl,3)))","v":"NA"},"--",{"$f":"IF(C65=0,\"NA\",VLOOKUP(NaOH_day_tank_vol,fg_cst_cost_cl,IF(ss_cat=\"large\",4,5)))","v":"NA"},null,{"$f":"$B$63&\" - \"&B65","v":"Caustic Day Tanks - Fiberglass"},2,1,2,2,1,2,2,1,2,0,0]
["3.5.1","Stainless Steel",{"$f":"NaOH_day_tanks","v":0},"units",{"$f":"IF(C66=0,\"NA\",NaOH_day_tank_vol)","v":"NA"},{"$f":"IF(C66=0,\"\",\"gal\")","v":""},{"$f":"IF(C66=0,\"NA\",IF(curve=1,NaOH_day_tank_vol,VLOOKUP(NaOH_day_tank_vol,ss_cst_cost_cl,2)))","v":"NA"},{"$f":"IF(C66=0,\"\",\"gal\")","v":""},{"$f":"IF(C66=0,\"NA\",IF(curve=1,ss_day_eq,VLOOKUP(NaOH_day_tank_vol,ss_cst_cost_cl,3)))","v":"NA"},"--",{"$f":"IF(C66=0,\"NA\",VLOOKUP(NaOH_day_tank_vol,ss_cst_cost_cl,IF(ss_cat=\"large\",4,5)))","v":"NA"},null,{"$f":"$B$63&\" - \"&B66","v":"Caustic Day Tanks - Stainless Steel"},3,3,1,3,3,1,3,3,1,0,0]
["3.5.2","Heat Tracing",{"$f":"NaOH_day_tanks","v":0},"units",{"$f":"IF(C67=0,\"NA\",NaOH_day_tank_vol)","v":"NA"},{"$f":"IF(C67=0,\"\",\"gal\")","v":""},{"$f":"IF(C67=0,\"NA\",IF(curve=1,NaOH_day_tank_vol,VLOOKUP(NaOH_day_tank_vol,cst_heat_cost_cl,2)))","v":"NA"},{"$f":"IF(C67=0,\"\",\"gal\")","v":""},{"$f":"IF(C67=0,\"NA\",IF(curve=1,day_heat_eq,VLOOKUP(NaOH_day_tank_vol,cst_heat_cost_cl,3)))","v":"NA"},"--",{"$f":"IF(C67=0,\"NA\",VLOOKUP(NaOH_day_tank_vol,cst_heat_cost_cl,IF(ss_cat=\"large\",4,5)))","v":"NA"},null,{"$f":"$B$63&\" - \"&B67","v":"Caustic Day Tanks - Heat Tracing"},1,1,1,1,1,1,1,1,1,0,0]
["3.5.3","Insulation",{"$f":"NaOH_day_tanks","v":0},"units",{"$f":"IF(C68=0,\"NA\",NaOH_day_tank_vol)","v":"NA"},{"$f":"IF(C68=0,\"\",\"gal\")","v":""},{"$f":"IF(C68=0,\"NA\",IF(curve=1,NaOH_day_tank_vol,VLOOKUP(NaOH_day_tank_vol,cst_insul_cost_cl,2)))","v":"NA"},{"$f":"IF(C68=0,\"\",\"gal\")","v":""},{"$f":"IF(C68=0,\"NA\",IF(curve=1,day_insul_eq,VLOOKUP(NaOH_day_tank_vol,cst_insul_cost_cl,3)))","v":"NA"},"--",{"$f":"IF(C68=0,\"NA\",VLOOKUP(NaOH_day_tank_vol,cst_insul_cost_cl,IF(ss_cat=\"large\",4,5)))","v":"NA"},null,{"$f":"$B$63&\" - \"&B68","v":"Caustic Day Tanks - Insulation"},1,1,1,1,1,1,1,1,1,0,0]
["3.5.4","Secondary Containment - Concrete Curbing",{"$f":"IF(OR(include_sec_cont=0,NaOH_day_tanks=0),0,dt_curb_concrete)","v":0},"cy","NA",null,"NA",null,{"$f":"IF(C69=0,\"NA\",VLOOKUP(0,conc_basin_cost_cl,3))","v":"NA"},"--",{"$f":"IF(C69=0,\"NA\",VLOOKUP(0,conc_basin_cost_cl,IF(ss_cat=\"large\",4,5)))","v":"NA"},null,{"$f":"$B$55&\" - \"&B69","v":"Caustic Storage Tanks - Secondary Containment - Concrete Curbing"},1,1,1,1,1,1,1,1,1,0,0]
["3.5.5","Secondary Containment - Chemical Resistant Coating",{"$f":"IF(OR(include_sec_cont=0,NaOH_day_tanks=0),0,dt_coating_gal)","v":0},"gal","NA",null,"NA",null,{"$f":"IF(C70=0,\"NA\",VLOOKUP(0,conc_coating_cost_cl,3))","v":"NA"},"--",{"$f":"IF(C70=0,\"NA\",VLOOKUP(0,conc_coating_cost_cl,IF(ss_cat=\"large\",4,5)))","v":"NA"},null,"Caustic Storage Tanks - Secondary Containment - Chemical Resistant Coating",1,1,1,1,1,1,1,1,1,0,0]
["3.6","Residuals Holding Tanks/Basins",null,null,null,null,null,null,null,null,null,null,null,null,null,null,null,null,null,null,null,null,0,0]
["3.6.1","Concrete Basins (includes Excavation, Backfill, and Compaction)",{"$f":"hbasins","v":0},"units",{"$f":"IF(hbasins=0,\"NA\",hbasin_vol)","v":"NA"},{"$f":"IF(C72=0,\"\",\"gal\")","v":""},{"$f":"IF(hbasins=0,\"NA\",hbasin_vol)","v":"NA"},{"$f":"IF(C72=0,\"\",\"gal\")","v":""},{"$f":"IF(hbasins=0,\"NA\",J72/hbasins)","v":"NA"},{"$f":"IF(hbasins=0,\"--\",hconc_vol*VLOOKUP(0,conc_basin_cost_cl,3)+hexcavation_vol*VLOOKUP(0,excavate_cost_cl,3)+hbackfill_vol*VLOOKUP(0,backfill_cost_cl,3)+hrailing*VLOOKUP(\"aluminum railing\",metal_cost_cl,3))","v":"--"},{"$f":"IF(hbasins=0,\"NA\",VLOOKUP(0,conc_basin_cost_cl,IF(ss_cat=\"large\",4,5)))","v":"NA"},null,{"$f":"$B$71&\" - \"&B72","v":"Residuals Holding Tanks/Basins - Concrete Basins (includes Excavation, Backfill, and Compaction)"},3,3,2,3,3,2,3,3,2,0,0]
["3.6.1","Steel Tanks",{"$f":"htanks","v":0},"units",{"$f":"IF(C73=0,\"NA\",htank_vol)","v":"NA"},{"$f":"IF(C73=0,\"\",\"gal\")","v":""},{"$f":"IF(htanks=0,\"NA\",IF(curve=1,htank_vol,VLOOKUP(htank_vol,st_bwt_cost_cl,2)))","v":"NA"},{"$f":"IF(C73=0,\"\",\"gal\")","v":""},{"$f":"IF(htanks=0,\"NA\",IF(curve=1,st_ht_eq,VLOOKUP(htank_vol,st_bwt_cost_cl,3)))","v":"NA"},{"$f":"IF(OR(C73=0,I73=\"contact vendor\"),\"--\",C73*I73)","v":"--"},{"$f":"IF(htanks=0,\"NA\",VLOOKUP(htank_vol,st_bwt_cost_cl,IF(ss_cat=\"large\",4,5)))","v":"NA"},null,{"$f":"$B$71&\" - \"&B73","v":"Residuals Holding Tanks/Basins - Steel Tanks"},4,4,1,4,4,1,4,4,1,0,0]
["3.6.1","Fiberglass Tanks",{"$f":"htanks","v":0},"units",{"$f":"IF(C74=0,\"NA\",htank_vol)","v":"NA"},{"$f":"IF(C74=0,\"\",\"gal\")","v":""},{"$f":"IF(htanks=0,\"NA\",IF(curve=1,htank_vol,VLOOKUP(htank_vol,fg_bwt_cost_cl,2)))","v":"NA"},{"$f":"IF(C74=0,\"\",\"gal\")","v":""},{"$f":"IF(htanks=0,\"NA\",IF(curve=1,fg_ht_eq,VLOOKUP(htank_vol,fg_bwt_cost_cl,3)))","v":"NA"},{"$f":"IF(OR(C74=0,I74=\"contact vendor\"),\"--\",C74*I74)","v":"--"},{"$f":"IF(htanks=0,\"NA\",VLOOKUP(htank_vol,fg_bwt_cost_cl,IF(ss_cat=\"large\",4,5)))","v":"NA"},null,{"$f":"$B$71&\" - \"&B74","v":"Residuals Holding Tanks/Basins - Fiberglass Tanks"},2,1,3,2,1,3,2,1,3,0,0]
["3.6.1","Plastic/HDPE Tanks",{"$f":"htanks","v":0},"units",{"$f":"IF(C75=0,\"NA\",htank_vol)","v":"NA"},{"$f":"IF(C75=0,\"\",\"gal\")","v":""},{"$f":"IF(htanks=0,\"NA\",IF(curve=1,htank_vol,VLOOKUP(htank_vol,hdpe_bwt_cost_cl,2)))","v":"NA"},{"$f":"IF(C75=0,\"\",\"gal\")","v":""},{"$f":"IF(htanks=0,\"NA\",IF(curve=1,hdpe_ht_eq,VLOOKUP(htank_vol,hdpe_bwt_cost_cl,3)))","v":"NA"},{"$f":"IF(OR(C75=0,I75=\"contact vendor\"),\"--\",C75*I75)","v":"--"},{"$f":"IF(htanks=0,\"NA\",VLOOKUP(htank_vol,hdpe_bwt_cost_cl,IF(ss_cat=\"large\",4,5)))","v":"NA"},null,{"$f":"$B$71&\" - \"&B75","v":"Residuals Holding Tanks/Basins - Plastic/HDPE Tanks"},1,2,4,1,2,4,1,2,4,0,0]
[3.7,"Polymer Storage Tanks",null,null,null,null,null,null,null,null,null,null,null,null,null,null,null,null,null,null,null,null,0,0]
["3.7.1","Plastic/XLPE",{"$f":"polymer_tanks","v":0},"units",{"$f":"IF(C77=0,\"NA\",polymer_tank_vol)","v":"NA"},{"$f":"IF(C77=0,\"\",\"gal\")","v":""},{"$f":"IF(C77=0,\"NA\",IF(curve=1,polymer_tank_vol,VLOOKUP(polymer_tank_vol,pl_cst_cost_cl,2)))","v":"NA"},{"$f":"IF(C77=0,\"\",\"gal\")","v":""},{"$f":"IF(C77=0,\"NA\",IF(curve=1,pl_polymer_st_eq,VLOOKUP(polymer_tank_vol,pl_cst_cost_cl,3)))","v":"NA"},{"$f":"IF(OR(C77=0,I77=\"contact vendor\"),\"--\",C77*I77)","v":"--"},{"$f":"IF(C77=0,\"NA\",VLOOKUP(polymer_tank_vol,pl_cst_cost_cl,IF(ss_cat=\"large\",4,5)))","v":"NA"},null,{"$f":"$B$76&\" - \"&B77","v":"Polymer Storage Tanks - Plastic/XLPE"},1,2,3,1,2,3,1,2,3,0,0]
["3.7.1","Fiberglass",{"$f":"polymer_tanks","v":0},"units",{"$f":"IF(C78=0,\"NA\",polymer_tank_vol)","v":"NA"},{"$f":"IF(C78=0,\"\",\"gal\")","v":""},{"$f":"IF(C78=0,\"NA\",IF(curve=1,polymer_tank_vol,VLOOKUP(polymer_tank_vol,fg_cst_cost_cl,2)))","v":"NA"},{"$f":"IF(C78=0,\"\",\"gal\")","v":""},{"$f":"IF(C78=0,\"NA\",IF(curve=1,fg_polymer_st_eq,VLOOKUP(polymer_tank_vol,fg_cst_cost_cl,3)))","v":"NA"},{"$f":"IF(OR(C78=0,I78=\"contact vendor\"),\"--\",C78*I78)","v":"--"},{"$f":"IF(C78=0,\"NA\",VLOOKUP(polymer_tank_vol,fg_cst_cost_cl,IF(ss_cat=\"large\",4,5)))","v":"NA"},null,{"$f":"$B$76&\" - \"&B78","v":"Polymer Storage Tanks - Fiberglass"},2,1,2,2,1,2,2,1,2,0,0]
["3.7.1","Stainless Steel",{"$f":"polymer_tanks","v":0},"units",{"$f":"IF(C79=0,\"NA\",polymer_tank_vol)","v":"NA"},{"$f":"IF(C79=0,\"\",\"gal\")","v":""},{"$f":"IF(C79=0,\"NA\",IF(curve=1,polymer_tank_vol,VLOOKUP(polymer_tank_vol,ss_cst_cost_cl,2)))","v":"NA"},{"$f":"IF(C79=0,\"\",\"gal\")","v":""},{"$f":"IF(C79=0,\"NA\",IF(curve=1,ss_polymer_st_eq,VLOOKUP(polymer_tank_vol,ss_cst_cost_cl,3)))","v":"NA"},{"$f":"IF(OR(C79=0,I79=\"contact vendor\"),\"--\",C79*I79)","v":"--"},{"$f":"IF(C79=0,\"NA\",VLOOKUP(polymer_tank_vol,ss_cst_cost_cl,IF(ss_cat=\"large\",4,5)))","v":"NA"},null,{"$f":"$B$76&\" - \"&B79","v":"Polymer Storage Tanks - Stainless Steel"},3,3,1,3,3,1,3,3,1,0,0]
[4,"Cartridge Filters",null,null,null,null,null,null,null,null,null,null,null,null,null,null,null,null,null,null,null,null,0,0]
[4.0999999999999996,"Cartridge Filters",{"$f":"num_filters","v":29},"units",{"$f":"filter_size","v":2.7804444444444445},"MGD",{"$f":"IF(curve=1,filter_size,VLOOKUP(filter_size,cart_cost_cl,2))","v":2.7804444444444445},"MGD",{"$f":"IF(C81=0,0,IF(curve=1,cart_eq,VLOOKUP(filter_size,cart_cost_cl,3)))","v":57601.73992708818},{"$f":"IF(C81=0,\"--\",IF(I81=\"contact vendor\",\"--\",C81*I81))","v":1670450.4578855573},{"$f":"IF(C81=0,\"NA\",VLOOKUP(E81,cart_cost_cl,IF(ss_cat=\"large\",4,5)))","v":35},1,{"$f":"$B$80&\" - \"&B81","v":"Cartridge Filters - Cartridge Filters"},1,1,1,1,1,1,1,1,1,1,47727.155939587356]
[5,"Piping",null,null,null,null,null,null,null,null,null,null,null,null,null,null,null,null,null,null,null,null,0,0]
[5.0999999999999996,"Backwash Piping",null,null,null,null,null,null,null,null,null,null,null,null,null,null,null,null,null,null,null,null,0,0]
["5.1.1","CPVC",{"$f":"back_pipe_length","v":425},"lf",{"$f":"IF(back_pipe_length=0,\"NA\",back_pipe_diam)","v":8},{"$f":"IF(back_pipe_length=0,\"\",\"in. diam\")","v":"in. diam"},{"$f":"IF(back_pipe_length=0,\"NA\",IF(curve=1,back_pipe_diam,VLOOKUP(back_pipe_diam,cpvc_pipe_cost_cl,2)))","v":8},{"$f":"IF(back_pipe_length=0,\"\",\"in. diam\")","v":"in. diam"},{"$f":"IF(back_pipe_length=0,\"NA\",IF(curve=1,cpvc_pipe_eq_back,VLOOKUP(back_pipe_diam,cpvc_pipe_cost_cl,3)))","v":68.204526205999997},{"$f":"IF(back_pipe_length=0,\"--\",IF(I84=\"contact vendor\",\"--\",C84*I84))","v":28986.92363755},{"$f":"IF(back_pipe_length=0,\"NA\",VLOOKUP(back_pipe_diam,cpvc_pipe_cost_cl,IF(ss_cat=\"large\",4,5)))","v":22},0,{"$f":"$B$83&\" - \"&B84","v":"Backwash Piping - CPVC"},2,1,3,2,1,3,2,1,3,0,0]
["5.1.1","PVC",{"$f":"back_pipe_length","v":425},"lf",{"$f":"IF(back_pipe_length=0,\"NA\",back_pipe_diam)","v":8},{"$f":"IF(back_pipe_length=0,\"\",\"in. diam\")","v":"in. diam"},{"$f":"IF(back_pipe_length=0,\"NA\",IF(curve=1,back_pipe_diam,VLOOKUP(back_pipe_diam,pvc_pipe_cost_cl,2)))","v":8},{"$f":"IF(back_pipe_length=0,\"\",\"in. diam\")","v":"in. diam"},{"$f":"IF(back_pipe_length=0,\"NA\",IF(curve=1,pvc_pipe_eq_back,VLOOKUP(back_pipe_diam,pvc_pipe_cost_cl,3)))","v":11.336130997000001},{"$f":"IF(back_pipe_length=0,\"--\",IF(I85=\"contact vendor\",\"--\",C85*I85))","v":4817.855673725001},{"$f":"IF(back_pipe_length=0,\"NA\",VLOOKUP(back_pipe_diam,pvc_pipe_cost_cl,IF(ss_cat=\"large\",4,5)))","v":22},1,{"$f":"$B$83&\" - \"&B85","v":"Backwash Piping - PVC"},1,2,4,1,2,4,1,2,4,1,218.99343971477276]
["5.1.1","Stainless Steel",{"$f":"back_pipe_length","v":425},"lf",{"$f":"IF(back_pipe_length=0,\"NA\",back_pipe_diam)","v":8},{"$f":"IF(back_pipe_length=0,\"\",\"in. diam\")","v":"in. diam"},{"$f":"IF(back_pipe_length=0,\"NA\",IF(curve=1,back_pipe_diam,VLOOKUP(back_pipe_diam,ss_pipe_cost_cl,2)))","v":8},{"$f":"IF(back_pipe_length=0,\"\",\"in. diam\")","v":"in. diam"},{"$f":"IF(back_pipe_length=0,\"NA\",IF(curve=1,ss_pipe_eq_back,VLOOKUP(back_pipe_diam,ss_pipe_cost_cl,3)))","v":183.860928145},{"$f":"IF(back_pipe_length=0,\"--\",IF(I86=\"contact vendor\",\"--\",C86*I86))","v":78140.894461625008},{"$f":"IF(back_pipe_length=0,\"NA\",VLOOKUP(back_pipe_diam,ss_pipe_cost_cl,IF(ss_cat=\"large\",4,5)))","v":45},0,{"$f":"$B$83&\" - \"&B86","v":"Backwash Piping - Stainless Steel"},4,4,1,4,4,1,4,4,1,0,0]
["5.1.1","Steel",{"$f":"back_pipe_length","v":425},"lf",{"$f":"IF(back_pipe_length=0,\"NA\",back_pipe_diam)","v":8},{"$f":"IF(back_pipe_length=0,\"\",\"in. diam\")","v":"in. diam"},{"$f":"IF(back_pipe_length=0,\"NA\",IF(curve=1,back_pipe_diam,VLOOKUP(back_pipe_diam,st_pipe_cost_cl,2)))","v":8},{"$f":"IF(back_pipe_length=0,\"\",\"in. diam\")","v":"in. diam"},{"$f":"IF(back_pipe_length=0,\"NA\",IF(curve=1,st_pipe_eq_back,VLOOKUP(back_pipe_diam,st_pipe_cost_cl,3)))","v":126.69854464000002},{"$f":"IF(back_pipe_length=0,\"--\",IF(I87=\"contact vendor\",\"--\",C87*I87))","v":53846.881472000008},{"$f":"IF(back_pipe_length=0,\"NA\",VLOOKUP(back_pipe_diam,st_pipe_cost_cl,IF(ss_cat=\"large\",4,5)))","v":35},0,{"$f":"$B$83&\" - \"&B87","v":"Backwash Piping - Steel"},3,3,2,3,3,2,3,3,2,0,0]
[5.2,"Regenerant Piping",null,null,null,null,null,null,null,null,null,null,null,null,null,null,null,null,null,null,null,null,0,0]
["5.2.1","CPVC",{"$f":"brine_pipe_length","v":0},"lf",{"$f":"IF(brine_pipe_length=0,\"NA\",brine_pipe_diam)","v":"NA"},{"$f":"IF(brine_pipe_length=0,\"\",\"in. diam\")","v":""},{"$f":"IF(brine_pipe_length=0,\"NA\",IF(curve=1,brine_pipe_diam,VLOOKUP(brine_pipe_diam,cpvc_pipe_cost_cl,2)))","v":"NA"},{"$f":"IF(brine_pipe_length=0,\"\",\"in. diam\")","v":""},{"$f":"IF(brine_pipe_length=0,\"NA\",IF(curve=1,cpvc_pipe_eq_brine,VLOOKUP(brine_pipe_diam,cpvc_pipe_cost_cl,3)))","v":"NA"},{"$f":"IF(brine_pipe_length=0,\"--\",IF(I89=\"contact vendor\",\"--\",C89*I89))","v":"--"},{"$f":"IF(brine_pipe_length=0,\"NA\",VLOOKUP(brine_pipe_diam,cpvc_pipe_cost_cl,IF(ss_cat=\"large\",4,5)))","v":"NA"},null,{"$f":"$B$88&\" - \"&B89","v":"Regenerant Piping - CPVC"},2,1,2,2,1,2,2,1,2,0,0]
["5.2.1","PVC",{"$f":"brine_pipe_length","v":0},"lf",{"$f":"IF(brine_pipe_length=0,\"NA\",brine_pipe_diam)","v":"NA"},{"$f":"IF(brine_pipe_length=0,\"\",\"in. diam\")","v":""},{"$f":"IF(brine_pipe_length=0,\"NA\",IF(curve=1,brine_pipe_diam,VLOOKUP(brine_pipe_diam,pvc_pipe_cost_cl,2)))","v":"NA"},{"$f":"IF(brine_pipe_length=0,\"\",\"in. diam\")","v":""},{"$f":"IF(brine_pipe_length=0,\"NA\",IF(curve=1,pvc_pipe_eq_brine,VLOOKUP(brine_pipe_diam,pvc_pipe_cost_cl,3)))","v":"NA"},{"$f":"IF(brine_pipe_length=0,\"--\",IF(I90=\"contact vendor\",\"--\",C90*I90))","v":"--"},{"$f":"IF(brine_pipe_length=0,\"NA\",VLOOKUP(brine_pipe_diam,pvc_pipe_cost_cl,IF(ss_cat=\"large\",4,5)))","v":"NA"},null,{"$f":"$B$88&\" - \"&B90","v":"Regenerant Piping - PVC"},1,2,3,1,2,3,1,2,3,0,0]
["5.2.1","Stainless Steel",{"$f":"brine_pipe_length","v":0},"lf",{"$f":"IF(brine_pipe_length=0,\"NA\",brine_pipe_diam)","v":"NA"},{"$f":"IF(brine_pipe_length=0,\"\",\"in. diam\")","v":""},{"$f":"IF(brine_pipe_length=0,\"NA\",IF(curve=1,brine_pipe_diam,VLOOKUP(brine_pipe_diam,ss_pipe_cost_cl,2)))","v":"NA"},{"$f":"IF(brine_pipe_length=0,\"\",\"in. diam\")","v":""},{"$f":"IF(brine_pipe_length=0,\"NA\",IF(curve=1,ss_pipe_eq_brine,VLOOKUP(brine_pipe_diam,ss_pipe_cost_cl,3)))","v":"NA"},{"$f":"IF(brine_pipe_length=0,\"--\",IF(I91=\"contact vendor\",\"--\",C91*I91))","v":"--"},{"$f":"IF(brine_pipe_length=0,\"NA\",VLOOKUP(brine_pipe_diam,ss_pipe_cost_cl,IF(ss_cat=\"large\",4,5)))","v":"NA"},null,{"$f":"$B$88&\" - \"&B91","v":"Regenerant Piping - Stainless Steel"},3,3,1,3,3,1,3,3,1,0,0]
[5.3,"Process Piping",null,null,null,null,null,null,null,null,null,null,null,null,null,null,null,null,null,null,null,null,0,0]
["5.3.1","Ductile Iron",{"$f":"proc_pipe_length","v":340},"lf",{"$f":"proc_pipe_diam","v":12},"in. diam",{"$f":"IF(curve=1,proc_pipe_diam,VLOOKUP(proc_pipe_diam,di_pipe_cost_cl,2))","v":12},"in. diam",{"$f":"IF(curve=1,di_pipe_eq_proc,VLOOKUP(proc_pipe_diam,di_pipe_cost_cl,3))","v":80.531410089000005},{"$f":"IF(I93=\"contact vendor\",\"--\",C93*I93)","v":27380.679430260003},{"$f":"VLOOKUP(proc_pipe_diam,di_pipe_cost_cl,IF(ss_cat=\"large\",4,5))","v":40},0,{"$f":"$B$92&\" \"&\" - \"&B93","v":"Process Piping  - Ductile Iron"},3,3,3,3,3,3,3,3,3,0,0]
["5.3.1","CPVC",{"$f":"proc_pipe_length","v":340},"lf",{"$f":"proc_pipe_diam","v":12},"in. diam",{"$f":"IF(curve=1,proc_pipe_diam,VLOOKUP(proc_pipe_diam,cpvc_pipe_cost_cl,2))","v":12},"in. diam",{"$f":"IF(curve=1,cpvc_pipe_eq_proc,VLOOKUP(proc_pipe_diam,cpvc_pipe_cost_cl,3))","v":138.898964006},{"$f":"IF(I94=\"contact vendor\",\"--\",C94*I94)","v":47225.647762039996},{"$f":"VLOOKUP(proc_pipe_diam,cpvc_pipe_cost_cl,IF(ss_cat=\"large\",4,5))","v":22},0,{"$f":"$B$92&\" \"&\" - \"&B94","v":"Process Piping  - CPVC"},2,1,4,2,1,4,2,1,4,0,0]
["5.3.1","PVC",{"$f":"proc_pipe_length","v":340},"lf",{"$f":"proc_pipe_diam","v":12},"in. diam",{"$f":"IF(curve=1,proc_pipe_diam,VLOOKUP(proc_pipe_diam,pvc_pipe_cost_cl,2))","v":12},"in. diam",{"$f":"IF(curve=1,pvc_pipe_eq_proc,VLOOKUP(proc_pipe_diam,pvc_pipe_cost_cl,3))","v":21.105587412999999},{"$f":"IF(I95=\"contact vendor\",\"--\",C95*I95)","v":7175.8997204199995},{"$f":"VLOOKUP(proc_pipe_diam,pvc_pipe_cost_cl,IF(ss_cat=\"large\",4,5))","v":22},1,{"$f":"$B$92&\" \"&\" - \"&B95","v":"Process Piping  - PVC"},1,2,5,1,2,5,1,2,5,1,326.17726001909091]
["5.3.1","Stainless Steel",{"$f":"proc_pipe_length","v":340},"lf",{"$f":"proc_pipe_diam","v":12},"in. diam",{"$f":"IF(curve=1,proc_pipe_diam,VLOOKUP(proc_pipe_diam,ss_pipe_cost_cl,2))","v":12},"in. diam",{"$f":"IF(curve=1,ss_pipe_eq_proc,VLOOKUP(proc_pipe_diam,ss_pipe_cost_cl,3))","v":217.87158714499998},{"$f":"IF(I96=\"contact vendor\",\"--\",C96*I96)","v":74076.339629299997},{"$f":"VLOOKUP(proc_pipe_diam,ss_pipe_cost_cl,IF(ss_cat=\"large\",4,5))","v":45},0,{"$f":"$B$92&\" \"&\" - \"&B96","v":"Process Piping  - Stainless Steel"},5,5,1,5,5,1,5,5,1,0,0]
["5.3.1","Steel",{"$f":"proc_pipe_length","v":340},"lf",{"$f":"proc_pipe_diam","v":12},"in. diam",{"$f":"IF(curve=1,proc_pipe_diam,VLOOKUP(proc_pipe_diam,st_pipe_cost_cl,2))","v":12},"in. diam",{"$f":"IF(curve=1,st_pipe_eq_proc,VLOOKUP(proc_pipe_diam,st_pipe_cost_cl,3))","v":168.32044552399998},{"$f":"IF(I97=\"contact vendor\",\"--\",C97*I97)","v":57228.951478159994},{"$f":"VLOOKUP(proc_pipe_diam,st_pipe_cost_cl,IF(ss_cat=\"large\",4,5))","v":35},0,{"$f":"$B$92&\" \"&\" - \"&B97","v":"Process Piping  - Steel"},4,4,2,4,4,2,4,4,2,0,0]
[5.4,"Bypass Piping",null,null,null,null,null,null,null,null,null,null,null,null,null,null,null,null,null,null,null,null,0,0]
["5.4.1","CPVC",{"$f":"bp_pipe_length","v":0},"lf",{"$f":"IF(bp_pct>0,bp_pipe_diam,\"NA\")","v":"NA"},{"$f":"IF(bp_pct=0,\" \",\"in. diam\")","v":" "},{"$f":"IF(bp_pct=0,\"NA\",IF(curve=1,bp_pipe_diam,VLOOKUP(bp_pipe_diam,cpvc_pipe_cost_cl,2)))","v":"NA"},{"$f":"IF(bp_pct=0,\" \",\"in. diam\")","v":" "},{"$f":"IF(bp_pct=0,\"NA\",IF(curve=1,cpvc_pipe_eq_bp,VLOOKUP(bp_pipe_diam,cpvc_pipe_cost_cl,3)))","v":"NA"},{"$f":"IF(OR(C99=0,I99=\"contact vendor\"),\"--\",C99*I99)","v":"--"},{"$f":"IF(bp_pct=0,\"NA\",VLOOKUP(bp_pipe_diam,cpvc_pipe_cost_cl,IF(ss_cat=\"large\",4,5)))","v":"NA"},null,{"$f":"$B$98&\" \"&\" - \"&B99","v":"Bypass Piping  - CPVC"},2,1,3,2,1,3,2,1,3,0,0]
["5.4.1","PVC",{"$f":"bp_pipe_length","v":0},"lf",{"$f":"IF(bp_pct>0,bp_pipe_diam,\"NA\")","v":"NA"},{"$f":"IF(bp_pct=0,\" \",\"in. diam\")","v":" "},{"$f":"IF(bp_pct=0,\"NA\",IF(curve=1,bp_pipe_diam,VLOOKUP(bp_pipe_diam,pvc_pipe_cost_cl,2)))","v":"NA"},{"$f":"IF(bp_pct=0,\" \",\"in. diam\")","v":" "},{"$f":"IF(bp_pct=0,\"NA\",IF(curve=1,pvc_pipe_eq_bp,VLOOKUP(bp_pipe_diam,pvc_pipe_cost_cl,3)))","v":"NA"},{"$f":"IF(OR(C100=0,I100=\"contact vendor\"),\"--\",C100*I100)","v":"--"},{"$f":"IF(bp_pct=0,\"NA\",VLOOKUP(bp_pipe_diam,pvc_pipe_cost_cl,IF(ss_cat=\"large\",4,5)))","v":"NA"},null,{"$f":"$B$98&\" \"&\" - \"&B100","v":"Bypass Piping  - PVC"},1,2,4,1,2,4,1,2,4,0,0]
["5.4.1","Stainless Steel",{"$f":"bp_pipe_length","v":0},"lf",{"$f":"IF(bp_pct>0,bp_pipe_diam,\"NA\")","v":"NA"},{"$f":"IF(bp_pct=0,\" \",\"in. diam\")","v":" "},{"$f":"IF(bp_pct=0,\"NA\",IF(curve=1,bp_pipe_diam,VLOOKUP(bp_pipe_diam,ss_pipe_cost_cl,2)))","v":"NA"},{"$f":"IF(bp_pct=0,\" \",\"in. diam\")","v":" "},{"$f":"IF(bp_pct=0,\"NA\",IF(curve=1,ss_pipe_eq_bp,VLOOKUP(bp_pipe_diam,ss_pipe_cost_cl,3)))","v":"NA"},{"$f":"IF(OR(C101=0,I101=\"contact vendor\"),\"--\",C101*I101)","v":"--"},{"$f":"IF(bp_pct=0,\"NA\",VLOOKUP(bp_pipe_diam,ss_pipe_cost_cl,IF(ss_cat=\"large\",4,5)))","v":"NA"},null,{"$f":"$B$98&\" \"&\" - \"&B101","v":"Bypass Piping  - Stainless Steel"},4,4,1,4,4,1,4,4,1,0,0]
["5.4.1","Steel",{"$f":"bp_pipe_length","v":0},"lf",{"$f":"IF(bp_pct>0,bp_pipe_diam,\"NA\")","v":"NA"},{"$f":"IF(bp_pct=0,\" \",\"in. diam\")","v":" "},{"$f":"IF(bp_pct=0,\"NA\",IF(curve=1,bp_pipe_diam,VLOOKUP(bp_pipe_diam,st_pipe_cost_cl,2)))","v":"NA"},{"$f":"IF(bp_pct=0,\" \",\"in. diam\")","v":" "},{"$f":"IF(bp_pct=0,\"NA\",IF(curve=1,st_pipe_eq_bp,VLOOKUP(bp_pipe_diam,st_pipe_cost_cl,3)))","v":"NA"},{"$f":"IF(OR(C102=0,I102=\"contact vendor\"),\"--\",C102*I102)","v":"--"},{"$f":"IF(bp_pct=0,\"NA\",VLOOKUP(bp_pipe_diam,st_pipe_cost_cl,IF(ss_cat=\"large\",4,5)))","v":"NA"},null,{"$f":"$B$98&\" \"&\" - \"&B102","v":"Bypass Piping  - Steel"},3,3,2,3,3,2,3,3,2,0,0]
[5.5,"Inlet and Outlet Piping",null,null,null,null,null,null,null,null,null,null,null,null,null,null,null,null,null,null,null,null,0,0]
["5.5.1","Ductile Iron",{"$f":"in_out_pipe_length","v":340},"lf",{"$f":"in_out_pipe_diam","v":36},"in. diam",{"$f":"IF(curve=1,in_out_pipe_diam,VLOOKUP(in_out_pipe_diam,di_pipe_cost_cl,2))","v":36},"in. diam",{"$f":"IF(curve=1,di_pipe_eq_in_out,VLOOKUP(in_out_pipe_diam,di_pipe_cost_cl,3))","v":304.785582729},{"$f":"IF(I104=\"contact vendor\",\"--\",C104*I104)","v":103627.09812785999},{"$f":"VLOOKUP(in_out_pipe_diam,di_pipe_cost_cl,IF(ss_cat=\"large\",4,5))","v":40},0,{"$f":"$B$103&\" \"&\" - \"&B104","v":"Inlet and Outlet Piping  - Ductile Iron"},3,3,3,3,3,3,3,3,3,0,0]
["5.5.1","CPVC",{"$f":"in_out_pipe_length","v":340},"lf",{"$f":"in_out_pipe_diam","v":36},"in. diam",{"$f":"IF(curve=1,in_out_pipe_diam,VLOOKUP(in_out_pipe_diam,cpvc_pipe_cost_cl,2))","v":36},"in. diam",{"$f":"IF(curve=1,cpvc_pipe_eq_in_out,VLOOKUP(in_out_pipe_diam,cpvc_pipe_cost_cl,3))","v":"contact vendor"},{"$f":"IF(I105=\"contact vendor\",\"--\",C105*I105)","v":"--"},{"$f":"VLOOKUP(in_out_pipe_diam,cpvc_pipe_cost_cl,IF(ss_cat=\"large\",4,5))","v":22},0,{"$f":"$B$103&\" \"&\" - \"&B105","v":"Inlet and Outlet Piping  - CPVC"},2,1,4,2,1,4,2,1,4,{"$f":"IF(ISERROR(K105*L105),0,IF(K105<1,0,L105))","v":0},{"$f":"IF(W105,J105/K105,0)","v":0}]
["5.5.1","PVC",{"$f":"in_out_pipe_length","v":340},"lf",{"$f":"in_out_pipe_diam","v":36},"in. diam",{"$f":"IF(curve=1,in_out_pipe_diam,VLOOKUP(in_out_pipe_diam,pvc_pipe_cost_cl,2))","v":36},"in. diam",{"$f":"IF(curve=1,pvc_pipe_eq_in_out,VLOOKUP(in_out_pipe_diam,pvc_pipe_cost_cl,3))","v":153.88209752499998},{"$f":"IF(I106=\"contact vendor\",\"--\",C106*I106)","v":52319.913158499992},{"$f":"VLOOKUP(in_out_pipe_diam,pvc_pipe_cost_cl,IF(ss_cat=\"large\",4,5))","v":22},1,{"$f":"$B$103&\" \"&\" - \"&B106","v":"Inlet and Outlet Piping  - PVC"},1,2,5,1,2,5,1,2,5,1,2378.1778708409088]
["5.5.1","Stainless Steel",{"$f":"in_out_pipe_length","v":340},"lf",{"$f":"in_out_pipe_diam","v":36},"in. diam",{"$f":"IF(curve=1,in_out_pipe_diam,VLOOKUP(in_out_pipe_diam,ss_pipe_cost_cl,2))","v":36},"in. diam",{"$f":"IF(curve=1,ss_pipe_eq_in_out,VLOOKUP(in_out_pipe_diam,ss_pipe_cost_cl,3))","v":701.77336559299988},{"$f":"IF(I107=\"contact vendor\",\"--\",C107*I107)","v":238602.94430161995},{"$f":"VLOOKUP(in_out_pipe_diam,ss_pipe_cost_cl,IF(ss_cat=\"large\",4,5))","v":45},0,{"$f":"$B$103&\" \"&\" - \"&B107","v":"Inlet and Outlet Piping  - Stainless Steel"},5,5,1,5,5,1,5,5,1,0,0]
["5.5.1","Steel",{"$f":"in_out_pipe_length","v":340},"lf",{"$f":"in_out_pipe_diam","v":36},"in. diam",{"$f":"IF(curve=1,in_out_pipe_diam,VLOOKUP(in_out_pipe_diam,st_pipe_cost_cl,2))","v":36},"in. diam",{"$f":"IF(curve=1,st_pipe_eq_in_out,VLOOKUP(in_out_pipe_diam,st_pipe_cost_cl,3))","v":238.23638125999997},{"$f":"IF(I108=\"contact vendor\",\"--\",C108*I108)","v":81000.369628399989},{"$f":"VLOOKUP(in_out_pipe_diam,st_pipe_cost_cl,IF(ss_cat=\"large\",4,5))","v":35},0,{"$f":"$B$103&\" \"&\" - \"&B108","v":"Inlet and Outlet Piping  - Steel"},4,4,2,4,4,2,4,4,2,0,0]
[5.6,"Acid Piping",null,null,null,null,null,null,null,null,null,null,null,null,null,null,null,null,null,null,null,null,0,0]
["5.6.1","CPVC",{"$f":"acid_pipe_length","v":0},"lf",{"$f":"IF(acid_pipe_length=0,\"NA\",acid_pipe_diam)","v":"NA"},{"$f":"IF(acid_pipe_length=0,\"\",\"in. diam\")","v":""},{"$f":"IF(acid_pipe_length=0,\"NA\",IF(curve=1,acid_pipe_diam,VLOOKUP(acid_pipe_diam,cpvc_pipe_cost_cl,2)))","v":"NA"},{"$f":"IF(acid_pipe_length=0,\"\",\"in. diam\")","v":""},{"$f":"IF(acid_pipe_length=0,\"NA\",IF(curve=1,cpvc_pipe_eq_acid,VLOOKUP(acid_pipe_diam,cpvc_pipe_cost_cl,3)))","v":"NA"},{"$f":"IF(acid_pipe_length=0,\"--\",IF(I110=\"contact vendor\",\"--\",C110*I110))","v":"--"},{"$f":"IF(acid_pipe_length=0,\"NA\",VLOOKUP(acid_pipe_diam,cpvc_pipe_cost_cl,IF(ss_cat=\"large\",4,5)))","v":"NA"},null,{"$f":"$B$109&\" - \"&B110","v":"Acid Piping - CPVC"},2,1,2,2,1,2,2,1,2,0,0]
["5.6.1","PVC",{"$f":"acid_pipe_length","v":0},"lf",{"$f":"IF(acid_pipe_length=0,\"NA\",acid_pipe_diam)","v":"NA"},{"$f":"IF(acid_pipe_length=0,\"\",\"in. diam\")","v":""},{"$f":"IF(acid_pipe_length=0,\"NA\",IF(curve=1,acid_pipe_diam,VLOOKUP(acid_pipe_diam,pvc_pipe_cost_cl,2)))","v":"NA"},{"$f":"IF(acid_pipe_length=0,\"\",\"in. diam\")","v":""},{"$f":"IF(acid_pipe_length=0,\"NA\",IF(curve=1,pvc_pipe_eq_acid,VLOOKUP(acid_pipe_diam,pvc_pipe_cost_cl,3)))","v":"NA"},{"$f":"IF(acid_pipe_length=0,\"--\",IF(I111=\"contact vendor\",\"--\",C111*I111))","v":"--"},{"$f":"IF(acid_pipe_length=0,\"NA\",VLOOKUP(acid_pipe_diam,pvc_pipe_cost_cl,IF(ss_cat=\"large\",4,5)))","v":"NA"},null,{"$f":"$B$109&\" - \"&B111","v":"Acid Piping - PVC"},1,2,3,1,2,3,1,2,3,0,0]
["5.6.1","Stainless Steel",{"$f":"acid_pipe_length","v":0},"lf",{"$f":"IF(acid_pipe_length=0,\"NA\",acid_pipe_diam)","v":"NA"},{"$f":"IF(acid_pipe_length=0,\"\",\"in. diam\")","v":""},{"$f":"IF(acid_pipe_length=0,\"NA\",IF(curve=1,acid_pipe_diam,VLOOKUP(acid_pipe_diam,ss_pipe_cost_cl,2)))","v":"NA"},{"$f":"IF(acid_pipe_length=0,\"\",\"in. diam\")","v":""},{"$f":"IF(acid_pipe_length=0,\"NA\",IF(curve=1,ss_pipe_eq_acid,VLOOKUP(acid_pipe_diam,ss_pipe_cost_cl,3)))","v":"NA"},{"$f":"IF(acid_pipe_length=0,\"--\",IF(I112=\"contact vendor\",\"--\",C112*I112))","v":"--"},{"$f":"IF(acid_pipe_length=0,\"NA\",VLOOKUP(acid_pipe_diam,ss_pipe_cost_cl,IF(ss_cat=\"large\",4,5)))","v":"NA"},null,{"$f":"$B$109&\" - \"&B112","v":"Acid Piping - Stainless Steel"},3,3,1,3,3,1,3,3,1,0,0]
[5.7,"Caustic Piping",null,null,null,null,null,null,null,null,null,null,null,null,null,null,null,null,null,null,null,null,0,0]
["5.7.1","CPVC",{"$f":"caustic_pipe_length","v":0},"lf",{"$f":"IF(caustic_pipe_length=0,\"NA\",caustic_pipe_diam)","v":"NA"},{"$f":"IF(caustic_pipe_length=0,\"\",\"in. diam\")","v":""},{"$f":"IF(caustic_pipe_length=0,\"NA\",IF(curve=1,caustic_pipe_diam,VLOOKUP(caustic_pipe_diam,cpvc_pipe_cost_cl,2)))","v":"NA"},{"$f":"IF(caustic_pipe_length=0,\"\",\"in. diam\")","v":""},{"$f":"IF(caustic_pipe_length=0,\"NA\",IF(curve=1,cpvc_pipe_eq_caustic,VLOOKUP(caustic_pipe_diam,cpvc_pipe_cost_cl,3)))","v":"NA"},{"$f":"IF(caustic_pipe_length=0,\"--\",IF(I114=\"contact vendor\",\"--\",C114*I114))","v":"--"},{"$f":"IF(caustic_pipe_length=0,\"NA\",VLOOKUP(caustic_pipe_diam,cpvc_pipe_cost_cl,IF(ss_cat=\"large\",4,5)))","v":"NA"},null,{"$f":"$B$113&\" - \"&B114","v":"Caustic Piping - CPVC"},2,1,2,2,1,2,2,1,2,0,0]
["5.7.1","PVC",{"$f":"caustic_pipe_length","v":0},"lf",{"$f":"IF(caustic_pipe_length=0,\"NA\",caustic_pipe_diam)","v":"NA"},{"$f":"IF(caustic_pipe_length=0,\"\",\"in. diam\")","v":""},{"$f":"IF(caustic_pipe_length=0,\"NA\",IF(curve=1,caustic_pipe_diam,VLOOKUP(caustic_pipe_diam,pvc_pipe_cost_cl,2)))","v":"NA"},{"$f":"IF(caustic_pipe_length=0,\"\",\"in. diam\")","v":""},{"$f":"IF(caustic_pipe_length=0,\"NA\",IF(curve=1,pvc_pipe_eq_caustic,VLOOKUP(caustic_pipe_diam,pvc_pipe_cost_cl,3)))","v":"NA"},{"$f":"IF(caustic_pipe_length=0,\"--\",IF(I115=\"contact vendor\",\"--\",C115*I115))","v":"--"},{"$f":"IF(caustic_pipe_length=0,\"NA\",VLOOKUP(caustic_pipe_diam,pvc_pipe_cost_cl,IF(ss_cat=\"large\",4,5)))","v":"NA"},null,{"$f":"$B$113&\" - \"&B115","v":"Caustic Piping - PVC"},1,2,3,1,2,3,1,2,3,0,0]
["5.7.1","Stainless Steel",{"$f":"caustic_pipe_length","v":0},"lf",{"$f":"IF(caustic_pipe_length=0,\"NA\",caustic_pipe_diam)","v":"NA"},{"$f":"IF(caustic_pipe_length=0,\"\",\"in. diam\")","v":""},{"$f":"IF(caustic_pipe_length=0,\"NA\",IF(curve=1,caustic_pipe_diam,VLOOKUP(caustic_pipe_diam,ss_pipe_cost_cl,2)))","v":"NA"},{"$f":"IF(caustic_pipe_length=0,\"\",\"in. diam\")","v":""},{"$f":"IF(caustic_pipe_length=0,\"NA\",IF(curve=1,ss_pipe_eq_caustic,VLOOKUP(caustic_pipe_diam,ss_pipe_cost_cl,3)))","v":"NA"},{"$f":"IF(caustic_pipe_length=0,\"--\",IF(I116=\"contact vendor\",\"--\",C116*I116))","v":"--"},{"$f":"IF(caustic_pipe_length=0,\"NA\",VLOOKUP(caustic_pipe_diam,ss_pipe_cost_cl,IF(ss_cat=\"large\",4,5)))","v":"NA"},null,{"$f":"$B$113&\" - \"&B116","v":"Caustic Piping - Stainless Steel"},3,3,1,3,3,1,3,3,1,0,0]
[5.8,"Residuals Piping",null,null,null,null,null,null,null,null,null,null,null,null,null,null,null,null,null,null,null,null,0,0]
["5.8.1","CPVC",{"$f":"res_pipe_length","v":210},"lf",{"$f":"res_pipe_diam","v":6},"in. diam",{"$f":"IF(curve=1,res_pipe_diam,VLOOKUP(res_pipe_diam,cpvc_pipe_cost_cl,2))","v":6},"in. diam",{"$f":"IF(curve=1,cpvc_pipe_eq_res,VLOOKUP(res_pipe_diam,cpvc_pipe_cost_cl,3))","v":42.870345938},{"$f":"IF(I118=\"contact vendor\",\"--\",C118*I118)","v":9002.77264698},{"$f":"VLOOKUP(res_pipe_diam,cpvc_pipe_cost_cl,IF(ss_cat=\"large\",4,5))","v":22},0,{"$f":"$B$117&\" \"&\" - \"&B118","v":"Residuals Piping  - CPVC"},2,1,3,2,1,3,2,1,3,0,0]
["5.8.1","PVC",{"$f":"res_pipe_length","v":210},"lf",{"$f":"res_pipe_diam","v":6},"in. diam",{"$f":"IF(curve=1,res_pipe_diam,VLOOKUP(res_pipe_diam,pvc_pipe_cost_cl,2))","v":6},"in. diam",{"$f":"IF(curve=1,pvc_pipe_eq_res,VLOOKUP(res_pipe_diam,pvc_pipe_cost_cl,3))","v":7.7756844249999997},{"$f":"IF(I119=\"contact vendor\",\"--\",C119*I119)","v":1632.89372925},{"$f":"VLOOKUP(res_pipe_diam,pvc_pipe_cost_cl,IF(ss_cat=\"large\",4,5))","v":22},1,"Residuals Piping  - PVC",1,2,4,1,2,4,1,2,4,1,74.222442238636361]
["5.8.1","Stainless Steel",{"$f":"res_pipe_length","v":210},"lf",{"$f":"res_pipe_diam","v":6},"in. diam",{"$f":"IF(curve=1,res_pipe_diam,VLOOKUP(res_pipe_diam,ss_pipe_cost_cl,2))","v":6},"in. diam",{"$f":"IF(curve=1,ss_pipe_eq_res,VLOOKUP(res_pipe_diam,ss_pipe_cost_cl,3))","v":155.30187653300001},{"$f":"IF(I120=\"contact vendor\",\"--\",C120*I120)","v":32613.394071930001},{"$f":"VLOOKUP(res_pipe_diam,ss_pipe_cost_cl,IF(ss_cat=\"large\",4,5))","v":45},0,"Residuals Piping  - Stainless Steel",4,4,1,4,4,1,4,4,1,0,0]
["5.8.1","Steel",{"$f":"res_pipe_length","v":210},"lf",{"$f":"res_pipe_diam","v":6},"in. diam",{"$f":"IF(curve=1,res_pipe_diam,VLOOKUP(res_pipe_diam,st_pipe_cost_cl,2))","v":6},"in. diam",{"$f":"IF(curve=1,st_pipe_eq_res,VLOOKUP(res_pipe_diam,st_pipe_cost_cl,3))","v":100.28957255},{"$f":"IF(I121=\"contact vendor\",\"--\",C121*I121)","v":21060.810235500001},{"$f":"VLOOKUP(res_pipe_diam,st_pipe_cost_cl,IF(ss_cat=\"large\",4,5))","v":35},0,"Residuals Piping  - Steel",3,3,2,3,3,2,3,3,2,0,0]
["5.8.2","Excavation",{"$f":"res_trench_vol","v":42.931262230269041},"cy","NA",null,"NA",null,{"$f":"IF(C122=0,\"NA\",VLOOKUP(0,excavate_cost_cl,3))","v":31.07454575596817},{"$f":"IF(OR(I122=\"contact vendor\",C122=0),\"--\",C122*I122)","v":1334.0694725359635},{"$f":"IF(I122=\"NA\",\"N/A\",IF(L118=1,K118,IF(L119=1,K119,IF(L120=1,K120,IF(L121=1,K121,\"N/A\")))))","v":22},1,"Residuals Piping  - Excavation",1,1,1,1,1,1,1,1,1,1,60.639521478907433]
["5.8.3","Bedding",{"$f":"res_pipe_bedding_vol","v":1.4183247754951678},"cy","NA",null,"NA",null,{"$f":"IF(C123=0,\"NA\",VLOOKUP(0,bedding_cost_cl,3))","v":56.007394993191568},{"$f":"IF(OR(I123=\"contact vendor\",C123=0),\"--\",C123*I123)","v":79.436675929787611},{"$f":"IF(I123=\"NA\",\"N/A\",IF(L118=1,K118,IF(L119=1,K119,IF(L120=1,K120,IF(L121=1,K121,\"N/A\")))))","v":22},1,"Residuals Piping  - Bedding",1,1,1,1,1,1,1,1,1,1,3.6107579968085277]
["5.8.4","Backfill and Compaction ",{"$f":"res_trench_vol","v":42.931262230269041},"cy","NA",null,"NA",null,{"$f":"IF(C124=0,\"NA\",VLOOKUP(0,backfill_cost_cl,3))","v":14.406259946949602},{"$f":"IF(OR(I124=\"contact vendor\",C124=0),\"--\",C124*I124)","v":618.47892353991517},{"$f":"IF(I124=\"NA\",\"N/A\",IF(L118=1,K118,IF(L119=1,K119,IF(L120=1,K120,IF(L121=1,K121,\"N/A\")))))","v":22},1,"Residuals Piping  - Backfill and Compaction ",1,1,1,1,1,1,1,1,1,1,28.112678342723417]
["5.8.5","Thrust Blocks",{"$f":"res_block_vol","v":1.7789988557834608},"cy","NA",null,"NA",null,{"$f":"IF(C125=0,\"NA\",VLOOKUP(0,conc_basin_cost_cl,3))","v":601.26511720822305},{"$f":"IF(OR(I125=\"contact vendor\",C125=0),\"--\",C125*I125)","v":1069.6499555359374},{"$f":"IF(I125=\"NA\",\"N/A\",IF(L118=1,K118,IF(L119=1,K119,IF(L120=1,K120,IF(L121=1,K121,\"N/A\")))))","v":22},1,"Residuals Piping  - Thrust Blocks",1,1,1,1,1,1,1,1,1,1,48.620452524360786]
[5.9,"Polymer Piping",null,null,null,null,null,null,null,null,null,null,null,null,null,null,null,null,null,null,null,null,0,0]
["5.9.1","CPVC",{"$f":"polymer_pipe_length","v":0},"lf",{"$f":"IF(C127=0,\"NA\",polymer_pipe_diam)","v":"NA"},{"$f":"IF(C127=0,\"\",\"in diam\")","v":""},{"$f":"IF(C127=0,\"NA\",IF(curve=1,polymer_pipe_diam,VLOOKUP(polymer_pipe_diam,cpvc_pipe_cost_cl,2)))","v":"NA"},{"$f":"IF(C127=0,\"\",\"in diam\")","v":""},{"$f":"IF(C127=0,\"NA\",IF(curve=1,cpvc_pipe_eq_polymer,VLOOKUP(polymer_pipe_diam,cpvc_pipe_cost_cl,3)))","v":"NA"},{"$f":"IF(OR(C127=0,I127=\"contact vendor\"),\"--\",C127*I127)","v":"--"},{"$f":"IF(C127=0,\"NA\",VLOOKUP(polymer_pipe_diam,cpvc_pipe_cost_cl,IF(ss_cat=\"large\",4,5)))","v":"NA"},null,{"$f":"$B$126&\" \"&\" - \"&B127","v":"Polymer Piping  - CPVC"},2,1,3,2,1,3,2,1,3,0,0]
["5.9.1","PVC",{"$f":"polymer_pipe_length","v":0},"lf",{"$f":"IF(C128=0,\"NA\",polymer_pipe_diam)","v":"NA"},{"$f":"IF(C128=0,\"\",\"in diam\")","v":""},{"$f":"IF(C128=0,\"NA\",IF(curve=1,polymer_pipe_diam,VLOOKUP(polymer_pipe_diam,pvc_pipe_cost_cl,2)))","v":"NA"},{"$f":"IF(C128=0,\"\",\"in diam\")","v":""},{"$f":"IF(C128=0,\"NA\",IF(curve=1,pvc_pipe_eq_polymer,VLOOKUP(polymer_pipe_diam,pvc_pipe_cost_cl,3)))","v":"NA"},{"$f":"IF(OR(C128=0,I128=\"contact vendor\"),\"--\",C128*I128)","v":"--"},{"$f":"IF(C128=0,\"NA\",VLOOKUP(polymer_pipe_diam,pvc_pipe_cost_cl,IF(ss_cat=\"large\",4,5)))","v":"NA"},null,{"$f":"$B$126&\" \"&\" - \"&B128","v":"Polymer Piping  - PVC"},1,2,4,1,2,4,1,2,4,0,0]
["5.9.1","Stainless Steel",{"$f":"polymer_pipe_length","v":0},"lf",{"$f":"IF(C129=0,\"NA\",polymer_pipe_diam)","v":"NA"},{"$f":"IF(C129=0,\"\",\"in diam\")","v":""},{"$f":"IF(C129=0,\"NA\",IF(curve=1,polymer_pipe_diam,VLOOKUP(polymer_pipe_diam,ss_pipe_cost_cl,2)))","v":"NA"},{"$f":"IF(C129=0,\"\",\"in diam\")","v":""},{"$f":"IF(C129=0,\"NA\",IF(curve=1,ss_pipe_eq_polymer,VLOOKUP(polymer_pipe_diam,ss_pipe_cost_cl,3)))","v":"NA"},{"$f":"IF(OR(C129=0,I129=\"contact vendor\"),\"--\",C129*I129)","v":"--"},{"$f":"IF(C129=0,\"NA\",VLOOKUP(polymer_pipe_diam,ss_pipe_cost_cl,IF(ss_cat=\"large\",4,5)))","v":"NA"},null,{"$f":"$B$126&\" \"&\" - \"&B129","v":"Polymer Piping  - Stainless Steel"},4,4,1,4,4,1,4,4,1,0,0]
["5.9.1","Steel",{"$f":"polymer_pipe_length","v":0},"lf",{"$f":"IF(C130=0,\"NA\",polymer_pipe_diam)","v":"NA"},{"$f":"IF(C130=0,\"\",\"in diam\")","v":""},{"$f":"IF(C130=0,\"NA\",IF(curve=1,polymer_pipe_diam,VLOOKUP(polymer_pipe_diam,st_pipe_cost_cl,2)))","v":"NA"},{"$f":"IF(C130=0,\"\",\"in diam\")","v":""},{"$f":"IF(C130=0,\"NA\",IF(curve=1,st_pipe_eq_polymer,VLOOKUP(polymer_pipe_diam,st_pipe_cost_cl,3)))","v":"NA"},{"$f":"IF(OR(C130=0,I130=\"contact vendor\"),\"--\",C130*I130)","v":"--"},{"$f":"IF(C130=0,\"NA\",VLOOKUP(polymer_pipe_diam,st_pipe_cost_cl,IF(ss_cat=\"large\",4,5)))","v":"NA"},null,{"$f":"$B$126&\" \"&\" - \"&B130","v":"Polymer Piping  - Steel"},3,3,2,3,3,2,3,3,2,0,0]
[6,"Valves and Fittings",null,null,null,null,null,null,null,null,null,null,null,null,null,null,null,null,null,null,null,null,0,0]
[6.1,"Motor/Air Operated (on/off)",null,null,null,null,null,null,null,null,null,null,null,null,null,null,null,null,null,null,null,null,0,0]
["6.1.1","Process - Polypropylene/PVC",{"$f":"tot_proc_MOVs","v":103},"units",{"$f":"tank_valve_size","v":12},"in. diam",{"$f":"IF(curve=1,tank_valve_size,VLOOKUP(tank_valve_size,pp_mov_cost_cl,2))","v":12},"in. diam",{"$f":"IF(curve=1,pp_mov_eq_tank,VLOOKUP(tank_valve_size,pp_mov_cost_cl,3))","v":5719.9902432564077},{"$f":"IF(I133=\"contact vendor\",\"--\",C133*I133)","v":589158.99505540996},{"$f":"VLOOKUP(tank_valve_size,pp_mov_cost_cl,IF(ss_cat=\"large\",4,5))","v":25},1,{"$f":"$B$131 & \" - \" & $B$132&\" \"&\" - \"&B133","v":"Valves and Fittings - Motor/Air Operated (on/off)  - Process - Polypropylene/PVC"},1,2,3,1,2,3,1,2,3,1,23566.359802216397]
["6.1.1","Process - Stainless Steel",{"$f":"tot_proc_MOVs","v":103},"units",{"$f":"tank_valve_size","v":12},"in. diam",{"$f":"IF(curve=1,tank_valve_size,VLOOKUP(tank_valve_size,ss_mov_cost_cl,2))","v":12},"in. diam",{"$f":"IF(curve=1,ss_mov_eq_tank,VLOOKUP(tank_valve_size,ss_mov_cost_cl,3))","v":15992.464987597999},{"$f":"IF(I134=\"contact vendor\",\"--\",C134*I134)","v":1647223.893722594},{"$f":"VLOOKUP(tank_valve_size,ss_mov_cost_cl,IF(ss_cat=\"large\",4,5))","v":25},0,{"$f":"$B$131 & \" - \" & $B$132&\" \"&\" - \"&B134","v":"Valves and Fittings - Motor/Air Operated (on/off)  - Process - Stainless Steel"},3,3,1,3,3,1,3,3,1,0,0]
["6.1.1","Process - Cast Iron",{"$f":"tot_proc_MOVs","v":103},"units",{"$f":"tank_valve_size","v":12},"in. diam",{"$f":"IF(curve=1,tank_valve_size,VLOOKUP(tank_valve_size,ci_mov_cost_cl,2))","v":12},"in. diam",{"$f":"IF(curve=1,pp_mov_eq_tank,VLOOKUP(tank_valve_size,ci_mov_cost_cl,3))","v":5719.9902432564077},{"$f":"IF(I135=\"contact vendor\",\"--\",C135*I135)","v":589158.99505540996},{"$f":"VLOOKUP(tank_valve_size,ci_mov_cost_cl,IF(ss_cat=\"large\",4,5))","v":25},0,"Valves and Fittings - Motor/Air Operated (on/off)  - Process - Cast Iron",2,1,2,2,1,2,2,1,2,0,0]
["6.1.2","Backwash - Polypropylene/PVC",{"$f":"tot_back_MOVs","v":63},"units",{"$f":"IF(tot_back_MOVs=0,\"NA\",back_valve_size)","v":8},{"$f":"IF(tot_back_MOVs=0,\"\",\"in. diam\")","v":"in. diam"},{"$f":"IF(tot_back_MOVs=0,\"NA\",IF(curve=1,back_valve_size,VLOOKUP(back_valve_size,pp_mov_cost_cl,2)))","v":8},{"$f":"IF(tot_back_MOVs=0,\"\",\"in. diam\")","v":"in. diam"},{"$f":"IF(tot_back_MOVs=0,\"NA\",IF(curve=1,pp_mov_eq_back,VLOOKUP(back_valve_size,pp_mov_cost_cl,3)))","v":2443.0306534666761},{"$f":"IF(tot_back_MOVs=0,\"--\",IF(I136=\"contact vendor\",\"--\",C136*I136))","v":153910.9311684006},{"$f":"IF(tot_back_MOVs=0,\"NA\",VLOOKUP(back_valve_size,pp_mov_cost_cl,IF(ss_cat=\"large\",4,5)))","v":25},1,"Valves and Fittings - Motor/Air Operated (on/off)  - Backwash - Polypropylene/PVC",1,2,3,1,2,3,1,2,3,1,6156.4372467360236]
["6.1.2","Backwash - Stainless Steel",{"$f":"tot_back_MOVs","v":63},"units",{"$f":"IF(tot_back_MOVs=0,\"NA\",back_valve_size)","v":8},{"$f":"IF(tot_back_MOVs=0,\"\",\"in. diam\")","v":"in. diam"},{"$f":"IF(tot_back_MOVs=0,\"NA\",IF(curve=1,back_valve_size,VLOOKUP(back_valve_size,ss_mov_cost_cl,2)))","v":8},"in. diam",{"$f":"IF(tot_back_MOVs=0,\"NA\",IF(curve=1,ss_mov_eq_back,VLOOKUP(back_valve_size,ss_mov_cost_cl,3)))","v":8267.4202823539999},{"$f":"IF(tot_back_MOVs=0,\"--\",IF(I137=\"contact vendor\",\"--\",C137*I137))","v":520847.477788302},{"$f":"IF(tot_back_MOVs=0,\"NA\",VLOOKUP(back_valve_size,ss_mov_cost_cl,IF(ss_cat=\"large\",4,5)))","v":25},0,"Valves and Fittings - Motor/Air Operated (on/off)  - Backwash - Stainless Steel",3,3,1,3,3,1,3,3,1,0,0]
["6.1.2","Backwash - Cast Iron",{"$f":"tot_back_MOVs","v":63},"units",{"$f":"IF(tot_back_MOVs=0,\"NA\",back_valve_size)","v":8},"in. diam",{"$f":"IF(tot_back_MOVs=0,\"NA\",IF(curve=1,back_valve_size,VLOOKUP(back_valve_size,ci_mov_cost_cl,2)))","v":8},"in. diam",{"$f":"IF(tot_back_MOVs=0,\"NA\",IF(curve=1,ci_mov_eq_back,VLOOKUP(back_valve_size,ci_mov_cost_cl,3)))","v":3411.016918495},{"$f":"IF(tot_back_MOVs=0,\"--\",IF(I138=\"contact vendor\",\"--\",C138*I138))","v":214894.065865185},{"$f":"IF(tot_back_MOVs=0,\"NA\",VLOOKUP(back_valve_size,ci_mov_cost_cl,IF(ss_cat=\"large\",4,5)))","v":25},0,{"$f":"$B$131 & \" - \" & $B$132&\" \"&\" - \"&B138","v":"Valves and Fittings - Motor/Air Operated (on/off)  - Backwash - Cast Iron"},2,1,2,2,1,2,2,1,2,0,0]
["6.1.3","Regenerant - Polypropylene/PVC",{"$f":"tot_brine_MOVs","v":0},"units",{"$f":"IF(tot_brine_MOVs=0,\"NA\",brine_valve_size)","v":"NA"},{"$f":"IF(tot_brine_MOVs=0,\"\",\"in. diam\")","v":""},{"$f":"IF(tot_brine_MOVs=0,\"NA\",IF(curve=1,brine_valve_size,VLOOKUP(brine_valve_size,pp_mov_cost_cl,2)))","v":"NA"},{"$f":"IF(tot_brine_MOVs=0,\"\",\"in. diam\")","v":""},{"$f":"IF(tot_brine_MOVs=0,\"NA\",IF(curve=1,pp_mov_eq_brine,VLOOKUP(brine_valve_size,pp_mov_cost_cl,3)))","v":"NA"},{"$f":"IF(tot_brine_MOVs=0,\"--\",IF(I139=\"contact vendor\",\"--\",C139*I139))","v":"--"},{"$f":"IF(tot_brine_MOVs=0,\"NA\",VLOOKUP(brine_valve_size,pp_mov_cost_cl,IF(ss_cat=\"large\",4,5)))","v":"NA"},null,"Valves and Fittings - Motor/Air Operated (on/off)  - Regenerant - Polypropylene/PVC",1,2,2,1,2,2,1,2,2,0,0]
["6.1.3","Regenerant - Stainless Steel",{"$f":"tot_brine_MOVs","v":0},"units",{"$f":"IF(tot_brine_MOVs=0,\"NA\",brine_valve_size)","v":"NA"},{"$f":"IF(tot_brine_MOVs=0,\"\",\"in. diam\")","v":""},{"$f":"IF(tot_brine_MOVs=0,\"NA\",IF(curve=1,brine_valve_size,VLOOKUP(brine_valve_size,ss_mov_cost_cl,2)))","v":"NA"},{"$f":"IF(tot_brine_MOVs=0,\"\",\"in. diam\")","v":""},{"$f":"IF(tot_brine_MOVs=0,\"NA\",IF(curve=1,ss_mov_eq_brine,VLOOKUP(brine_valve_size,ss_mov_cost_cl,3)))","v":"NA"},{"$f":"IF(tot_brine_MOVs=0,\"--\",IF(I140=\"contact vendor\",\"--\",C140*I140))","v":"--"},{"$f":"IF(tot_brine_MOVs=0,\"NA\",VLOOKUP(brine_valve_size,ss_mov_cost_cl,IF(ss_cat=\"large\",4,5)))","v":"NA"},null,"Valves and Fittings - Motor/Air Operated (on/off)  - Regenerant - Stainless Steel",2,1,1,2,1,1,2,1,1,0,0]
["6.1.4","Bypass - Polypropylene/PVC",{"$f":"IF(bp_pct>0,tot_bp_MOVs,0)","v":0},"units",{"$f":"IF(bp_pct=0,\"NA\",bypass_valve_size)","v":"NA"},{"$f":"IF(bp_pct=0,\" \",\"in. diam\")","v":" "},{"$f":"IF(bp_pct=0,\"NA\",(IF(curve=1,bypass_valve_size,VLOOKUP(bypass_valve_size,pp_mov_cost_cl,2))))","v":"NA"},{"$f":"IF(bp_pct=0,\" \",\"in. diam\")","v":" "},{"$f":"IF(bp_pct=0,\"NA\",(IF(curve=1,pp_mov_eq_bp,VLOOKUP(bypass_valve_size,pp_mov_cost_cl,3))))","v":"NA"},{"$f":"IF(OR(C141=0,I141=\"contact vendor\"),\"--\",C141*I141)","v":"--"},{"$f":"IF(bp_pct=0,\"NA\",VLOOKUP(bypass_valve_size,pp_mov_cost_cl,IF(ss_cat=\"large\",4,5)))","v":"NA"},null,"Valves and Fittings - Motor/Air Operated (on/off)  - Bypass - Polypropylene/PVC",1,2,3,1,2,3,1,2,3,0,0]
["6.1.4","Bypass - Stainless Steel",{"$f":"IF(bp_pct>0,tot_bp_MOVs,0)","v":0},"units",{"$f":"IF(bp_pct=0,\"NA\",bypass_valve_size)","v":"NA"},{"$f":"IF(bp_pct=0,\" \",\"in. diam\")","v":" "},{"$f":"IF(bp_pct=0,\"NA\",(IF(curve=1,bypass_valve_size,VLOOKUP(bypass_valve_size,ss_mov_cost_cl,2))))","v":"NA"},{"$f":"IF(bp_pct=0,\" \",\"in. diam\")","v":" "},{"$f":"IF(bp_pct=0,\"NA\",(IF(curve=1,ss_mov_eq_bp,VLOOKUP(bypass_valve_size,ss_mov_cost_cl,3))))","v":"NA"},{"$f":"IF(OR(C142=0,I142=\"contact vendor\"),\"--\",C142*I142)","v":"--"},{"$f":"IF(bp_pct=0,\"NA\",VLOOKUP(bypass_valve_size,ss_mov_cost_cl,IF(ss_cat=\"large\",4,5)))","v":"NA"},null,"Valves and Fittings - Motor/Air Operated (on/off)  - Bypass - Stainless Steel",3,3,1,3,3,1,3,3,1,0,0]
["6.1.4","Bypass - Cast Iron",{"$f":"IF(bp_pct>0,tot_bp_MOVs,0)","v":0},"units",{"$f":"IF(bp_pct=0,\"NA\",bypass_valve_size)","v":"NA"},{"$f":"IF(bp_pct=0,\" \",\"in. diam\")","v":" "},{"$f":"IF(bp_pct=0,\"NA\",(IF(curve=1,bypass_valve_size,VLOOKUP(bypass_valve_size,ci_mov_cost_cl,2))))","v":"NA"},{"$f":"IF(bp_pct=0,\" \",\"in. diam\")","v":" "},{"$f":"IF(bp_pct=0,\"NA\",(IF(curve=1,ci_mov_eq_bp,VLOOKUP(bypass_valve_size,ci_mov_cost_cl,3))))","v":"NA"},{"$f":"IF(OR(C143=0,I143=\"contact vendor\"),\"--\",C143*I143)","v":"--"},{"$f":"IF(bp_pct=0,\"NA\",VLOOKUP(bypass_valve_size,ci_mov_cost_cl,IF(ss_cat=\"large\",4,5)))","v":"NA"},null,{"$f":"$B$131 & \" - \" & $B$132&\" \"&\" - \"&B143","v":"Valves and Fittings - Motor/Air Operated (on/off)  - Bypass - Cast Iron"},2,1,2,2,1,2,2,1,2,0,0]
["6.1.5","Acid - Polypropylene/PVC",{"$f":"tot_acid_MOVs","v":0},"units",{"$f":"IF(tot_acid_MOVs=0,\"NA\",acid_valve_size)","v":"NA"},{"$f":"IF(tot_acid_MOVs=0,\"\",\"in. diam\")","v":""},{"$f":"IF(tot_acid_MOVs=0,\"NA\",IF(curve=1,acid_valve_size,VLOOKUP(acid_valve_size,pp_mov_cost_cl,2)))","v":"NA"},{"$f":"IF(tot_acid_MOVs=0,\"\",\"in. diam\")","v":""},{"$f":"IF(tot_acid_MOVs=0,\"NA\",IF(curve=1,pp_mov_eq_acid,VLOOKUP(acid_valve_size,pp_mov_cost_cl,3)))","v":"NA"},{"$f":"IF(tot_acid_MOVs=0,\"--\",IF(I144=\"contact vendor\",\"--\",C144*I144))","v":"--"},{"$f":"IF(tot_acid_MOVs=0,\"NA\",VLOOKUP(acid_valve_size,pp_mov_cost_cl,IF(ss_cat=\"large\",4,5)))","v":"NA"},null,"Valves and Fittings - Motor/Air Operated (on/off)  - Acid - Polypropylene/PVC",1,2,2,1,2,2,1,2,2,0,0]
["6.1.5","Acid - Stainless Steel",{"$f":"tot_acid_MOVs","v":0},"units",{"$f":"IF(tot_acid_MOVs=0,\"NA\",acid_valve_size)","v":"NA"},{"$f":"IF(tot_acid_MOVs=0,\"\",\"in. diam\")","v":""},{"$f":"IF(tot_acid_MOVs=0,\"NA\",IF(curve=1,acid_valve_size,VLOOKUP(acid_valve_size,ss_mov_cost_cl,2)))","v":"NA"},{"$f":"IF(tot_acid_MOVs=0,\"\",\"in. diam\")","v":""},{"$f":"IF(tot_acid_MOVs=0,\"NA\",IF(curve=1,ss_mov_eq_acid,VLOOKUP(acid_valve_size,ss_mov_cost_cl,3)))","v":"NA"},{"$f":"IF(tot_acid_MOVs=0,\"--\",IF(I145=\"contact vendor\",\"--\",C145*I145))","v":"--"},{"$f":"IF(tot_acid_MOVs=0,\"NA\",VLOOKUP(acid_valve_size,ss_mov_cost_cl,IF(ss_cat=\"large\",4,5)))","v":"NA"},null,"Valves and Fittings - Motor/Air Operated (on/off)  - Acid - Stainless Steel",2,1,1,2,1,1,2,1,1,0,0]
["6.1.6","Caustic - Polypropylene/PVC",{"$f":"tot_caustic_MOVs","v":0},"units",{"$f":"IF(tot_caustic_MOVs=0,\"NA\",caustic_valve_size)","v":"NA"},{"$f":"IF(tot_caustic_MOVs=0,\"\",\"in. diam\")","v":""},{"$f":"IF(tot_caustic_MOVs=0,\"NA\",IF(curve=1,caustic_valve_size,VLOOKUP(caustic_valve_size,pp_mov_cost_cl,2)))","v":"NA"},{"$f":"IF(tot_caustic_MOVs=0,\"\",\"in. diam\")","v":""},{"$f":"IF(tot_caustic_MOVs=0,\"NA\",IF(curve=1,pp_mov_eq_caustic,VLOOKUP(caustic_valve_size,pp_mov_cost_cl,3)))","v":"NA"},{"$f":"IF(tot_caustic_MOVs=0,\"--\",IF(I146=\"contact vendor\",\"--\",C146*I146))","v":"--"},{"$f":"IF(tot_caustic_MOVs=0,\"NA\",VLOOKUP(caustic_valve_size,pp_mov_cost_cl,IF(ss_cat=\"large\",4,5)))","v":"NA"},null,"Valves and Fittings - Motor/Air Operated (on/off)  - Caustic - Polypropylene/PVC",1,2,2,1,2,2,1,2,2,0,0]
["6.1.6","Caustic - Stainless Steel",{"$f":"tot_caustic_MOVs","v":0},"units",{"$f":"IF(tot_caustic_MOVs=0,\"NA\",caustic_valve_size)","v":"NA"},{"$f":"IF(tot_caustic_MOVs=0,\"\",\"in. diam\")","v":""},{"$f":"IF(tot_caustic_MOVs=0,\"NA\",IF(curve=1,caustic_valve_size,VLOOKUP(caustic_valve_size,ss_mov_cost_cl,2)))","v":"NA"},{"$f":"IF(tot_caustic_MOVs=0,\"\",\"in. diam\")","v":""},{"$f":"IF(tot_caustic_MOVs=0,\"NA\",IF(curve=1,ss_mov_eq_caustic,VLOOKUP(caustic_valve_size,ss_mov_cost_cl,3)))","v":"NA"},{"$f":"IF(tot_caustic_MOVs=0,\"--\",IF(I147=\"contact vendor\",\"--\",C147*I147))","v":"--"},{"$f":"IF(tot_caustic_MOVs=0,\"NA\",VLOOKUP(caustic_valve_size,ss_mov_cost_cl,IF(ss_cat=\"large\",4,5)))","v":"NA"},null,"Valves and Fittings - Motor/Air Operated (on/off)  - Caustic - Stainless Steel",2,1,1,2,1,1,2,1,1,0,0]
["6.1.7","Residuals - Polypropylene/PVC",{"$f":"total_res_MOVs","v":0},"units",{"$f":"IF(C148=0,\"NA\",res_valve_size)","v":"NA"},{"$f":"IF(C148=0,\"\",\"in. diam\")","v":""},{"$f":"IF(C148=0,\"NA\",IF(curve=1,res_valve_size,VLOOKUP(res_valve_size,pp_mov_cost_cl,2)))","v":"NA"},{"$f":"IF(C148=0,\"\",\"in. diam\")","v":""},{"$f":"IF(C148=0,0,IF(curve=1,pp_mov_eq_res,VLOOKUP(res_valve_size,pp_mov_cost_cl,3)))","v":0},{"$f":"IF(I148=\"contact vendor\",\"--\",C148*I148)","v":0},{"$f":"IF(C148=0,\"NA\",VLOOKUP(res_valve_size,pp_mov_cost_cl,IF(ss_cat=\"large\",4,5)))","v":"NA"},null,"Valves and Fittings - Motor/Air Operated (on/off)  - Residuals - Polypropylene/PVC",1,2,3,1,2,3,1,2,3,0,0]
["6.1.7","Residuals - Stainless Steel",{"$f":"total_res_MOVs","v":0},"units",{"$f":"IF(C149=0,\"NA\",res_valve_size)","v":"NA"},"",{"$f":"IF(C149=0,\"NA\",IF(curve=1,res_valve_size,VLOOKUP(res_valve_size,ss_mov_cost_cl,2)))","v":"NA"},"",{"$f":"IF(C149=0,0,IF(curve=1,ss_mov_eq_res,VLOOKUP(res_valve_size,ss_mov_cost_cl,3)))","v":0},{"$f":"IF(I149=\"contact vendor\",\"--\",C149*I149)","v":0},{"$f":"IF(C149=0,\"NA\",VLOOKUP(res_valve_size,ss_mov_cost_cl,IF(ss_cat=\"large\",4,5)))","v":"NA"},null,"Valves and Fittings - Motor/Air Operated (on/off)  - Residuals - Stainless Steel",3,3,1,3,3,1,3,3,1,0,0]
["6.1.7","Residuals - Cast Iron",{"$f":"total_res_MOVs","v":0},"units",{"$f":"IF(C150=0,\"NA\",res_valve_size)","v":"NA"},"",{"$f":"IF(C150=0,\"NA\",IF(curve=1,res_valve_size,VLOOKUP(res_valve_size,ci_mov_cost_cl,2)))","v":"NA"},"",{"$f":"IF(C150=0,0,IF(curve=1,ci_mov_eq_res,VLOOKUP(res_valve_size,ci_mov_cost_cl,3)))","v":0},{"$f":"IF(I150=\"contact vendor\",\"--\",C150*I150)","v":0},{"$f":"IF(C150=0,\"NA\",VLOOKUP(res_valve_size,ci_mov_cost_cl,IF(ss_cat=\"large\",4,5)))","v":"NA"},null,"Valves and Fittings - Motor/Air Operated (on/off)  - Residuals - Cast Iron",2,1,2,2,1,2,2,1,2,0,0]
["6.1.8","Polymer- Polypropylene/PVC",{"$f":"tot_polymer_MOVs","v":0},"units",{"$f":"IF(C151=0,\"NA\",polymer_valve_size)","v":"NA"},"",{"$f":"IF(C151=0,\"NA\",IF(curve=1,polymer_valve_size,VLOOKUP(polymer_valve_size,pp_mov_cost_cl,2)))","v":"NA"},"",{"$f":"IF(C151=0,\"NA\",IF(curve=1,pp_mov_eq_polymer,VLOOKUP(polymer_valve_size,pp_mov_cost_cl,3)))","v":"NA"},{"$f":"IF(OR(C151=0,I151=\"contact vendor\"),\"--\",C151*I151)","v":"--"},{"$f":"IF(C151=0,\"NA\",VLOOKUP(polymer_valve_size,pp_mov_cost_cl,IF(ss_cat=\"large\",4,5)))","v":"NA"},null,"Valves and Fittings - Motor/Air Operated (on/off)  - Polymer- Polypropylene/PVC",1,2,3,1,2,3,1,2,3,0,0]
["6.1.8","Polymer- Stainless Steel",{"$f":"tot_polymer_MOVs","v":0},"units",{"$f":"IF(C152=0,\"NA\",polymer_valve_size)","v":"NA"},"",{"$f":"IF(C152=0,\"NA\",IF(curve=1,polymer_valve_size,VLOOKUP(polymer_valve_size,ss_mov_cost_cl,2)))","v":"NA"},"",{"$f":"IF(C152=0,\"NA\",IF(curve=1,ss_mov_eq_polymer,VLOOKUP(polymer_valve_size,ss_mov_cost_cl,3)))","v":"NA"},{"$f":"IF(OR(C152=0,I152=\"contact vendor\"),\"--\",C152*I152)","v":"--"},{"$f":"IF(C152=0,\"NA\",VLOOKUP(polymer_valve_size,ss_mov_cost_cl,IF(ss_cat=\"large\",4,5)))","v":"NA"},null,"Valves and Fittings - Motor/Air Operated (on/off)  - Polymer- Stainless Steel",3,3,1,3,3,1,3,3,1,0,0]
["6.1.8","Polymer- Cast Iron",{"$f":"tot_polymer_MOVs","v":0},"units",{"$f":"IF(C153=0,\"NA\",polymer_valve_size)","v":"NA"},"",{"$f":"IF(C153=0,\"NA\",IF(curve=1,polymer_valve_size,VLOOKUP(polymer_valve_size,ci_mov_cost_cl,2)))","v":"NA"},"",{"$f":"IF(C153=0,\"NA\",IF(curve=1,ci_mov_eq_polymer,VLOOKUP(polymer_valve_size,ci_mov_cost_cl,3)))","v":"NA"},{"$f":"IF(OR(C153=0,I153=\"contact vendor\"),\"--\",C153*I153)","v":"--"},{"$f":"IF(C153=0,\"NA\",VLOOKUP(polymer_valve_size,ci_mov_cost_cl,IF(ss_cat=\"large\",4,5)))","v":"NA"},null,"Valves and Fittings - Motor/Air Operated (on/off)  - Polymer- Cast Iron",2,1,2,2,1,2,2,1,2,0,0]
[6.2,"Manual",null,null,null,null,null,null,null,null,null,null,null,null,null,null,null,null,null,null,null,null,0,0]
["6.2.1","Inlet and outlet - Polypropylene/PVC",{"$f":"tot_man_valves","v":2},"units",{"$f":"in_valve_size","v":36},"in. diam",{"$f":"IF(curve=1,in_valve_size,VLOOKUP(in_valve_size,pp_man_cost_cl,2))","v":36},"in. diam",{"$f":"IF(curve=1,pp_man_eq,VLOOKUP(in_valve_size,pp_man_cost_cl,3))","v":"contact vendor"},{"$f":"IF(I155=\"contact vendor\",\"--\",C155*I155)","v":"--"},{"$f":"VLOOKUP(in_valve_size,pp_man_cost_cl,IF(ss_cat=\"large\",4,5))","v":25},0,{"$f":"$B$131 & \" - \" & $B$154&\" \"&\" - \"&B155","v":"Valves and Fittings - Manual  - Inlet and outlet - Polypropylene/PVC"},1,2,3,1,2,3,1,2,3,0,0]
["6.2.1","Inlet and outlet - Stainless Steel",{"$f":"tot_man_valves","v":2},"units",{"$f":"in_valve_size","v":36},"in. diam",{"$f":"IF(curve=1,in_valve_size,VLOOKUP(in_valve_size,ss_man_cost_cl,2))","v":36},"in. diam",{"$f":"IF(curve=1,ss_man_eq,VLOOKUP(in_valve_size,ss_man_cost_cl,3))","v":"contact vendor"},"--",{"$f":"VLOOKUP(in_valve_size,ss_man_cost_cl,IF(ss_cat=\"large\",4,5))","v":25},0,"Valves and Fittings - Manual  - Inlet and outlet - Stainless Steel",3,3,1,3,3,1,3,3,1,0,0]
["6.2.1","Inlet and outlet - Cast Iron",{"$f":"tot_man_valves","v":2},"units",{"$f":"in_valve_size","v":36},"in. diam",{"$f":"IF(curve=1,in_valve_size,VLOOKUP(in_valve_size,ci_bfv_cost_cl,2))","v":36},"in. diam",{"$f":"IF(curve=1,ci_bfv_eq,VLOOKUP(in_valve_size,ci_bfv_cost_cl,3))","v":15361.385772500671},30722.771545001342,{"$f":"VLOOKUP(in_valve_size,ci_bfv_cost_cl,IF(ss_cat=\"large\",4,5))","v":25},1,"Valves and Fittings - Manual  - Inlet and outlet - Cast Iron",2,1,2,2,1,2,2,1,2,1,1228.9108618000537]
["6.2.2","Process - Polypropylene/PVC",{"$f":"tot_proc_man","v":30},"units",{"$f":"tank_valve_size","v":12},"in. diam",{"$f":"IF(curve=1,tank_valve_size,VLOOKUP(tank_valve_size,pp_man_cost_cl,2))","v":12},"in. diam",{"$f":"IF(curve=1,pp_man_eq_proc,VLOOKUP(tank_valve_size,pp_man_cost_cl,3))","v":2702.9254562980004},81087.763688940016,{"$f":"VLOOKUP(tank_valve_size,pp_man_cost_cl,IF(ss_cat=\"large\",4,5))","v":25},1,"Valves and Fittings - Manual  - Process - Polypropylene/PVC",1,2,3,1,2,3,1,2,3,1,3243.5105475576006]
["6.2.2","Process - Stainless Steel",{"$f":"tot_proc_man","v":30},"units",{"$f":"tank_valve_size","v":12},"in. diam",{"$f":"IF(curve=1,tank_valve_size,VLOOKUP(tank_valve_size,ss_man_cost_cl,2))","v":12},"in. diam",{"$f":"IF(curve=1,ss_man_eq_proc,VLOOKUP(tank_valve_size,ss_man_cost_cl,3))","v":14670.859880135979},440125.79640407936,{"$f":"VLOOKUP(tank_valve_size,ss_man_cost_cl,IF(ss_cat=\"large\",4,5))","v":25},0,"Valves and Fittings - Manual  - Process - Stainless Steel",3,3,1,3,3,1,3,3,1,0,0]
["6.2.2","Process - Cast Iron",{"$f":"tot_proc_man","v":30},"units",{"$f":"tank_valve_size","v":12},"in. diam",{"$f":"IF(curve=1,tank_valve_size,VLOOKUP(tank_valve_size,ci_bfv_cost_cl,2))","v":12},"in. diam",{"$f":"IF(curve=1,ci_bfv_eq_proc,VLOOKUP(tank_valve_size,ci_bfv_cost_cl,3))","v":2607.5819160230003},78227.457480690005,{"$f":"VLOOKUP(tank_valve_size,ci_bfv_cost_cl,IF(ss_cat=\"large\",4,5))","v":25},0,"Valves and Fittings - Manual  - Process - Cast Iron",2,1,2,2,1,2,2,1,2,0,0]
["6.2.3","Backwash - Polypropylene/PVC",{"$f":"tot_back_man","v":0},"units",{"$f":"IF(tot_back_man=0,\"NA\",back_valve_size)","v":"NA"},{"$f":"IF(tot_back_man=0,\"\",\"in. diam\")","v":""},{"$f":"IF(curve=1,back_valve_size,VLOOKUP(back_valve_size,pp_man_cost_cl,2))","v":8},{"$f":"IF(tot_back_man=0,\"\",\"in. diam\")","v":""},{"$f":"IF(tot_back_man=0,\"NA\",IF(curve=1,pp_man_eq_back,VLOOKUP(back_valve_size,pp_man_cost_cl,3)))","v":"NA"},{"$f":"IF(tot_back_man=0,\"--\",IF(I161=\"contact vendor\",\"--\",C161*I161))","v":"--"},{"$f":"IF(tot_back_man=0,\"NA\",VLOOKUP(back_valve_size,pp_man_cost_cl,IF(ss_cat=\"large\",4,5)))","v":"NA"},null,"Valves and Fittings - Manual  - Backwash - Polypropylene/PVC",1,2,3,1,2,3,1,2,3,0,0]
["6.2.3","Backwash - Stainless Steel",{"$f":"tot_back_man","v":0},"units",{"$f":"IF(tot_back_man=0,\"NA\",back_valve_size)","v":"NA"},{"$f":"IF(tot_back_man=0,\"\",\"in. diam\")","v":""},{"$f":"IF(curve=1,back_valve_size,VLOOKUP(back_valve_size,ss_man_cost_cl,2))","v":8},{"$f":"IF(tot_back_man=0,\"\",\"in. diam\")","v":""},{"$f":"IF(tot_back_man=0,\"NA\",IF(curve=1,ss_man_eq_back,VLOOKUP(back_valve_size,ss_man_cost_cl,3)))","v":"NA"},{"$f":"IF(tot_back_man=0,\"--\",IF(I162=\"contact vendor\",\"--\",C162*I162))","v":"--"},{"$f":"IF(tot_back_man=0,\"NA\",VLOOKUP(back_valve_size,ss_man_cost_cl,IF(ss_cat=\"large\",4,5)))","v":"NA"},null,"Valves and Fittings - Manual  - Backwash - Stainless Steel",3,3,1,3,3,1,3,3,1,0,0]
["6.2.3","Backwash - Cast Iron",{"$f":"tot_back_man","v":0},"units",{"$f":"IF(tot_back_man=0,\"NA\",back_valve_size)","v":"NA"},{"$f":"IF(tot_back_man=0,\"\",\"in. diam\")","v":""},{"$f":"IF(curve=1,back_valve_size,VLOOKUP(back_valve_size,ci_bfv_cost_cl,2))","v":8},{"$f":"IF(tot_back_man=0,\"\",\"in. diam\")","v":""},{"$f":"IF(tot_back_man=0,\"NA\",IF(curve=1,ci_man_eq_back,VLOOKUP(back_valve_size,ci_bfv_cost_cl,3)))","v":"NA"},{"$f":"IF(tot_back_man=0,\"--\",IF(I163=\"contact vendor\",\"--\",C163*I163))","v":"--"},{"$f":"IF(tot_back_man=0,\"NA\",VLOOKUP(back_valve_size,ci_bfv_cost_cl,IF(ss_cat=\"large\",4,5)))","v":"NA"},null,"Valves and Fittings - Manual  - Backwash - Cast Iron",2,1,2,2,1,2,2,1,2,0,0]
["6.2.4","Regenerant - Polypropylene/PVC",{"$f":"tot_brine_man","v":0},"units",{"$f":"IF(tot_brine_man=0,\"NA\",brine_valve_size)","v":"NA"},{"$f":"IF(tot_brine_man=0,\"\",\"in. diam\")","v":""},{"$f":"IF(curve=1,brine_valve_size,VLOOKUP(brine_valve_size,pp_man_cost_cl,2))","v":0},{"$f":"IF(tot_brine_man=0,\"\",\"in. diam\")","v":""},{"$f":"IF(tot_brine_man=0,\"NA\",IF(curve=1,pp_man_eq_brine,VLOOKUP(brine_valve_size,pp_man_cost_cl,3)))","v":"NA"},{"$f":"IF(tot_brine_man=0,\"--\",IF(I164=\"contact vendor\",\"--\",C164*I164))","v":"--"},{"$f":"IF(tot_brine_man=0,\"NA\",VLOOKUP(brine_valve_size,pp_man_cost_cl,IF(ss_cat=\"large\",4,5)))","v":"NA"},null,"Valves and Fittings - Manual  - Regenerant - Polypropylene/PVC",1,2,2,1,2,2,1,2,2,0,0]
["6.2.4","Regenerant - Stainless Steel",{"$f":"tot_brine_man","v":0},"units",{"$f":"IF(tot_brine_man=0,\"NA\",brine_valve_size)","v":"NA"},{"$f":"IF(tot_brine_man=0,\"\",\"in. diam\")","v":""},{"$f":"IF(curve=1,brine_valve_size,VLOOKUP(brine_valve_size,ss_man_cost_cl,2))","v":0},{"$f":"IF(tot_brine_man=0,\"\",\"in. diam\")","v":""},{"$f":"IF(tot_brine_man=0,\"NA\",IF(curve=1,ss_man_eq_brine,VLOOKUP(brine_valve_size,ss_man_cost_cl,3)))","v":"NA"},{"$f":"IF(tot_brine_man=0,\"--\",IF(I165=\"contact vendor\",\"--\",C165*I165))","v":"--"},{"$f":"IF(tot_brine_man=0,\"NA\",VLOOKUP(brine_valve_size,ss_man_cost_cl,IF(ss_cat=\"large\",4,5)))","v":"NA"},null,"Valves and Fittings - Manual  - Regenerant - Stainless Steel",2,1,1,2,1,1,2,1,1,0,0]
["6.2.5","Bypass - Polypropylene/PVC",{"$f":"IF(bp_pct>0,tot_bp_man,0)","v":0},"units",{"$f":"IF(bp_pct=0,\"NA\",bypass_valve_size)","v":"NA"},{"$f":"IF(bp_pct=0,\" \",\"in. diam\")","v":" "},{"$f":"IF(bp_pct=0,\"NA\",(IF(curve=1,bypass_valve_size,VLOOKUP(bypass_valve_size,pp_man_cost_cl,2))))","v":"NA"},{"$f":"IF(bp_pct=0,\" \",\"in. diam\")","v":" "},{"$f":"IF(bp_pct=0,\"NA\",(IF(curve=1,pp_man_eq_bp,VLOOKUP(bypass_valve_size,pp_man_cost_cl,3))))","v":"NA"},{"$f":"IF(OR(C166=0,I166=\"contact vendor\"),\"--\",C166*I166)","v":"--"},{"$f":"IF(bp_pct=0,\"NA\",VLOOKUP(bypass_valve_size,pp_man_cost_cl,IF(ss_cat=\"large\",4,5)))","v":"NA"},null,"Valves and Fittings - Manual  - Bypass - Polypropylene/PVC",1,2,3,1,2,3,1,2,3,0,0]
["6.2.5","Bypass - Stainless Steel",{"$f":"IF(bp_pct>0,tot_bp_man,0)","v":0},"units",{"$f":"IF(bp_pct=0,\"NA\",bypass_valve_size)","v":"NA"},{"$f":"IF(bp_pct=0,\" \",\"in. diam\")","v":" "},{"$f":"IF(bp_pct=0,\"NA\",(IF(curve=1,bypass_valve_size,VLOOKUP(bypass_valve_size,ss_man_cost_cl,2))))","v":"NA"},{"$f":"IF(bp_pct=0,\" \",\"in. diam\")","v":" "},{"$f":"IF(bp_pct=0,\"NA\",(IF(curve=1,ss_man_eq_bp,VLOOKUP(bypass_valve_size,ss_man_cost_cl,3))))","v":"NA"},{"$f":"IF(OR(C167=0,I167=\"contact vendor\"),\"--\",C167*I167)","v":"--"},{"$f":"IF(bp_pct=0,\"NA\",VLOOKUP(bypass_valve_size,ss_man_cost_cl,IF(ss_cat=\"large\",4,5)))","v":"NA"},null,"Valves and Fittings - Manual  - Bypass - Stainless Steel",3,3,1,3,3,1,3,3,1,0,0]
["6.2.5","Bypass - Cast Iron",{"$f":"IF(bp_pct>0,tot_bp_man,0)","v":0},"units",{"$f":"IF(bp_pct=0,\"NA\",bypass_valve_size)","v":"NA"},{"$f":"IF(bp_pct=0,\" \",\"in. diam\")","v":" "},{"$f":"IF(bp_pct=0,\"NA\",(IF(curve=1,bypass_valve_size,VLOOKUP(bypass_valve_size,ci_bfv_cost_cl,2))))","v":"NA"},{"$f":"IF(bp_pct=0,\" \",\"in. diam\")","v":" "},{"$f":"IF(bp_pct=0,\"NA\",(IF(curve=1,ci_man_eq_bp,VLOOKUP(bypass_valve_size,ci_bfv_cost_cl,3))))","v":"NA"},{"$f":"IF(OR(C168=0,I168=\"contact vendor\"),\"--\",C168*I168)","v":"--"},{"$f":"IF(bp_pct=0,\"NA\",VLOOKUP(bypass_valve_size,ci_bfv_cost_cl,IF(ss_cat=\"large\",4,5)))","v":"NA"},null,"Valves and Fittings - Manual  - Bypass - Cast Iron",2,1,2,2,1,2,2,1,2,0,0]
["6.2.6","Acid - Polypropylene/PVC",{"$f":"tot_acid_man","v":0},"units",{"$f":"IF(tot_acid_man=0,\"NA\",acid_valve_size)","v":"NA"},{"$f":"IF(tot_acid_man=0,\"\",\"in. diam\")","v":""},{"$f":"IF(tot_acid_man=0,\"NA\",IF(curve=1,acid_valve_size,VLOOKUP(acid_valve_size,pp_man_cost_cl,2)))","v":"NA"},{"$f":"IF(tot_acid_man=0,\"\",\"in. diam\")","v":""},{"$f":"IF(tot_acid_man=0,\"NA\",IF(curve=1,pp_man_eq_acid,VLOOKUP(acid_valve_size,pp_man_cost_cl,3)))","v":"NA"},{"$f":"IF(tot_acid_man=0,\"--\",IF(I169=\"contact vendor\",\"--\",C169*I169))","v":"--"},{"$f":"IF(tot_acid_man=0,\"NA\",VLOOKUP(acid_valve_size,pp_man_cost_cl,IF(ss_cat=\"large\",4,5)))","v":"NA"},null,"Valves and Fittings - Manual  - Acid - Polypropylene/PVC",1,2,2,1,2,2,1,2,2,{"$f":"IF(ISERROR(K169*L169),0,IF(K169<1,0,L169))","v":0},{"$f":"IF(W169,J169/K169,0)","v":0}]
["6.2.6","Acid - Stainless Steel",{"$f":"tot_acid_man","v":0},"units",{"$f":"IF(tot_acid_man=0,\"NA\",acid_valve_size)","v":"NA"},{"$f":"IF(tot_acid_man=0,\"\",\"in. diam\")","v":""},{"$f":"IF(tot_acid_man=0,\"NA\",IF(curve=1,acid_valve_size,VLOOKUP(acid_valve_size,ss_man_cost_cl,2)))","v":"NA"},{"$f":"IF(tot_acid_man=0,\"\",\"in. diam\")","v":""},{"$f":"IF(tot_acid_man=0,\"NA\",IF(curve=1,ss_man_eq_acid,VLOOKUP(acid_valve_size,ss_man_cost_cl,3)))","v":"NA"},{"$f":"IF(tot_acid_man=0,\"--\",IF(I170=\"contact vendor\",\"--\",C170*I170))","v":"--"},{"$f":"IF(tot_acid_man=0,\"NA\",VLOOKUP(acid_valve_size,ss_man_cost_cl,IF(ss_cat=\"large\",4,5)))","v":"NA"},null,"Valves and Fittings - Manual  - Acid - Stainless Steel",2,1,1,2,1,1,2,1,1,0,0]
["6.2.7","Caustic - Polypropylene/PVC",{"$f":"tot_caustic_man","v":0},"units",{"$f":"IF(tot_caustic_man=0,\"NA\",caustic_valve_size)","v":"NA"},{"$f":"IF(tot_caustic_man=0,\"\",\"in. diam\")","v":""},{"$f":"IF(tot_caustic_man=0,\"NA\",(IF(curve=1,caustic_valve_size,VLOOKUP(caustic_valve_size,ci_mov_cost_cl,2))))","v":"NA"},{"$f":"IF(tot_caustic_man=0,\"\",\"in. diam\")","v":""},{"$f":"IF(tot_caustic_man=0,\"NA\",IF(curve=1,pp_man_eq_caustic,VLOOKUP(caustic_valve_size,pp_man_cost_cl,3)))","v":"NA"},{"$f":"IF(tot_caustic_man=0,\"--\",IF(I171=\"contact vendor\",\"--\",C171*I171))","v":"--"},{"$f":"IF(tot_caustic_man=0,\"NA\",VLOOKUP(caustic_valve_size,pp_man_cost_cl,IF(ss_cat=\"large\",4,5)))","v":"NA"},null,"Valves and Fittings - Manual  - Caustic - Polypropylene/PVC",1,2,2,1,2,2,1,2,2,0,0]
["6.2.7","Caustic - Stainless Steel",{"$f":"tot_caustic_man","v":0},"units",{"$f":"IF(tot_caustic_man=0,\"NA\",caustic_valve_size)","v":"NA"},{"$f":"IF(tot_caustic_man=0,\"\",\"in. diam\")","v":""},{"$f":"IF(tot_caustic_man=0,\"NA\",(IF(curve=1,caustic_valve_size,VLOOKUP(caustic_valve_size,ci_mov_cost_cl,2))))","v":"NA"},{"$f":"IF(tot_caustic_man=0,\"\",\"in. diam\")","v":""},{"$f":"IF(tot_caustic_man=0,\"NA\",IF(curve=1,ss_man_eq_caustic,VLOOKUP(caustic_valve_size,ss_man_cost_cl,3)))","v":"NA"},{"$f":"IF(tot_caustic_man=0,\"--\",IF(I172=\"contact vendor\",\"--\",C172*I172))","v":"--"},{"$f":"IF(tot_caustic_man=0,\"NA\",VLOOKUP(caustic_valve_size,ss_man_cost_cl,IF(ss_cat=\"large\",4,5)))","v":"NA"},null,"Valves and Fittings - Manual  - Caustic - Stainless Steel",2,1,1,2,1,1,2,1,1,0,0]
["6.2.8","Residuals - Polypropylene/PVC",{"$f":"total_res_man","v":0},"units",{"$f":"IF(C173=0,\"NA\",res_valve_size)","v":"NA"},{"$f":"IF(C173=0,\"\",\"in. diam\")","v":""},{"$f":"IF(C173=0,\"NA\",IF(curve=1,res_valve_size,VLOOKUP(res_valve_size,pp_man_cost_cl,2)))","v":"NA"},{"$f":"IF(C173=0,\"\",\"in. diam\")","v":""},{"$f":"IF(C173=0,\"NA\",IF(curve=1,pp_man_eq_res,VLOOKUP(res_valve_size,pp_man_cost_cl,3)))","v":"NA"},{"$f":"IF(OR(C173=0,I173=\"contact vendor\"),\"--\",C173*I173)","v":"--"},{"$f":"IF(C173=0,\"NA\",VLOOKUP(res_valve_size,pp_man_cost_cl,IF(ss_cat=\"large\",4,5)))","v":"NA"},null,"Valves and Fittings - Manual  - Residuals - Polypropylene/PVC",1,2,3,1,2,3,1,2,3,0,0]
["6.2.8","Residuals - Stainless Steel",{"$f":"total_res_man","v":0},"units",{"$f":"IF(C174=0,\"NA\",res_valve_size)","v":"NA"},"",{"$f":"IF(C174=0,\"NA\",IF(curve=1,res_valve_size,VLOOKUP(res_valve_size,ss_man_cost_cl,2)))","v":"NA"},"",{"$f":"IF(C174=0,\"NA\",IF(curve=1,ss_man_eq_res,VLOOKUP(res_valve_size,ss_man_cost_cl,3)))","v":"NA"},"--",{"$f":"IF(C174=0,\"NA\",VLOOKUP(res_valve_size,ss_man_cost_cl,IF(ss_cat=\"large\",4,5)))","v":"NA"},null,"Valves and Fittings - Manual  - Residuals - Stainless Steel",3,3,1,3,3,1,3,3,1,0,0]
["6.2.8","Residuals - Cast Iron",{"$f":"total_res_man","v":0},"units",{"$f":"IF(C175=0,\"NA\",res_valve_size)","v":"NA"},"",{"$f":"IF(C175=0,\"NA\",IF(curve=1,res_valve_size,VLOOKUP(res_valve_size,ci_bfv_cost_cl,2)))","v":"NA"},"",{"$f":"IF(C175=0,\"NA\",IF(curve=1,ci_man_eq_res,VLOOKUP(res_valve_size,ci_bfv_cost_cl,3)))","v":"NA"},"--",{"$f":"IF(C175=0,\"NA\",VLOOKUP(res_valve_size,ci_bfv_cost_cl,IF(ss_cat=\"large\",4,5)))","v":"NA"},null,"Valves and Fittings - Manual  - Residuals - Cast Iron",2,1,2,2,1,2,2,1,2,0,0]
["6.2.9","Polymer- Polypropylene/PVC",{"$f":"tot_polymer_man","v":0},"units",{"$f":"IF(C176=0,\"NA\",polymer_valve_size)","v":"NA"},"",{"$f":"IF(C176=0,\"NA\",IF(curve=1,polymer_valve_size,VLOOKUP(polymer_valve_size,pp_man_cost_cl,2)))","v":"NA"},"",{"$f":"IF(C176=0,\"NA\",IF(curve=1,pp_man_eq_polymer,VLOOKUP(polymer_valve_size,pp_man_cost_cl,3)))","v":"NA"},"--",{"$f":"IF(C176=0,\"NA\",VLOOKUP(polymer_valve_size,pp_man_cost_cl,IF(ss_cat=\"large\",4,5)))","v":"NA"},null,"Valves and Fittings - Manual  - Polymer- Polypropylene/PVC",1,2,3,1,2,3,1,2,3,0,0]
["6.2.9","Polymer- Stainless Steel",{"$f":"tot_polymer_man","v":0},"units",{"$f":"IF(C177=0,\"NA\",polymer_valve_size)","v":"NA"},"",{"$f":"IF(C177=0,\"NA\",IF(curve=1,polymer_valve_size,VLOOKUP(polymer_valve_size,ss_man_cost_cl,2)))","v":"NA"},"",{"$f":"IF(C177=0,\"NA\",IF(curve=1,ss_man_eq_polymer,VLOOKUP(polymer_valve_size,ss_man_cost_cl,3)))","v":"NA"},"--",{"$f":"IF(C177=0,\"NA\",VLOOKUP(polymer_valve_size,ss_man_cost_cl,IF(ss_cat=\"large\",4,5)))","v":"NA"},null,"Valves and Fittings - Manual  - Polymer- Stainless Steel",3,3,1,3,3,1,3,3,1,0,0]
["6.2.9","Polymer- Cast Iron",{"$f":"tot_polymer_man","v":0},"units",{"$f":"IF(C178=0,\"NA\",polymer_valve_size)","v":"NA"},"",{"$f":"IF(C178=0,\"NA\",IF(curve=1,polymer_valve_size,VLOOKUP(polymer_valve_size,ci_bfv_cost_cl,2)))","v":"NA"},"",{"$f":"IF(C178=0,\"NA\",IF(curve=1,ci_man_eq_polymer,VLOOKUP(polymer_valve_size,ci_bfv_cost_cl,3)))","v":"NA"},"--",{"$f":"IF(C178=0,\"NA\",VLOOKUP(polymer_valve_size,ci_bfv_cost_cl,IF(ss_cat=\"large\",4,5)))","v":"NA"},null,"Valves and Fittings - Manual  - Polymer- Cast Iron",2,1,2,2,1,2,2,1,2,0,0]
[6.3,"Check Valves",null,null,null,null,null,null,null,null,null,null,null,null,null,null,null,null,null,null,null,null,0,0]
["6.3.1","Backwash - Polypropylene/PVC",{"$f":"tot_back_chv","v":2},"units",{"$f":"IF(C180=0,\"NA\",back_valve_size)","v":8},{"$f":"IF(C180=0,\"\",\"in. diam\")","v":"in. diam"},{"$f":"IF(C180=0,\"NA\",(IF(curve=1,back_valve_size,VLOOKUP(back_valve_size,pp_chv_cost_cl,2))))","v":8},{"$f":"IF(C180=0,\"\",\"in. diam\")","v":"in. diam"},{"$f":"IF(C180=0,\"NA\",(IF(curve=1,pp_chv_eq,VLOOKUP(back_valve_size,pp_chv_cost_cl,3))))","v":2261.6080379109999},{"$f":"IF(C180=0,\"--\",(IF(I180=\"contact vendor\",\"--\",C180*I180)))","v":4523.2160758219998},{"$f":"IF(C180=0,\"NA\",(VLOOKUP(back_valve_size,pp_chv_cost_cl,IF(ss_cat=\"large\",4,5))))","v":25},1,{"$f":"$B$131 & \" - \" & $B$179&\" \"&\" - \"&B180","v":"Valves and Fittings - Check Valves  - Backwash - Polypropylene/PVC"},1,2,3,1,2,3,1,2,3,1,180.92864303287999]
["6.3.1","Backwash - Stainless Steel",{"$f":"tot_back_chv","v":2},"units",{"$f":"IF(C181=0,\"NA\",back_valve_size)","v":8},{"$f":"IF(C181=0,\"\",\"in. diam\")","v":"in. diam"},{"$f":"IF(C181=0,\"NA\",(IF(curve=1,back_valve_size,VLOOKUP(back_valve_size,ss_chv_cost_cl,2))))","v":8},{"$f":"IF(C181=0,\"\",\"in. diam\")","v":"in. diam"},{"$f":"IF(C181=0,\"NA\",(IF(curve=1,ss_chv_eq,VLOOKUP(back_valve_size,ss_chv_cost_cl,3))))","v":4564.063480926},{"$f":"IF(C181=0,\"--\",(IF(I181=\"contact vendor\",\"--\",C181*I181)))","v":9128.126961852},{"$f":"IF(C181=0,\"NA\",(VLOOKUP(back_valve_size,ss_chv_cost_cl,IF(ss_cat=\"large\",4,5))))","v":25},0,"Valves and Fittings - Check Valves  - Backwash - Stainless Steel",3,3,1,3,3,1,3,3,1,0,0]
["6.3.1","Backwash - Cast Iron",{"$f":"tot_back_chv","v":2},"units",{"$f":"IF(C182=0,\"NA\",back_valve_size)","v":8},{"$f":"IF(C182=0,\"\",\"in. diam\")","v":"in. diam"},{"$f":"IF(C182=0,\"NA\",(IF(curve=1,back_valve_size,VLOOKUP(back_valve_size,ci_chv_cost_cl,2))))","v":8},{"$f":"IF(C182=0,\"\",\"in. diam\")","v":"in. diam"},{"$f":"IF(C182=0,\"NA\",(IF(curve=1,ci_chv_eq,VLOOKUP(back_valve_size,ci_chv_cost_cl,3))))","v":2870.1671423900002},{"$f":"IF(C182=0,\"--\",(IF(I182=\"contact vendor\",\"--\",C182*I182)))","v":5740.3342847800004},{"$f":"IF(C182=0,\"NA\",(VLOOKUP(back_valve_size,ci_chv_cost_cl,IF(ss_cat=\"large\",4,5))))","v":25},0,"Valves and Fittings - Check Valves  - Backwash - Cast Iron",2,1,2,2,1,2,2,1,2,0,0]
["6.3.2","Inlet and Outlet - Polypropylene/PVC",{"$f":"tot_in_chv","v":2},"units",{"$f":"in_valve_size","v":36},"in. diam",{"$f":"IF(curve=1,in_valve_size,VLOOKUP(in_valve_size,pp_chv_cost_cl,2))","v":36},"in. diam",{"$f":"IF(curve=1,pp_chv_eq_in,VLOOKUP(in_valve_size,pp_chv_cost_cl,3))","v":"contact vendor"},{"$f":"IF(I183=\"contact vendor\",\"--\",C183*I183)","v":"--"},{"$f":"VLOOKUP(in_valve_size,pp_chv_cost_cl,IF(ss_cat=\"large\",4,5))","v":25},0,"Valves and Fittings - Check Valves  - Inlet and Outlet - Polypropylene/PVC",1,2,3,1,2,3,1,2,3,0,0]
["6.3.2","Inlet and Outlet - Stainless Steel",{"$f":"tot_in_chv","v":2},"units",{"$f":"in_valve_size","v":36},"in. diam",{"$f":"IF(curve=1,in_valve_size,VLOOKUP(in_valve_size,ss_chv_cost_cl,2))","v":36},"in. diam",{"$f":"IF(curve=1,ss_chv_eq_in,VLOOKUP(in_valve_size,ss_chv_cost_cl,3))","v":52101.502845082003},{"$f":"IF(I184=\"contact vendor\",\"--\",C184*I184)","v":104203.00569016401},{"$f":"VLOOKUP(in_valve_size,ss_chv_cost_cl,IF(ss_cat=\"large\",4,5))","v":25},1,"Valves and Fittings - Check Valves  - Inlet and Outlet - Stainless Steel",3,3,1,3,3,1,3,3,1,1,4168.1202276065605]
["6.3.2","Inlet and Outlet - Cast Iron",{"$f":"tot_in_chv","v":2},"units",{"$f":"in_valve_size","v":36},"in. diam",{"$f":"IF(curve=1,in_valve_size,VLOOKUP(in_valve_size,ci_chv_cost_cl,2))","v":36},"in. diam",{"$f":"IF(curve=1,ci_chv_eq_in,VLOOKUP(in_valve_size,ci_chv_cost_cl,3))","v":"contact vendor"},{"$f":"IF(I185=\"contact vendor\",\"--\",C185*I185)","v":"--"},{"$f":"VLOOKUP(in_valve_size,ci_chv_cost_cl,IF(ss_cat=\"large\",4,5))","v":25},0,"Valves and Fittings - Check Valves  - Inlet and Outlet - Cast Iron",2,1,2,2,1,2,2,1,2,0,0]
["6.3.3","Bypass - Polypropylene/PVC",{"$f":"IF(bp_pct>0,IF(design_flow<1,tot_bp_chv_small,tot_bp_chv),0)","v":0},"units",{"$f":"IF(bp_pct=0,\"NA\",bypass_valve_size)","v":"NA"},{"$f":"IF(bp_pct=0,\" \",\"in. diam\")","v":" "},{"$f":"IF(bp_pct=0,\"NA\",(IF(curve=1,bypass_valve_size,VLOOKUP(bypass_valve_size,pp_chv_cost_cl,2))))","v":"NA"},{"$f":"IF(bp_pct=0,\" \",\"in. diam\")","v":" "},{"$f":"IF(bp_pct=0,\"NA\",(IF(curve=1,pp_chv_eq_bp,VLOOKUP(bypass_valve_size,pp_chv_cost_cl,3))))","v":"NA"},{"$f":"IF(OR(C186=0,I186=\"contact vendor\"),\"--\",C186*I186)","v":"--"},{"$f":"IF(bp_pct=0,\"NA\",VLOOKUP(bypass_valve_size,pp_chv_cost_cl,IF(ss_cat=\"large\",4,5)))","v":"NA"},null,"Valves and Fittings - Check Valves  - Bypass - Polypropylene/PVC",1,2,3,1,2,3,1,2,3,0,0]
["6.3.3","Bypass - Stainless Steel",{"$f":"IF(bp_pct>0,IF(design_flow<1,tot_bp_chv_small,tot_bp_chv),0)","v":0},"units",{"$f":"IF(bp_pct=0,\"NA\",bypass_valve_size)","v":"NA"},{"$f":"IF(bp_pct=0,\" \",\"in. diam\")","v":" "},{"$f":"IF(bp_pct=0,\"NA\",(IF(curve=1,bypass_valve_size,VLOOKUP(bypass_valve_size,ss_chv_cost_cl,2))))","v":"NA"},{"$f":"IF(bp_pct=0,\" \",\"in. diam\")","v":" "},{"$f":"IF(bp_pct=0,\"NA\",(IF(curve=1,ss_chv_eq_bp,VLOOKUP(bypass_valve_size,ss_chv_cost_cl,3))))","v":"NA"},{"$f":"IF(OR(C187=0,I187=\"contact vendor\"),\"--\",C187*I187)","v":"--"},{"$f":"IF(bp_pct=0,\"NA\",VLOOKUP(bypass_valve_size,ss_chv_cost_cl,IF(ss_cat=\"large\",4,5)))","v":"NA"},null,"Valves and Fittings - Check Valves  - Bypass - Stainless Steel",3,3,1,3,3,1,3,3,1,0,0]
["6.3.3","Bypass - Cast Iron",{"$f":"IF(bp_pct>0,IF(design_flow<1,tot_bp_chv_small,tot_bp_chv),0)","v":0},"units",{"$f":"IF(bp_pct=0,\"NA\",bypass_valve_size)","v":"NA"},{"$f":"IF(bp_pct=0,\" \",\"in. diam\")","v":" "},{"$f":"IF(bp_pct=0,\"NA\",(IF(curve=1,bypass_valve_size,VLOOKUP(bypass_valve_size,ci_chv_cost_cl,2))))","v":"NA"},{"$f":"IF(bp_pct=0,\" \",\"in. diam\")","v":" "},{"$f":"IF(bp_pct=0,\"NA\",(IF(curve=1,ci_chv_eq_bp,VLOOKUP(bypass_valve_size,ci_chv_cost_cl,3))))","v":"NA"},{"$f":"IF(OR(C188=0,I188=\"contact vendor\"),\"--\",C188*I188)","v":"--"},{"$f":"IF(bp_pct=0,\"NA\",VLOOKUP(bypass_valve_size,ci_chv_cost_cl,IF(ss_cat=\"large\",4,5)))","v":"NA"},null,"Valves and Fittings - Check Valves  - Bypass - Cast Iron",2,1,2,2,1,2,2,1,2,0,0]
["6.3.4","Regenerant - Polypropylene/PVC",{"$f":"tot_brine_chv","v":0},"units",{"$f":"IF(C189=0,\"NA\",brine_valve_size)","v":"NA"},{"$f":"IF(C189=0,\"\",\"in. diam\")","v":""},{"$f":"IF(C189=0,\"NA\",(IF(curve=1,brine_valve_size,VLOOKUP(brine_valve_size,pp_chv_cost_cl,2))))","v":"NA"},{"$f":"IF(C189=0,\"\",\"in. diam\")","v":""},{"$f":"IF(C189=0,\"NA\",(IF(curve=1,pp_chv_eq_brine,VLOOKUP(brine_valve_size,pp_chv_cost_cl,3))))","v":"NA"},{"$f":"IF(C189=0,\"--\",(IF(I189=\"contact vendor\",\"--\",C189*I189)))","v":"--"},{"$f":"IF(C189=0,\"NA\",(VLOOKUP(brine_valve_size,pp_chv_cost_cl,IF(ss_cat=\"large\",4,5))))","v":"NA"},null,"Valves and Fittings - Check Valves  - Regenerant - Polypropylene/PVC",1,2,2,1,2,2,1,2,2,0,0]
["6.3.4","Regenerant - Stainless Steel",{"$f":"tot_brine_chv","v":0},"units",{"$f":"IF(C190=0,\"NA\",brine_valve_size)","v":"NA"},"",{"$f":"IF(C190=0,\"NA\",(IF(curve=1,brine_valve_size,VLOOKUP(brine_valve_size,ss_chv_cost_cl,2))))","v":"NA"},"",{"$f":"IF(C190=0,\"NA\",(IF(curve=1,ss_chv_eq_brine,VLOOKUP(brine_valve_size,ss_chv_cost_cl,3))))","v":"NA"},"--",{"$f":"IF(C190=0,\"NA\",(VLOOKUP(brine_valve_size,ss_chv_cost_cl,IF(ss_cat=\"large\",4,5))))","v":"NA"},null,"Valves and Fittings - Check Valves  - Regenerant - Stainless Steel",2,1,1,2,1,1,2,1,1,0,0]
["6.3.5","Acid - Polypropylene/PVC",{"$f":"tot_acid_chv","v":0},"units",{"$f":"IF(C191=0,\"NA\",acid_valve_size)","v":"NA"},"",{"$f":"IF(C191=0,\"NA\",(IF(curve=1,acid_valve_size,VLOOKUP(acid_valve_size,pp_chv_cost_cl,2))))","v":"NA"},"",{"$f":"IF(C191=0,\"NA\",(IF(curve=1,pp_chv_eq_acid,VLOOKUP(acid_valve_size,pp_chv_cost_cl,3))))","v":"NA"},"--",{"$f":"IF(C191=0,\"NA\",(VLOOKUP(acid_valve_size,pp_chv_cost_cl,IF(ss_cat=\"large\",4,5))))","v":"NA"},null,"Valves and Fittings - Check Valves  - Acid - Polypropylene/PVC",1,2,2,1,2,2,1,2,2,0,0]
["6.3.5","Acid - Stainless Steel",{"$f":"tot_acid_chv","v":0},"units",{"$f":"IF(C192=0,\"NA\",acid_valve_size)","v":"NA"},"",{"$f":"IF(C192=0,\"NA\",(IF(curve=1,acid_valve_size,VLOOKUP(acid_valve_size,ss_chv_cost_cl,2))))","v":"NA"},"",{"$f":"IF(C192=0,\"NA\",(IF(curve=1,ss_chv_eq_acid,VLOOKUP(acid_valve_size,ss_chv_cost_cl,3))))","v":"NA"},"--",{"$f":"IF(C192=0,\"NA\",(VLOOKUP(acid_valve_size,ss_chv_cost_cl,IF(ss_cat=\"large\",4,5))))","v":"NA"},null,"Valves and Fittings - Check Valves  - Acid - Stainless Steel",2,1,1,2,1,1,2,1,1,0,0]
["6.3.6","Caustic - Polypropylene/PVC",{"$f":"tot_caustic_chv","v":0},"units",{"$f":"IF(C193=0,\"NA\",caustic_valve_size)","v":"NA"},{"$f":"IF(C193=0,\"\",\"in. diam\")","v":""},{"$f":"IF(C193=0,\"NA\",(IF(curve=1,caustic_valve_size,VLOOKUP(caustic_valve_size,pp_chv_cost_cl,2))))","v":"NA"},"",{"$f":"IF(C193=0,\"NA\",(IF(curve=1,pp_chv_eq_caustic,VLOOKUP(caustic_valve_size,pp_chv_cost_cl,3))))","v":"NA"},"--",{"$f":"IF(C193=0,\"NA\",(VLOOKUP(caustic_valve_size,pp_chv_cost_cl,IF(ss_cat=\"large\",4,5))))","v":"NA"},null,"Valves and Fittings - Check Valves  - Caustic - Polypropylene/PVC",1,2,2,1,2,2,1,2,2,0,0]
["6.3.6","Caustic - Stainless Steel",{"$f":"tot_caustic_chv","v":0},"units",{"$f":"IF(C194=0,\"NA\",caustic_valve_size)","v":"NA"},"",{"$f":"IF(C194=0,\"NA\",(IF(curve=1,caustic_valve_size,VLOOKUP(caustic_valve_size,ss_chv_cost_cl,2))))","v":"NA"},"",{"$f":"IF(C194=0,\"NA\",(IF(curve=1,ss_chv_eq_caustic,VLOOKUP(caustic_valve_size,ss_chv_cost_cl,3))))","v":"NA"},"--",{"$f":"IF(C194=0,\"NA\",(VLOOKUP(caustic_valve_size,ss_chv_cost_cl,IF(ss_cat=\"large\",4,5))))","v":"NA"},null,"Valves and Fittings - Check Valves  - Caustic - Stainless Steel",2,1,1,2,1,1,2,1,1,0,0]
["6.3.7","Residuals - Polypropylene/PVC",{"$f":"tot_res_chv","v":1},"units",{"$f":"IF(C195=0,\"NA\",res_valve_size)","v":6},"in. diam",{"$f":"IF(C195=0,\"NA\",IF(curve=1,res_valve_size,VLOOKUP(res_valve_size,pp_chv_cost_cl,2)))","v":6},"in. diam",{"$f":"IF(C195=0,0,IF(curve=1,pp_chv_eq_res,VLOOKUP(res_valve_size,pp_chv_cost_cl,3)))","v":1352.6865324089999},{"$f":"IF(I195=0,0,IF(I195=\"contact vendor\",\"--\",C195*I195))","v":1352.6865324089999},{"$f":"IF(C195=0,\"NA\",VLOOKUP(res_valve_size,pp_chv_cost_cl,IF(ss_cat=\"large\",4,5)))","v":25},1,"Valves and Fittings - Check Valves  - Residuals - Polypropylene/PVC",1,2,3,1,2,3,1,2,3,1,54.10746129636]
["6.3.7","Residuals - Stainless Steel",{"$f":"tot_res_chv","v":1},"units",{"$f":"IF(C196=0,\"NA\",res_valve_size)","v":6},"in. diam",{"$f":"IF(C196=0,\"NA\",IF(curve=1,res_valve_size,VLOOKUP(res_valve_size,ss_chv_cost_cl,2)))","v":6},"in. diam",{"$f":"IF(C196=0,0,IF(curve=1,ss_chv_eq_res,VLOOKUP(res_valve_size,ss_chv_cost_cl,3)))","v":3067.5870331720002},{"$f":"IF(I196=0,0,IF(I196=\"contact vendor\",\"--\",C196*I196))","v":3067.5870331720002},{"$f":"IF(C196=0,\"NA\",VLOOKUP(res_valve_size,ss_chv_cost_cl,IF(ss_cat=\"large\",4,5)))","v":25},0,"Valves and Fittings - Check Valves  - Residuals - Stainless Steel",3,3,1,3,3,1,3,3,1,0,0]
["6.3.7","Residuals - Cast Iron",{"$f":"tot_res_chv","v":1},"units",{"$f":"IF(C197=0,\"NA\",res_valve_size)","v":6},"in. diam",{"$f":"IF(C197=0,\"NA\",IF(curve=1,res_valve_size,VLOOKUP(res_valve_size,ci_chv_cost_cl,2)))","v":6},"in. diam",{"$f":"IF(C197=0,0,IF(curve=1,ci_chv_eq_res,VLOOKUP(res_valve_size,ci_chv_cost_cl,3)))","v":1928.7275689439998},{"$f":"IF(I197=0,0,IF(I197=\"contact vendor\",\"--\",C197*I197))","v":1928.7275689439998},{"$f":"IF(C197=0,\"NA\",VLOOKUP(res_valve_size,ci_chv_cost_cl,IF(ss_cat=\"large\",4,5)))","v":25},0,"Valves and Fittings - Check Valves  - Residuals - Cast Iron",2,1,2,2,1,2,2,1,2,0,0]
["6.3.8","Polymer - Polypropylene/PVC",{"$f":"tot_polymer_chv","v":0},"units",{"$f":"IF(C198=0,\"NA\",polymer_valve_size)","v":"NA"},"",{"$f":"IF(C198=0,\"NA\",IF(curve=1,polymer_valve_size,VLOOKUP(polymer_valve_size,pp_chv_cost_cl,2)))","v":"NA"},"",{"$f":"IF(C198=0,\"NA\",IF(curve=1,pp_chv_eq_polymer,VLOOKUP(polymer_valve_size,pp_chv_cost_cl,3)))","v":"NA"},{"$f":"IF(OR(C198=0,I198=\"contact vendor\"),\"--\",C198*I198)","v":"--"},{"$f":"IF(C198=0,\"NA\",VLOOKUP(polymer_valve_size,pp_chv_cost_cl,IF(ss_cat=\"large\",4,5)))","v":"NA"},null,{"$f":"$B$131 & \" - \" & $B$179&\" \"&\" - \"&B198","v":"Valves and Fittings - Check Valves  - Polymer - Polypropylene/PVC"},1,2,3,1,2,3,1,2,3,0,0]
["6.3.8","Polymer - Stainless Steel",{"$f":"tot_polymer_chv","v":0},"units",{"$f":"IF(C199=0,\"NA\",polymer_valve_size)","v":"NA"},"",{"$f":"IF(C199=0,\"NA\",IF(curve=1,polymer_valve_size,VLOOKUP(polymer_valve_size,ss_chv_cost_cl,2)))","v":"NA"},"",{"$f":"IF(C199=0,\"NA\",IF(curve=1,ss_chv_eq_polymer,VLOOKUP(polymer_valve_size,ss_chv_cost_cl,3)))","v":"NA"},{"$f":"IF(OR(C199=0,I199=\"contact vendor\"),\"--\",C199*I199)","v":"--"},{"$f":"IF(C199=0,\"NA\",VLOOKUP(polymer_valve_size,ss_chv_cost_cl,IF(ss_cat=\"large\",4,5)))","v":"NA"},null,{"$f":"$B$131 & \" - \" & $B$179&\" \"&\" - \"&B199","v":"Valves and Fittings - Check Valves  - Polymer - Stainless Steel"},3,3,1,3,3,1,3,3,1,0,0]
["6.3.8","Polymer - Cast Iron",{"$f":"tot_polymer_chv","v":0},"units",{"$f":"IF(C200=0,\"NA\",polymer_valve_size)","v":"NA"},"",{"$f":"IF(C200=0,\"NA\",IF(curve=1,polymer_valve_size,VLOOKUP(polymer_valve_size,ci_chv_cost_cl,2)))","v":"NA"},"",{"$f":"IF(C200=0,\"NA\",IF(curve=1,ci_chv_eq_polymer,VLOOKUP(polymer_valve_size,ci_chv_cost_cl,3)))","v":"NA"},{"$f":"IF(OR(C200=0,I200=\"contact vendor\"),\"--\",C200*I200)","v":"--"},{"$f":"IF(C200=0,\"NA\",VLOOKUP(polymer_valve_size,ci_chv_cost_cl,IF(ss_cat=\"large\",4,5)))","v":"NA"},null,{"$f":"$B$131 & \" - \" & $B$179&\" \"&\" - \"&B200","v":"Valves and Fittings - Check Valves  - Polymer - Cast Iron"},2,1,2,2,1,2,2,1,2,0,0]
[7,"Pumps",null,null,null,null,null,null,null,null,null,null,null,null,null,null,null,null,null,null,null,null,0,0]
[7.1,"Booster",{"$f":"total_booster_pumps","v":7},"units",{"$f":"IF(C202=0,\"NA\",pump_rating)","v":10000},{"$f":"IF(C202=0,\"\",\"gpm\")","v":"gpm"},{"$f":"IF(C202=0,\"NA\",IF(curve=1,pump_rating,VLOOKUP(pump_rating,pump_cost_cl,2)))","v":10000},{"$f":"IF(C202=0,\"\",\"gpm\")","v":"gpm"},{"$f":"IF(C202=0,\"NA\",IF(curve=1,pump_eq,VLOOKUP(pump_rating,pump_cost_cl,3)))","v":82432.552250858993},{"$f":"IF(C202=0,0,IF(I202=\"contact vendor\",\"--\",C202*I202))","v":577027.86575601296},{"$f":"IF(C202=0,\"NA\",VLOOKUP(pump_rating,pump_cost_cl,IF(ss_cat=\"large\",4,5)))","v":20},1,{"$f":"$B$201&\" - \"&B202","v":"Pumps - Booster"},1,1,1,1,1,1,1,1,1,1,28851.393287800649]
[7.2,"Backwash/Rinse",{"$f":"backwash_pumps","v":2},"units",{"$f":"IF(backwash_pumps=0,\"NA\",back_pump_rating)","v":1275},{"$f":"IF(backwash_pumps=0,\" \",\"gpm\")","v":"gpm"},{"$f":"IF(backwash_pumps=0,\"NA\",IF(curve=1,back_pump_rating,VLOOKUP(back_pump_rating,back_pump_cost_cl,2)))","v":1275},{"$f":"IF(backwash_pumps=0,\" \",\"gpm\")","v":"gpm"},{"$f":"IF(backwash_pumps=0,\"NA\",IF(curve=1,pump_eq_back,VLOOKUP(back_pump_rating,back_pump_cost_cl,3)))","v":21751.945546609},{"$f":"IF(backwash_pumps=0,\"--\",(IF(I203=\"contact vendor\",\"--\",C203*I203)))","v":43503.891093218001},{"$f":"IF(backwash_pumps=0,\"NA\",VLOOKUP(back_pump_rating,back_pump_cost_cl,IF(ss_cat=\"large\",4,5)))","v":20},1,"Pumps - Backwash/Rinse",1,1,1,1,1,1,1,1,1,1,2175.1945546608999]
[7.3,"Regenerant",{"$f":"regen_pumps","v":0},"units",{"$f":"IF(regen_pumps=0,\"NA\",regen_pump_rating)","v":"NA"},{"$f":"IF(regen_pumps=0,\" \",\"gpm\")","v":" "},{"$f":"IF(regen_pumps=0,\"NA\",IF(curve=1,regen_pump_rating,VLOOKUP(regen_pump_rating,back_pump_cost_cl,2)))","v":"NA"},{"$f":"IF(regen_pumps=0,\" \",\"gpm\")","v":" "},{"$f":"IF(regen_pumps=0,\"NA\",IF(curve=1,pump_eq_regen,VLOOKUP(regen_pump_rating,back_pump_cost_cl,3)))","v":"NA"},{"$f":"IF(regen_pumps=0,\"--\",(IF(I204=\"contact vendor\",\"--\",C204*I204)))","v":"--"},{"$f":"IF(regen_pumps=0,\"NA\",VLOOKUP(regen_pump_rating,back_pump_cost_cl,IF(ss_cat=\"large\",4,5)))","v":"NA"},null,"Pumps - Regenerant",1,1,1,1,1,1,1,1,1,0,0]
[7.4,"Acid Pumps for Regenerant Mixing",{"$f":"mix_pumps","v":0},"units",{"$f":"IF(mix_pumps=0,\"NA\",mix_pump_rating)","v":"NA"},{"$f":"IF(mix_pumps=0,\" \",\"gph\")","v":" "},{"$f":"IF(mix_pumps=0,\"NA\",IF(curve=1,mix_pump_rating,VLOOKUP(mix_pump_rating,chem_pump_cost_cl,2)))","v":"NA"},{"$f":"IF(mix_pumps=0,\" \",\"gph\")","v":" "},{"$f":"IF(mix_pumps=0,\"NA\",IF(curve=1,pump_eq_mix,VLOOKUP(mix_pump_rating,chem_pump_cost_cl,3)))","v":"NA"},{"$f":"IF(mix_pumps=0,\"--\",(IF(I205=\"contact vendor\",\"--\",C205*I205)))","v":"--"},{"$f":"IF(mix_pumps=0,\"NA\",VLOOKUP(mix_pump_rating,chem_pump_cost_cl,IF(ss_cat=\"large\",4,5)))","v":"NA"},null,"Pumps - Acid Pumps for Regenerant Mixing",1,1,1,1,1,1,1,1,1,0,0]
[7.5,"Acid Pumps for Acid Rinse",{"$f":"rinse_pumps","v":0},"units",{"$f":"IF(rinse_pumps=0,\"NA\",rinse_pump_rating)","v":"NA"},{"$f":"IF(rinse_pumps=0,\" \",\"gph\")","v":" "},{"$f":"IF(rinse_pumps=0,\"NA\",IF(curve=1,rinse_pump_rating,VLOOKUP(rinse_pump_rating,chem_pump_cost_cl,2)))","v":"NA"},{"$f":"IF(rinse_pumps=0,\" \",\"gph\")","v":" "},{"$f":"IF(rinse_pumps=0,\"NA\",IF(curve=1,pump_eq_rinse,VLOOKUP(rinse_pump_rating,chem_pump_cost_cl,3)))","v":"NA"},{"$f":"IF(rinse_pumps=0,\"--\",(IF(I206=\"contact vendor\",\"--\",C206*I206)))","v":"--"},{"$f":"IF(rinse_pumps=0,\"NA\",VLOOKUP(rinse_pump_rating,chem_pump_cost_cl,IF(ss_cat=\"large\",4,5)))","v":"NA"},null,"Pumps - Acid Pumps for Acid Rinse",1,1,1,1,1,1,1,1,1,0,0]
[7.6,"Caustic Metering for pH Adjustment",null,null,null,null,null,null,null,null,null,null,null,null,null,null,null,null,null,null,null,null,0,0]
["7.6.1","PVC - Motor Driven",{"$f":"pH_pumps","v":0},"units",{"$f":"IF(pH_pumps=0,\"NA\",pH_pump_rating)","v":"NA"},{"$f":"IF(pH_pumps=0,\" \",\"gph\")","v":" "},{"$f":"IF(pH_pumps=0,\"NA\",IF(curve=1,pH_pump_rating,VLOOKUP(pH_pump_rating,pvc_mmpump_cost_cl,2)))","v":"NA"},{"$f":"IF(pH_pumps=0,\" \",\"gph\")","v":" "},{"$f":"IF(pH_pumps=0,\"NA\",IF(curve=1,pvc_mmpump_eq,VLOOKUP(pH_pump_rating,pvc_mmpump_cost_cl,3)))","v":"NA"},{"$f":"IF(pH_pumps=0,\"--\",(IF(I208=\"contact vendor\",\"--\",C208*I208)))","v":"--"},{"$f":"IF(pH_pumps=0,\"NA\",VLOOKUP(pH_pump_rating,pvc_mmpump_cost_cl,IF(ss_cat=\"large\",4,5)))","v":"NA"},null,{"$f":"$B$201&\" - \"&$B$207&\" - \"&B208","v":"Pumps - Caustic Metering for pH Adjustment - PVC - Motor Driven"},3,3,2,4,4,1,4,4,1,0,0]
["7.6.1","Stainless Steel - Motor Driven",{"$f":"pH_pumps","v":0},"units",{"$f":"IF(pH_pumps=0,\"NA\",pH_pump_rating)","v":"NA"},{"$f":"IF(pH_pumps=0,\" \",\"gph\")","v":" "},{"$f":"IF(pH_pumps=0,\"NA\",IF(curve=1,pH_pump_rating,VLOOKUP(pH_pump_rating,ss_mmpump_cost_cl,2)))","v":"NA"},{"$f":"IF(pH_pumps=0,\" \",\"gph\")","v":" "},{"$f":"IF(pH_pumps=0,\"NA\",IF(curve=1,ss_mmpump_eq,VLOOKUP(pH_pump_rating,ss_mmpump_cost_cl,3)))","v":"NA"},{"$f":"IF(pH_pumps=0,\"--\",(IF(I209=\"contact vendor\",\"--\",C209*I209)))","v":"--"},{"$f":"IF(pH_pumps=0,\"NA\",VLOOKUP(pH_pump_rating,ss_mmpump_cost_cl,IF(ss_cat=\"large\",4,5)))","v":"NA"},null,{"$f":"$B$201&\" - \"&$B$207&\" - \"&B209","v":"Pumps - Caustic Metering for pH Adjustment - Stainless Steel - Motor Driven"},4,4,1,3,3,2,3,3,2,0,0]
["7.6.1","PVC - Electric",{"$f":"pH_pumps","v":0},"units",{"$f":"IF(pH_pumps=0,\"NA\",pH_pump_rating)","v":"NA"},{"$f":"IF(pH_pumps=0,\" \",\"gph\")","v":" "},{"$f":"IF(pH_pumps=0,\"NA\",IF(curve=1,pH_pump_rating,VLOOKUP(pH_pump_rating,pvc_empump_cost_cl,2)))","v":"NA"},{"$f":"IF(pH_pumps=0,\" \",\"gph\")","v":" "},{"$f":"IF(pH_pumps=0,\"NA\",IF(curve=1,pvc_empump_eq,VLOOKUP(pH_pump_rating,pvc_empump_cost_cl,3)))","v":"NA"},{"$f":"IF(pH_pumps=0,\"--\",(IF(I210=\"contact vendor\",\"--\",C210*I210)))","v":"--"},{"$f":"IF(pH_pumps=0,\"NA\",VLOOKUP(pH_pump_rating,pvc_empump_cost_cl,IF(ss_cat=\"large\",4,5)))","v":"NA"},null,{"$f":"$B$201&\" - \"&$B$207&\" - \"&B210","v":"Pumps - Caustic Metering for pH Adjustment - PVC - Electric"},1,2,4,1,2,4,1,2,4,0,0]
["7.6.1","Stainless Steel - Electric",{"$f":"pH_pumps","v":0},"units",{"$f":"IF(pH_pumps=0,\"NA\",pH_pump_rating)","v":"NA"},{"$f":"IF(pH_pumps=0,\" \",\"gph\")","v":" "},{"$f":"IF(pH_pumps=0,\"NA\",IF(curve=1,pH_pump_rating,VLOOKUP(pH_pump_rating,ss_empump_cost_cl,2)))","v":"NA"},{"$f":"IF(pH_pumps=0,\" \",\"gph\")","v":" "},{"$f":"IF(pH_pumps=0,\"NA\",IF(curve=1,ss_empump_eq,VLOOKUP(pH_pump_rating,ss_empump_cost_cl,3)))","v":"NA"},{"$f":"IF(pH_pumps=0,\"--\",(IF(I211=\"contact vendor\",\"--\",C211*I211)))","v":"--"},{"$f":"IF(pH_pumps=0,\"NA\",VLOOKUP(pH_pump_rating,ss_empump_cost_cl,IF(ss_cat=\"large\",4,5)))","v":"NA"},null,{"$f":"$B$201&\" - \"&$B$207&\" - \"&B211","v":"Pumps - Caustic Metering for pH Adjustment - Stainless Steel - Electric"},2,1,3,2,1,3,2,1,3,0,0]
[7.7,"Residuals",{"$f":"res_pumps","v":0},"units",{"$f":"IF(res_pumps=0,\"NA\",res_pump_rating)","v":"NA"},{"$f":"IF(C212=0,\"\",\"gpm\")","v":""},{"$f":"IF(res_pumps=0,\"NA\",IF(curve=1,res_pump_rating,VLOOKUP(res_pump_rating,pump_cost_cl,2)))","v":"NA"},{"$f":"IF(C212=0,\"\",\"gpm\")","v":""},{"$f":"IF(res_pumps=0,0,IF(curve=1,res_pump_eq,VLOOKUP(res_pump_rating,pump_cost_cl,3)))","v":0},{"$f":"IF(I212=\"contact vendor\",\"--\",C212*I212)","v":0},{"$f":"IF(res_pumps=0,\"NA\",VLOOKUP(res_pump_rating,pump_cost_cl,IF(ss_cat=\"large\",4,5)))","v":"NA"},null,"Pumps - Residuals",1,1,1,1,1,1,1,1,1,0,0]
[7.8,"Polymer Metering",null,null,null,null,null,null,null,null,null,null,null,null,null,null,null,null,null,null,null,null,0,0]
["7.8.1","PVC - Motor Driven",{"$f":"cm_pumps_polymer","v":0},"units",{"$f":"IF(C214=0,\"NA\",IF(C214=0,\"NA\",cm_pump_rating_polymer))","v":"NA"},{"$f":"IF(C214=0,\"\",\"gph\")","v":""},{"$f":"IF(C214=0,\"NA\",IF(curve=1,cm_pump_rating_polymer,VLOOKUP(cm_pump_rating_polymer,pvc_mmpump_cost_cl,2)))","v":"NA"},{"$f":"IF(C214=0,\"\",\"gph\")","v":""},{"$f":"IF(C214=0,\"NA\",IF(curve=1,pvc_polymer_mmpump_eq,VLOOKUP(cm_pump_rating_polymer,pvc_mmpump_cost_cl,3)))","v":"NA"},{"$f":"IF(C214=0,\"--\",(IF(I214=\"contact vendor\",\"--\",C214*I214)))","v":"--"},{"$f":"IF(C214=0,\"NA\",VLOOKUP(cm_pump_rating_polymer,pvc_mmpump_cost_cl,IF(ss_cat=\"large\",4,5)))","v":"NA"},null,{"$f":"$B$201&\" - \"&$B$213&\" - \"&B214","v":"Pumps - Polymer Metering - PVC - Motor Driven"},3,3,2,4,4,1,4,4,1,0,0]
["7.8.1","Stainless Steel - Motor Driven",{"$f":"cm_pumps_polymer","v":0},"units",{"$f":"IF(C215=0,\"NA\",IF(C215=0,\"NA\",cm_pump_rating_polymer))","v":"NA"},{"$f":"IF(C215=0,\"\",\"gph\")","v":""},{"$f":"IF(C215=0,\"NA\",IF(curve=1,cm_pump_rating_polymer,VLOOKUP(cm_pump_rating_polymer,ss_mmpump_cost_cl,2)))","v":"NA"},{"$f":"IF(C215=0,\"\",\"gph\")","v":""},{"$f":"IF(C215=0,\"NA\",IF(curve=1,ss_polymer_mmpump_eq,VLOOKUP(cm_pump_rating_polymer,ss_mmpump_cost_cl,3)))","v":"NA"},{"$f":"IF(C215=0,\"--\",(IF(I215=\"contact vendor\",\"--\",C215*I215)))","v":"--"},{"$f":"IF(C215=0,\"NA\",VLOOKUP(cm_pump_rating_polymer,ss_mmpump_cost_cl,IF(ss_cat=\"large\",4,5)))","v":"NA"},null,{"$f":"$B$201&\" - \"&$B$213&\" - \"&B215","v":"Pumps - Polymer Metering - Stainless Steel - Motor Driven"},4,4,1,3,3,2,3,3,2,0,0]
["7.8.1","PVC - Electric",{"$f":"cm_pumps_polymer","v":0},"units",{"$f":"IF(C216=0,\"NA\",IF(C216=0,\"NA\",cm_pump_rating_polymer))","v":"NA"},{"$f":"IF(C216=0,\"\",\"gph\")","v":""},{"$f":"IF(C216=0,\"NA\",IF(curve=1,cm_pump_rating_polymer,VLOOKUP(cm_pump_rating_polymer,pvc_empump_cost_cl,2)))","v":"NA"},{"$f":"IF(C216=0,\"\",\"gph\")","v":""},{"$f":"IF(C216=0,\"NA\",IF(curve=1,pvc_polymer_empump_eq,VLOOKUP(cm_pump_rating_polymer,pvc_empump_cost_cl,3)))","v":"NA"},{"$f":"IF(C216=0,\"--\",(IF(I216=\"contact vendor\",\"--\",C216*I216)))","v":"--"},{"$f":"IF(C216=0,\"NA\",VLOOKUP(cm_pump_rating_polymer,pvc_empump_cost_cl,IF(ss_cat=\"large\",4,5)))","v":"NA"},null,{"$f":"$B$201&\" - \"&$B$213&\" - \"&B216","v":"Pumps - Polymer Metering - PVC - Electric"},1,2,4,1,2,4,1,2,4,0,0]
["7.8.1","Stainless Steel - Electric",{"$f":"cm_pumps_polymer","v":0},"units",{"$f":"IF(C217=0,\"NA\",IF(C217=0,\"NA\",cm_pump_rating_polymer))","v":"NA"},{"$f":"IF(C217=0,\"\",\"gph\")","v":""},{"$f":"IF(C217=0,\"NA\",IF(curve=1,cm_pump_rating_polymer,VLOOKUP(cm_pump_rating_polymer,ss_empump_cost_cl,2)))","v":"NA"},{"$f":"IF(C217=0,\"\",\"gph\")","v":""},{"$f":"IF(C217=0,\"NA\",IF(curve=1,ss_polymer_empump_eq,VLOOKUP(cm_pump_rating_polymer,ss_empump_cost_cl,3)))","v":"NA"},{"$f":"IF(C217=0,\"--\",(IF(I217=\"contact vendor\",\"--\",C217*I217)))","v":"--"},{"$f":"IF(C217=0,\"NA\",VLOOKUP(cm_pump_rating_polymer,ss_empump_cost_cl,IF(ss_cat=\"large\",4,5)))","v":"NA"},null,{"$f":"$B$201&\" - \"&$B$213&\" - \"&B217","v":"Pumps - Polymer Metering - Stainless Steel - Electric"},2,1,3,2,1,3,2,1,3,0,0]
[8,"Mixers",null,null,null,null,null,null,null,null,null,null,null,null,null,null,null,null,null,null,null,null,0,0]
[8.1,"Brine Mixers",null,null,null,null,null,null,null,null,null,null,null,null,null,null,null,null,null,null,null,null,0,0]
["8.1.1","Portable",{"$f":"IF(OR(brine_method=2,brine_method=\"\"),0,mixers)","v":0},"units",{"$f":"IF(C220=0,\"NA\",mixer_size)","v":"NA"},{"$f":"IF(C220=0,\"\",\"hp\")","v":""},{"$f":"IF(C220=0,\"NA\",VLOOKUP(mixer_size,port_mix_cost_cl,2))","v":"NA"},{"$f":"IF(C220=0,\"\",\"hp\")","v":""},{"$f":"IF(C220=0,\"NA\",VLOOKUP(mixer_size,port_mix_cost_cl,3))","v":"NA"},{"$f":"IF(C220=0,\"--\",IF(I220=\"contact vendor\",\"--\",C220*I220))","v":"--"},{"$f":"IF(C220=0,\"NA\",VLOOKUP(mixer_size,port_mix_cost_cl,IF(ss_cat=\"large\",4,5)))","v":"NA"},null,{"$f":"$B$219&\" - \"&B220","v":"Brine Mixers - Portable"},2,2,2,2,2,2,2,2,2,0,0]
["8.1.1","Mounted",{"$f":"IF(OR(brine_method=2,brine_method=\"\"),0,mixers)","v":0},"units",{"$f":"IF(C221=0,\"NA\",mixer_size)","v":"NA"},{"$f":"IF(C221=0,\"\",\"hp\")","v":""},{"$f":"IF(C221=0,\"NA\",IF(curve=1,mixer_size,VLOOKUP(mixer_size,mount_mix_cost_cl,2)))","v":"NA"},{"$f":"IF(C221=0,\"\",\"hp\")","v":""},{"$f":"IF(C221=0,\"NA\",IF(curve=1,mount_mix_eq,VLOOKUP(mixer_size,mount_mix_cost_cl,3)))","v":"NA"},{"$f":"IF(C221=0,\"--\",IF(I221=\"contact vendor\",\"--\",C221*I221))","v":"--"},{"$f":"IF(C221=0,\"NA\",VLOOKUP(mixer_size,mount_mix_cost_cl,IF(ss_cat=\"large\",4,5)))","v":"NA"},null,{"$f":"$B$219&\" - \"&B221","v":"Brine Mixers - Mounted"},1,1,1,1,1,1,1,1,1,0,0]
["8.2","Mixers for Caustic Storage Tanks",null,null,null,null,null,null,null,null,null,null,null,null,null,null,null,null,null,null,null,null,0,0]
["8.2.1","Portable",{"$f":"cmixers","v":0},"units",{"$f":"IF(C223=0,\"NA\",cmix_size)","v":"NA"},{"$f":"IF(C223=0,\"\",\"hp\")","v":""},{"$f":"IF(C223=0,\"NA\",VLOOKUP(cmix_size,port_mix_cost_cl,2))","v":"NA"},{"$f":"IF(C223=0,\"\",\"hp\")","v":""},{"$f":"IF(C223=0,\"NA\",VLOOKUP(cmix_size,port_mix_cost_cl,3))","v":"NA"},{"$f":"IF(C223=0,\"--\",IF(I223=\"contact vendor\",\"--\",C223*I223))","v":"--"},{"$f":"IF(C223=0,\"NA\",VLOOKUP(cmix_size,port_mix_cost_cl,IF(ss_cat=\"large\",4,5)))","v":"NA"},null,{"$f":"$B$222&\" - \"&B223","v":"Mixers for Caustic Storage Tanks - Portable"},3,3,3,3,3,3,3,3,3,0,0]
["8.2.1","Mounted",{"$f":"cmixers","v":0},"units",{"$f":"IF(C224=0,\"NA\",cmix_size)","v":"NA"},{"$f":"IF(C224=0,\"\",\"hp\")","v":""},{"$f":"IF(C224=0,\"NA\",IF(curve=1,cmix_size,VLOOKUP(cmix_size,mount_mix_cost_cl,2)))","v":"NA"},{"$f":"IF(C224=0,\"\",\"hp\")","v":""},{"$f":"IF(C224=0,\"NA\",IF(curve=1,cmount_mix_eq,VLOOKUP(cmix_size,mount_mix_cost_cl,3)))","v":"NA"},{"$f":"IF(C224=0,\"--\",IF(I224=\"contact vendor\",\"--\",C224*I224))","v":"--"},{"$f":"IF(C224=0,\"NA\",VLOOKUP(cmix_size,mount_mix_cost_cl,IF(ss_cat=\"large\",4,5)))","v":"NA"},null,{"$f":"$B$222&\" - \"&B224","v":"Mixers for Caustic Storage Tanks - Mounted"},1,1,1,1,1,1,1,1,1,0,0]
["8.2.1","Impeller",{"$f":"cmixers","v":0},"units",{"$f":"IF(C225=0,\"NA\",cmix_size)","v":"NA"},{"$f":"IF(C225=0,\"\",\"hp\")","v":""},{"$f":"IF(C225=0,\"NA\",IF(curve=1,cmix_size,VLOOKUP(cmix_size,imp_mix_cost_cl,2)))","v":"NA"},{"$f":"IF(C225=0,\"\",\"hp\")","v":""},{"$f":"IF(C225=0,\"NA\",IF(curve=1,cimp_mix_eq,VLOOKUP(cmix_size,imp_mix_cost_cl,3)))","v":"NA"},{"$f":"IF(C225=0,\"--\",IF(I225=\"contact vendor\",\"--\",C225*I225))","v":"--"},{"$f":"IF(C225=0,\"NA\",VLOOKUP(cmix_size,imp_mix_cost_cl,IF(ss_cat=\"large\",4,5)))","v":"NA"},null,{"$f":"$B$222&\" - \"&B225","v":"Mixers for Caustic Storage Tanks - Impeller"},2,2,2,2,2,2,2,2,2,0,0]
["8.3","Mixers for Caustic Day Tanks",null,null,null,null,null,null,null,null,null,null,null,null,null,null,null,null,null,null,null,null,0,0]
["8.3.1","Portable",{"$f":"dmixers","v":0},"units",{"$f":"IF(C227=0,\"NA\",dmix_size)","v":"NA"},{"$f":"IF(C227=0,\"\",\"hp\")","v":""},{"$f":"IF(C227=0,\"NA\",VLOOKUP(dmix_size,port_mix_cost_cl,2))","v":"NA"},{"$f":"IF(C227=0,\"\",\"hp\")","v":""},{"$f":"IF(C227=0,\"NA\",VLOOKUP(dmix_size,port_mix_cost_cl,3))","v":"NA"},{"$f":"IF(C227=0,\"--\",IF(I227=\"contact vendor\",\"--\",C227*I227))","v":"--"},{"$f":"IF(C227=0,\"NA\",VLOOKUP(dmix_size,port_mix_cost_cl,IF(ss_cat=\"large\",4,5)))","v":"NA"},null,{"$f":"$B$226&\" - \"&B227","v":"Mixers for Caustic Day Tanks - Portable"},3,3,3,3,3,3,3,3,3,0,0]
["8.3.1","Mounted",{"$f":"dmixers","v":0},"units",{"$f":"IF(C228=0,\"NA\",dmix_size)","v":"NA"},{"$f":"IF(C228=0,\"\",\"hp\")","v":""},{"$f":"IF(C228=0,\"NA\",IF(curve=1,dmix_size,VLOOKUP(dmix_size,mount_mix_cost_cl,2)))","v":"NA"},{"$f":"IF(C228=0,\"\",\"hp\")","v":""},{"$f":"IF(C228=0,\"NA\",IF(curve=1,dmount_mix_eq,VLOOKUP(dmix_size,mount_mix_cost_cl,3)))","v":"NA"},{"$f":"IF(C228=0,\"--\",IF(I228=\"contact vendor\",\"--\",C228*I228))","v":"--"},{"$f":"IF(C228=0,\"NA\",VLOOKUP(dmix_size,mount_mix_cost_cl,IF(ss_cat=\"large\",4,5)))","v":"NA"},null,{"$f":"$B$226&\" - \"&B228","v":"Mixers for Caustic Day Tanks - Mounted"},1,1,1,1,1,1,1,1,1,0,0]
["8.3.1","Impeller",{"$f":"dmixers","v":0},"units",{"$f":"IF(C229=0,\"NA\",dmix_size)","v":"NA"},{"$f":"IF(C229=0,\"\",\"hp\")","v":""},{"$f":"IF(C229=0,\"NA\",IF(curve=1,dmix_size,VLOOKUP(dmix_size,imp_mix_cost_cl,2)))","v":"NA"},{"$f":"IF(C229=0,\"\",\"hp\")","v":""},{"$f":"IF(C229=0,\"NA\",IF(curve=1,dimp_mix_eq,VLOOKUP(dmix_size,imp_mix_cost_cl,3)))","v":"NA"},{"$f":"IF(C229=0,\"--\",IF(I229=\"contact vendor\",\"--\",C229*I229))","v":"--"},{"$f":"IF(C229=0,\"NA\",VLOOKUP(dmix_size,imp_mix_cost_cl,IF(ss_cat=\"large\",4,5)))","v":"NA"},null,{"$f":"$B$226&\" - \"&B229","v":"Mixers for Caustic Day Tanks - Impeller"},2,2,2,2,2,2,2,2,2,0,0]
["8.4","Residuals Mixers",null,null,null,null,null,null,null,null,null,null,null,null,null,null,null,null,null,null,null,null,0,0]
["8.4.1","Portable",{"$f":"hmixers","v":0},"units",{"$f":"IF(C231=0,\"NA\",hmix_size)","v":"NA"},{"$f":"IF(C231=0,\"\",\"hp\")","v":""},{"$f":"IF(C231=0,\"NA\",VLOOKUP(hmix_size,port_mix_cost_cl,2))","v":"NA"},{"$f":"IF(C231=0,\"\",\"hp\")","v":""},{"$f":"IF(C231=0,\"NA\",VLOOKUP(hmix_size,port_mix_cost_cl,3))","v":"NA"},{"$f":"IF(C231=0,\"--\",IF(I231=\"contact vendor\",\"--\",C231*I231))","v":"--"},{"$f":"IF(C231=0,\"NA\",VLOOKUP(hmix_size,port_mix_cost_cl,IF(ss_cat=\"large\",4,5)))","v":"NA"},null,{"$f":"$B$230&\" - \"&B231","v":"Residuals Mixers - Portable"},3,3,3,3,3,3,3,3,3,0,0]
["8.4.1","Mounted",{"$f":"hmixers","v":0},"units",{"$f":"IF(C232=0,\"NA\",hmix_size)","v":"NA"},{"$f":"IF(C232=0,\"\",\"hp\")","v":""},{"$f":"IF(C232=0,\"NA\",IF(curve=1,hmix_size,VLOOKUP(hmix_size,mount_mix_cost_cl,2)))","v":"NA"},{"$f":"IF(C232=0,\"\",\"hp\")","v":""},{"$f":"IF(C232=0,\"NA\",IF(curve=1,hmount_mix_eq,VLOOKUP(hmix_size,mount_mix_cost_cl,3)))","v":"NA"},{"$f":"IF(C232=0,\"--\",IF(I232=\"contact vendor\",\"--\",C232*I232))","v":"--"},{"$f":"IF(C232=0,\"NA\",VLOOKUP(hmix_size,mount_mix_cost_cl,IF(ss_cat=\"large\",4,5)))","v":"NA"},null,{"$f":"$B$230&\" - \"&B232","v":"Residuals Mixers - Mounted"},1,1,1,1,1,1,1,1,1,0,0]
["8.4.1","Impeller",{"$f":"hmixers","v":0},"units",{"$f":"IF(C233=0,\"NA\",hmix_size)","v":"NA"},{"$f":"IF(C233=0,\"\",\"hp\")","v":""},{"$f":"IF(C233=0,\"NA\",IF(curve=1,hmix_size,VLOOKUP(hmix_size,imp_mix_cost_cl,2)))","v":"NA"},{"$f":"IF(C233=0,\"\",\"hp\")","v":""},{"$f":"IF(C233=0,\"NA\",IF(curve=1,himp_mix_eq,VLOOKUP(hmix_size,imp_mix_cost_cl,3)))","v":"NA"},{"$f":"IF(C233=0,\"--\",IF(I233=\"contact vendor\",\"--\",C233*I233))","v":"--"},{"$f":"IF(C233=0,\"NA\",VLOOKUP(hmix_size,imp_mix_cost_cl,IF(ss_cat=\"large\",4,5)))","v":"NA"},null,{"$f":"$B$230&\" - \"&B233","v":"Residuals Mixers - Impeller"},2,2,2,2,2,2,2,2,2,{"$f":"IF(ISERROR(K233*L233),0,IF(K233<1,0,L233))","v":0},{"$f":"IF(W233,J233/K233,0)","v":0}]
[9,"Chemical Feed",null,null,null,null,null,null,null,null,null,null,null,null,null,null,null,null,null,null,null,null,0,0]
[9.1,"Eductors for Brine",null,null,null,null,null,null,null,null,null,null,null,null,null,null,null,null,null,null,null,null,0,0]
["9.1.1","Stainless Steel",{"$f":"eductors","v":0},"units",{"$f":"IF(C236=0,\"NA\",brine_pipe_diam)","v":"NA"},{"$f":"IF(C236=0,\"\",\"in. diam\")","v":""},{"$f":"IF(C236=0,\"NA\",IF(curve=1,brine_pipe_diam,VLOOKUP(brine_pipe_diam,ss_eductor_cost_cl,2)))","v":"NA"},{"$f":"IF(C236=0,\"\",\"in. diam\")","v":""},{"$f":"IF(C236=0,\"NA\",IF(curve=1,ss_eductor_eq,VLOOKUP(brine_pipe_diam,ss_eductor_cost_cl,3)))","v":"NA"},{"$f":"IF(C236=0,\"--\",IF(I236=\"contact vendor\",\"--\",C236*I236))","v":"--"},{"$f":"IF(C236=0,\"NA\",VLOOKUP(brine_pipe_diam,ss_eductor_cost_cl,IF(ss_cat=\"large\",4,5)))","v":"NA"},null,{"$f":"$B$234 & \" - \" & $B$235& \" - \" &B236","v":"Chemical Feed - Eductors for Brine - Stainless Steel"},2,2,1,2,2,1,2,2,1,0,0]
["9.1.1","Plastic",{"$f":"eductors","v":0},"units",{"$f":"IF(C237=0,\"NA\",brine_pipe_diam)","v":"NA"},{"$f":"IF(C237=0,\"\",\"in. diam\")","v":""},{"$f":"IF(C237=0,\"NA\",IF(curve=1,brine_pipe_diam,VLOOKUP(brine_pipe_diam,pl_eductor_cost_cl,2)))","v":"NA"},{"$f":"IF(C237=0,\"\",\"in. diam\")","v":""},{"$f":"IF(C237=0,\"NA\",IF(curve=1,pl_eductor_eq,VLOOKUP(brine_pipe_diam,pl_eductor_cost_cl,3)))","v":"NA"},{"$f":"IF(C237=0,\"--\",IF(I237=\"contact vendor\",\"--\",C237*I237))","v":"--"},{"$f":"IF(C237=0,\"NA\",VLOOKUP(brine_pipe_diam,pl_eductor_cost_cl,IF(ss_cat=\"large\",4,5)))","v":"NA"},null,{"$f":"$B$234 & \" - \" & $B$235& \" - \" &B237","v":"Chemical Feed - Eductors for Brine - Plastic"},1,1,2,1,1,2,1,1,2,0,0]
[9.1999999999999993,{"$f":"CHOOSE(res_transfer_method,\"Slurry Pump System for Holding Tanks\",\"Eductors for Holding Tanks\",\"Manual holding tank solids transfer, no equipment needed\")","v":"Manual holding tank solids transfer, no equipment needed"},{"$f":"IF(res_holding=\"none\",0,CHOOSE(res_transfer_method,res_slurry_pumps,res_eductors,0))","v":0},"units",{"$f":"IF(C238=0,\"NA\",CHOOSE(res_transfer_method,res_transfer_rate,res_eductor_size,\"NA\"))","v":"NA"},{"$f":"IF(C238=0,\"\",CHOOSE(res_transfer_method,\"lbs/hr\",\"in. diam\",\"\"))","v":""},{"$f":"IF(C238=0,\"NA\",CHOOSE(res_transfer_method,IF(curve=1,res_transfer_rate,VLOOKUP(res_transfer_rate,gac_slurry_cost_cl,2)),IF(curve=1,res_eductor_size,VLOOKUP(res_eductor_size,seductor_cost_cl,2)),\"NA\"))","v":"NA"},{"$f":"IF(C238=0,\"\",CHOOSE(res_transfer_method,\"lbs/hr\",\"in. diam\",\"\"))","v":""},{"$f":"IF(C238=0,\"NA\",CHOOSE(res_transfer_method,IF(curve=1,res_slurry_eq,VLOOKUP(res_transfer_rate,gac_slurry_cost_cl,3)),IF(curve=1,res_seductor_eq,VLOOKUP(res_eductor_size,seductor_cost_cl,3)),\"NA\"))","v":"NA"},{"$f":"IF(C238=0,\"--\",CHOOSE(res_transfer_method,IF(I238=\"contact vendor\",\"--\",C238*I238),IF(I238=\"contact vendor\",\"--\",C238*I238),0))","v":"--"},{"$f":"IF(C238=0,\"NA\",VLOOKUP(E238,CHOOSE(res_transfer_method,gac_slurry_cost_cl,seductor_cost_cl),IF(ss_cat=\"large\",4,5)))","v":"NA"},null,{"$f":"$B$234&\" - \"&B238","v":"Chemical Feed - Manual holding tank solids transfer, no equipment needed"},1,1,1,1,1,1,1,1,1,0,0]
[9.3000000000000007,"Dry Feeders for Regenerant",null,null,null,null,null,null,null,null,null,null,null,null,null,null,null,null,null,null,null,null,0,0]
["9.3.1","Volumetric Feeders",{"$f":"num_vol","v":0},"units",{"$f":"IF(num_vol=0,\"NA\",vol_feed_rate)","v":"NA"},{"$f":"IF(num_vol=0,\"\",\"cfm\")","v":""},{"$f":"IF(num_vol=0,\"NA\",IF(curve=1,vol_feed_rate,VLOOKUP(vol_feed_rate,vol_feed_cost_cl,2)))","v":"NA"},{"$f":"IF(num_vol=0,\"\",\"cfm\")","v":""},{"$f":"IF(C240=0,\"NA\",IF(curve=1,vol_feed_eq, VLOOKUP(vol_feed_rate,vol_feed_cost_cl,3)))","v":"NA"},{"$f":"IF(num_vol=0,\"--\",IF(I240=\"contact vendor\",\"--\",C240*I240))","v":"--"},{"$f":"IF(num_vol=0,\"NA\",VLOOKUP(vol_feed_rate,vol_feed_cost_cl,IF(ss_cat=\"large\",4,5)))","v":"NA"},null,{"$f":"$B$234 & \" - \" & $B$239&\" \"&\" - \"&B240","v":"Chemical Feed - Dry Feeders for Regenerant  - Volumetric Feeders"},1,2,2,1,2,2,1,2,2,0,0]
["9.3.1","Gravimetric Feeders",{"$f":"num_grav","v":0},"units",{"$f":"IF(num_grav=0,\"NA\",grav_feed_rate)","v":"NA"},{"$f":"IF(num_grav=0,\"\",\"lbs/min\")","v":""},{"$f":"IF(num_grav=0,\"NA\",IF(curve=1,grav_feed_rate,VLOOKUP(grav_feed_rate,grav_feed_cost_cl,2)))","v":"NA"},{"$f":"IF(num_grav=0,\"\",\"lbs/min\")","v":""},{"$f":"IF(num_grav=0,\"NA\",VLOOKUP(grav_feed_rate,grav_feed_cost_cl,3))","v":"NA"},{"$f":"IF(num_grav=0,\"--\",IF(I241=\"contact vendor\",\"--\",C241*I241))","v":"--"},{"$f":"IF(num_grav=0,\"NA\",VLOOKUP(grav_feed_rate,grav_feed_cost_cl,IF(ss_cat=\"large\",4,5)))","v":"NA"},null,{"$f":"$B$234 & \" - \" & $B$239&\" \"&\" - \"&B241","v":"Chemical Feed - Dry Feeders for Regenerant  - Gravimetric Feeders"},2,1,1,2,1,1,2,1,1,0,0]
[9.4,"Dry Feeders for Holding Tank Coagulant",null,null,null,null,null,null,null,null,null,null,null,null,null,null,null,null,null,null,null,null,0,0]
["9.4.1","Volumetric Feeder",{"$f":"IF(res_vol_feed_rate<>0,IF(res_holding=\"tanks\",htanks,IF(res_holding=\"basins\",hbasins,0)),0)","v":0},"units",{"$f":"IF(C243=0,\"NA\",res_vol_feed_rate)","v":"NA"},{"$f":"IF(C243=0,\"\",\"cfm\")","v":""},{"$f":"IF(C243=0,\"NA\",IF(curve=1,res_vol_feed_rate,VLOOKUP(res_vol_feed_rate,vol_feed_cost_cl,2)))","v":"NA"},{"$f":"IF(C243=0,\"\",\"cfm\")","v":""},{"$f":"IF(C243=0,\"NA\",IF(curve=1,res_vol_feed_eq, VLOOKUP(res_vol_feed_rate,vol_feed_cost_cl,3)))","v":"NA"},{"$f":"IF(OR(I243=\"contact vendor\",C243=0),\"--\",C243*I243)","v":"--"},{"$f":"IF(C243=0,\"NA\",VLOOKUP(res_vol_feed_rate,vol_feed_cost_cl,IF(ss_cat=\"large\",4,5)))","v":"NA"},null,{"$f":"$B$234 & \" - \" & $B$242&\" \"&\" - \"&B243","v":"Chemical Feed - Dry Feeders for Holding Tank Coagulant  - Volumetric Feeder"},1,1,1,1,1,1,1,1,1,0,0]
["9.4.1","Gravimetric Feeder",{"$f":"IF(res_grav_feed_rate<>0,IF(res_holding=\"tanks\",htanks,IF(res_holding=\"basins\",hbasins,0)),0)","v":0},"units",{"$f":"IF(C244=0,\"NA\",res_grav_feed_rate)","v":"NA"},{"$f":"IF(C244=0,\"\",\"lbs/min\")","v":""},{"$f":"IF(C244=0,\"NA\",VLOOKUP(res_grav_feed_rate,grav_feed_cost_cl,2))","v":"NA"},{"$f":"IF(C244=0,\"\",\"lbs/min\")","v":""},{"$f":"IF(C244=0,\"NA\",VLOOKUP(res_grav_feed_rate,grav_feed_cost_cl,3))","v":"NA"},{"$f":"IF(OR(I244=\"contact vendor\",C244=0),\"--\",C244*I244)","v":"--"},{"$f":"IF(C244=0,\"NA\",VLOOKUP(res_grav_feed_rate,grav_feed_cost_cl,IF(ss_cat=\"large\",4,5)))","v":"NA"},null,{"$f":"$B$234 & \" - \" & $B$242&\" \"&\" - \"&B244","v":"Chemical Feed - Dry Feeders for Holding Tank Coagulant  - Gravimetric Feeder"},2,2,2,2,2,2,2,2,2,0,0]
[10,"Salt Saturators",null,null,null,null,null,null,null,null,null,null,null,null,null,null,null,null,null,null,null,null,0,0]
[10.1,"Fiberglass",{"$f":"num_salt_box","v":0},"units",{"$f":"IF(num_salt_box=0,\"NA\",salt_box_size)","v":"NA"},{"$f":"IF(num_salt_box=0,\"\",\"tons\")","v":""},{"$f":"IF(num_salt_box=0,\"NA\",IF(curve=1,salt_box_size,VLOOKUP(salt_box_size,fg_saltbox_cost_cl,2)))","v":"NA"},{"$f":"IF(num_salt_box=0,\"\",\"tons\")","v":""},{"$f":"IF(num_salt_box=0,\"NA\",IF(curve=1,fg_saltbox_eq,VLOOKUP(salt_box_size,fg_saltbox_cost_cl,3)))","v":"NA"},{"$f":"IF(num_salt_box=0,\"--\",IF(I246=\"contact vendor\",\"--\",C246*I246))","v":"--"},{"$f":"IF(num_salt_box=0,\"NA\",VLOOKUP(salt_box_size,fg_saltbox_cost_cl,IF(ss_cat=\"large\",4,5)))","v":"NA"},null,{"$f":"$B$245&\" - \"&B246","v":"Salt Saturators - Fiberglass"},2,1,1,2,1,1,2,1,1,0,0]
[10.1,"Reinforced Plastic",{"$f":"num_salt_box","v":0},"units",{"$f":"IF(num_salt_box=0,\"NA\",salt_box_size)","v":"NA"},{"$f":"IF(num_salt_box=0,\"\",\"tons\")","v":""},{"$f":"IF(num_salt_box=0,\"NA\",IF(curve=1,salt_box_size,VLOOKUP(salt_box_size,pl_saltbox_cost_cl,2)))","v":"NA"},{"$f":"IF(num_salt_box=0,\"\",\"tons\")","v":""},{"$f":"IF(num_salt_box=0,\"NA\",IF(curve=1,pl_saltbox_eq,VLOOKUP(salt_box_size,pl_saltbox_cost_cl,3)))","v":"NA"},{"$f":"IF(num_salt_box=0,\"--\",IF(I247=\"contact vendor\",\"--\",C247*I247))","v":"--"},{"$f":"IF(num_salt_box=0,\"NA\",VLOOKUP(salt_box_size,pl_saltbox_cost_cl,IF(ss_cat=\"large\",4,5)))","v":"NA"},null,{"$f":"$B$245&\" - \"&B247","v":"Salt Saturators - Reinforced Plastic"},1,2,2,1,2,2,1,2,2,0,0]
[11,"Instrumentation and Controls",null,null,null,null,null,null,null,null,null,null,null,null,null,null,null,null,null,null,null,null,0,0]
["11.1","Flow Meters - Inlet and Outlet",null,null,null,null,null,null,null,null,null,null,null,null,null,null,null,null,null,null,null,null,0,0]
["11.1.1","Orifice Plate",{"$f":"tot_fm_in","v":1},"units",{"$f":"in_meter_size","v":36},"in. diam",{"$f":"IF(curve=1,in_meter_size,VLOOKUP(in_meter_size,op_fm_cost_cl,2))","v":36},"in. diam",{"$f":"IF(curve=1,op_fm_eq_in,VLOOKUP(in_meter_size,op_fm_cost_cl,3))","v":14784.720705442},{"$f":"IF(I250=\"contact vendor\",\"--\",C250*I250)","v":14784.720705442},{"$f":"VLOOKUP(in_meter_size,op_fm_cost_cl,IF(ss_cat=\"large\",4,5))","v":15},1,{"$f":"$B$248&\" - \"&$B$249&\" - \"&B250","v":"Instrumentation and Controls - Flow Meters - Inlet and Outlet - Orifice Plate"},3,4,4,3,4,4,3,3,4,1,985.64804702946662]
["11.1.1","Propeller",{"$f":"tot_fm_in","v":1},"units",{"$f":"in_meter_size","v":36},"in. diam",{"$f":"IF(curve=1,in_meter_size,VLOOKUP(in_meter_size,prop_fm_cost_cl,2))","v":36},"in. diam",{"$f":"IF(curve=1,prop_fm_eq_in,VLOOKUP(in_meter_size,prop_fm_cost_cl,3))","v":"contact vendor"},{"$f":"IF(I251=\"contact vendor\",\"--\",C251*I251)","v":"--"},{"$f":"VLOOKUP(in_meter_size,prop_fm_cost_cl,IF(ss_cat=\"large\",4,5))","v":15},0,{"$f":"$B$248&\" - \"&$B$249&\" - \"&B251","v":"Instrumentation and Controls - Flow Meters - Inlet and Outlet - Propeller"},1,2,3,1,2,3,4,4,2,0,0]
["11.1.1","Venturi",{"$f":"tot_fm_in","v":1},"units",{"$f":"in_meter_size","v":36},"in. diam",{"$f":"IF(curve=1,in_meter_size,VLOOKUP(in_meter_size,ven_fm_cost_cl,2))","v":36},"in. diam",{"$f":"IF(curve=1,ven_fm_eq_in,VLOOKUP(in_meter_size,ven_fm_cost_cl,3))","v":"contact vendor"},{"$f":"IF(I252=\"contact vendor\",\"--\",C252*I252)","v":"--"},{"$f":"VLOOKUP(in_meter_size,ven_fm_cost_cl,IF(ss_cat=\"large\",4,5))","v":15},0,{"$f":"$B$248&\" - \"&$B$249&\" - \"&B252","v":"Instrumentation and Controls - Flow Meters - Inlet and Outlet - Venturi"},2,1,2,2,1,2,1,2,3,0,0]
["11.1.1","Magnetic",{"$f":"tot_fm_in","v":1},"units",{"$f":"in_meter_size","v":36},"in. diam",{"$f":"IF(curve=1,in_meter_size,VLOOKUP(in_meter_size,mag_fm_cost_cl,2))","v":36},"in. diam",{"$f":"IF(curve=1,mag_fm_eq_in,VLOOKUP(in_meter_size,mag_fm_cost_cl,3))","v":"contact vendor"},{"$f":"IF(I253=\"contact vendor\",\"--\",C253*I253)","v":"--"},{"$f":"VLOOKUP(in_meter_size,mag_fm_cost_cl,IF(ss_cat=\"large\",4,5))","v":15},0,{"$f":"$B$248&\" - \"&$B$249&\" - \"&B253","v":"Instrumentation and Controls - Flow Meters - Inlet and Outlet - Magnetic"},4,3,1,4,3,1,2,1,1,0,0]
["11.2","Flow Meters - Process",null,null,null,null,null,null,null,null,null,null,null,null,null,null,null,null,null,null,null,null,0,0]
["11.2.1","Orifice Plate",{"$f":"tot_fm_proc","v":0},"units",{"$f":"IF(C255=0,\"NA\",proc_meter_size)","v":"NA"},{"$f":"IF(C255=0,\"\",\"in. diam\")","v":""},{"$f":"IF(C255=0,\"NA\",IF(curve=1,proc_meter_size,VLOOKUP(proc_meter_size,op_fm_cost_cl,2)))","v":"NA"},{"$f":"IF(C255=0,\"\",\"in. diam\")","v":""},{"$f":"IF(C255=0,\"NA\",IF(curve=1,op_fm_eq_proc,VLOOKUP(proc_meter_size,op_fm_cost_cl,3)))","v":"NA"},{"$f":"IF(OR(I255=\"NA\",I255=\"contact vendor\"),\"--\",C255*I255)","v":"--"},{"$f":"IF(C255=0,\"NA\",VLOOKUP(proc_meter_size,op_fm_cost_cl,IF(ss_cat=\"large\",4,5)))","v":"NA"},null,{"$f":"$B$248&\" - \"&$B$254&\" - \"&B255","v":"Instrumentation and Controls - Flow Meters - Process - Orifice Plate"},3,4,4,3,4,4,3,3,4,0,0]
["11.2.1","Propeller",{"$f":"tot_fm_proc","v":0},"units",{"$f":"IF(C256=0,\"NA\",proc_meter_size)","v":"NA"},{"$f":"IF(C256=0,\"\",\"in. diam\")","v":""},{"$f":"IF(C256=0,\"NA\",IF(curve=1,proc_meter_size,VLOOKUP(proc_meter_size,prop_fm_cost_cl,2)))","v":"NA"},{"$f":"IF(C256=0,\"\",\"in. diam\")","v":""},{"$f":"IF(C256=0,\"NA\",IF(curve=1,prop_fm_eq_proc,VLOOKUP(proc_meter_size,prop_fm_cost_cl,3)))","v":"NA"},{"$f":"IF(OR(I256=\"NA\",I256=\"contact vendor\"),\"--\",C256*I256)","v":"--"},{"$f":"IF(C256=0,\"NA\",VLOOKUP(proc_meter_size,prop_fm_cost_cl,IF(ss_cat=\"large\",4,5)))","v":"NA"},null,{"$f":"$B$248&\" - \"&$B$254&\" - \"&B256","v":"Instrumentation and Controls - Flow Meters - Process - Propeller"},1,2,3,1,2,3,4,4,2,0,0]
["11.2.1","Venturi",{"$f":"tot_fm_proc","v":0},"units",{"$f":"IF(C257=0,\"NA\",proc_meter_size)","v":"NA"},{"$f":"IF(C257=0,\"\",\"in. diam\")","v":""},{"$f":"IF(C257=0,\"NA\",IF(curve=1,proc_meter_size,VLOOKUP(proc_meter_size,ven_fm_cost_cl,2)))","v":"NA"},{"$f":"IF(C257=0,\"\",\"in. diam\")","v":""},{"$f":"IF(C257=0,\"NA\",IF(curve=1,ven_fm_eq_proc,VLOOKUP(proc_meter_size,ven_fm_cost_cl,3)))","v":"NA"},{"$f":"IF(OR(I257=\"NA\",I257=\"contact vendor\"),\"--\",C257*I257)","v":"--"},{"$f":"IF(C257=0,\"NA\",VLOOKUP(proc_meter_size,ven_fm_cost_cl,IF(ss_cat=\"large\",4,5)))","v":"NA"},null,{"$f":"$B$248&\" - \"&$B$254&\" - \"&B257","v":"Instrumentation and Controls - Flow Meters - Process - Venturi"},2,1,2,2,1,2,1,2,3,0,0]
["11.2.1","Magnetic",{"$f":"tot_fm_proc","v":0},"units",{"$f":"IF(C258=0,\"NA\",proc_meter_size)","v":"NA"},{"$f":"IF(C258=0,\"\",\"in. diam\")","v":""},{"$f":"IF(C258=0,\"NA\",IF(curve=1,proc_meter_size,VLOOKUP(proc_meter_size,mag_fm_cost_cl,2)))","v":"NA"},{"$f":"IF(C258=0,\"\",\"in. diam\")","v":""},{"$f":"IF(C258=0,\"NA\",IF(curve=1,mag_fm_eq_proc,VLOOKUP(proc_meter_size,mag_fm_cost_cl,3)))","v":"NA"},{"$f":"IF(OR(I258=\"NA\",I258=\"contact vendor\"),\"--\",C258*I258)","v":"--"},{"$f":"IF(C258=0,\"NA\",VLOOKUP(proc_meter_size,mag_fm_cost_cl,IF(ss_cat=\"large\",4,5)))","v":"NA"},null,{"$f":"$B$248&\" - \"&$B$254&\" - \"&B258","v":"Instrumentation and Controls - Flow Meters - Process - Magnetic"},4,3,1,4,3,1,2,1,1,0,0]
["11.3","Flow Meters - Backwash",null,null,null,null,null,null,null,null,null,null,null,null,null,null,null,null,null,null,null,null,0,0]
["11.3.1","Orifice Plate",{"$f":"tot_fm_back","v":1},"units",{"$f":"IF(C260=0,\"NA\",back_meter_size)","v":8},{"$f":"IF(C260=0,\"\",\"in. diam\")","v":"in. diam"},{"$f":"IF(C260=0,\"NA\",IF(curve=1,back_meter_size,VLOOKUP(back_meter_size,op_fm_cost_cl,2)))","v":8},{"$f":"IF(C260=0,\"\",\"in. diam\")","v":"in. diam"},{"$f":"IF(C260=0,\"NA\",IF(curve=1,op_fm_eq_back,VLOOKUP(back_meter_size,op_fm_cost_cl,3)))","v":5294.5207323140003},{"$f":"IF(OR(I260=\"NA\",I260=\"contact vendor\"),\"--\",C260*I260)","v":5294.5207323140003},{"$f":"IF(C260=0,\"NA\",VLOOKUP(back_meter_size,op_fm_cost_cl,IF(ss_cat=\"large\",4,5)))","v":15},0,{"$f":"$B$248&\" - \"&$B$259&\" - \"&B260","v":"Instrumentation and Controls - Flow Meters - Backwash - Orifice Plate"},3,4,4,3,4,4,3,3,4,0,0]
["11.3.1","Propeller",{"$f":"tot_fm_back","v":1},"units",{"$f":"IF(C261=0,\"NA\",back_meter_size)","v":8},{"$f":"IF(C261=0,\"\",\"in. diam\")","v":"in. diam"},{"$f":"IF(C261=0,\"NA\",IF(curve=1,back_meter_size,VLOOKUP(back_meter_size,prop_fm_cost_cl,2)))","v":8},{"$f":"IF(C261=0,\"\",\"in. diam\")","v":"in. diam"},{"$f":"IF(C261=0,\"NA\",IF(curve=1,prop_fm_eq_back,VLOOKUP(back_meter_size,prop_fm_cost_cl,3)))","v":4543.643850110001},{"$f":"IF(OR(I261=\"NA\",I261=\"contact vendor\"),\"--\",C261*I261)","v":4543.643850110001},{"$f":"IF(C261=0,\"NA\",VLOOKUP(back_meter_size,prop_fm_cost_cl,IF(ss_cat=\"large\",4,5)))","v":15},0,{"$f":"$B$248&\" - \"&$B$259&\" - \"&B261","v":"Instrumentation and Controls - Flow Meters - Backwash - Propeller"},1,2,3,1,2,3,4,4,2,0,0]
["11.3.1","Venturi",{"$f":"tot_fm_back","v":1},"units",{"$f":"IF(C262=0,\"NA\",back_meter_size)","v":8},{"$f":"IF(C262=0,\"\",\"in. diam\")","v":"in. diam"},{"$f":"IF(C262=0,\"NA\",IF(curve=1,back_meter_size,VLOOKUP(back_meter_size,ven_fm_cost_cl,2)))","v":8},{"$f":"IF(C262=0,\"\",\"in. diam\")","v":"in. diam"},{"$f":"IF(C262=0,\"NA\",IF(curve=1,ven_fm_eq_back,VLOOKUP(back_meter_size,ven_fm_cost_cl,3)))","v":14411.689280529999},{"$f":"IF(OR(I262=\"NA\",I262=\"contact vendor\"),\"--\",C262*I262)","v":14411.689280529999},{"$f":"IF(C262=0,\"NA\",VLOOKUP(back_meter_size,ven_fm_cost_cl,IF(ss_cat=\"large\",4,5)))","v":15},1,{"$f":"$B$248&\" - \"&$B$259&\" - \"&B262","v":"Instrumentation and Controls - Flow Meters - Backwash - Venturi"},2,1,2,2,1,2,1,2,3,1,960.77928536866659]
["11.3.1","Magnetic",{"$f":"tot_fm_back","v":1},"units",{"$f":"IF(C263=0,\"NA\",back_meter_size)","v":8},{"$f":"IF(C263=0,\"\",\"in. diam\")","v":"in. diam"},{"$f":"IF(C263=0,\"NA\",IF(curve=1,back_meter_size,VLOOKUP(back_meter_size,mag_fm_cost_cl,2)))","v":8},{"$f":"IF(C263=0,\"\",\"in. diam\")","v":"in. diam"},{"$f":"IF(C263=0,\"NA\",IF(curve=1,mag_fm_eq_back,VLOOKUP(back_meter_size,mag_fm_cost_cl,3)))","v":8824.290431075},{"$f":"IF(OR(I263=\"NA\",I263=\"contact vendor\"),\"--\",C263*I263)","v":8824.290431075},{"$f":"IF(C263=0,\"NA\",VLOOKUP(back_meter_size,mag_fm_cost_cl,IF(ss_cat=\"large\",4,5)))","v":15},0,{"$f":"$B$248&\" - \"&$B$259&\" - \"&B263","v":"Instrumentation and Controls - Flow Meters - Backwash - Magnetic"},4,3,1,4,3,1,2,1,1,0,0]
["11.4","Flow Meters - Residuals",null,null,null,null,null,null,null,null,null,null,null,null,null,null,null,null,null,null,null,null,0,0]
["11.4.1","Orifice Plate",{"$f":"tot_fm_res","v":1},"units",{"$f":"res_meter_size","v":6},"in. diam",{"$f":"IF(curve=1,res_meter_size,VLOOKUP(res_meter_size,op_fm_cost_cl,2))","v":6},"in. diam",{"$f":"IF(curve=1,op_fm_eq_res,VLOOKUP(res_meter_size,op_fm_cost_cl,3))","v":4647.0885810220007},{"$f":"IF(I265=\"contact vendor\",\"--\",C265*I265)","v":4647.0885810220007},{"$f":"VLOOKUP(res_meter_size,op_fm_cost_cl,IF(ss_cat=\"large\",4,5))","v":15},0,{"$f":"$B$248&\" - \"&$B$264&\" - \"&B265","v":"Instrumentation and Controls - Flow Meters - Residuals - Orifice Plate"},3,4,4,3,4,4,3,3,4,0,0]
["11.4.1","Propeller",{"$f":"tot_fm_res","v":1},"units",{"$f":"res_meter_size","v":6},"in. diam",{"$f":"IF(curve=1,res_meter_size,VLOOKUP(res_meter_size,prop_fm_cost_cl,2))","v":6},"in. diam",{"$f":"IF(curve=1,prop_fm_eq_res,VLOOKUP(res_meter_size,prop_fm_cost_cl,3))","v":4141.3172835800005},{"$f":"IF(I266=\"contact vendor\",\"--\",C266*I266)","v":4141.3172835800005},{"$f":"VLOOKUP(res_meter_size,prop_fm_cost_cl,IF(ss_cat=\"large\",4,5))","v":15},0,{"$f":"$B$248&\" - \"&$B$264&\" - \"&B266","v":"Instrumentation and Controls - Flow Meters - Residuals - Propeller"},1,2,3,1,2,3,4,4,2,0,0]
["11.4.1","Venturi",{"$f":"tot_fm_res","v":1},"units",{"$f":"res_meter_size","v":6},"in. diam",{"$f":"IF(curve=1,res_meter_size,VLOOKUP(res_meter_size,ven_fm_cost_cl,2))","v":6},"in. diam",{"$f":"IF(curve=1,ven_fm_eq_res,VLOOKUP(res_meter_size,ven_fm_cost_cl,3))","v":12496.013199414001},{"$f":"IF(I267=\"contact vendor\",\"--\",C267*I267)","v":12496.013199414001},{"$f":"VLOOKUP(res_meter_size,ven_fm_cost_cl,IF(ss_cat=\"large\",4,5))","v":15},1,{"$f":"$B$248&\" - \"&$B$264&\" - \"&B267","v":"Instrumentation and Controls - Flow Meters - Residuals - Venturi"},2,1,2,2,1,2,1,2,3,1,833.06754662760011]
["11.4.1","Magnetic",{"$f":"tot_fm_res","v":1},"units",{"$f":"res_meter_size","v":6},"in. diam",{"$f":"IF(curve=1,res_meter_size,VLOOKUP(res_meter_size,mag_fm_cost_cl,2))","v":6},"in. diam",{"$f":"IF(curve=1,mag_fm_eq_res,VLOOKUP(res_meter_size,mag_fm_cost_cl,3))","v":6832.4704246649999},{"$f":"IF(I268=\"contact vendor\",\"--\",C268*I268)","v":6832.4704246649999},{"$f":"VLOOKUP(res_meter_size,mag_fm_cost_cl,IF(ss_cat=\"large\",4,5))","v":15},0,{"$f":"$B$248&\" - \"&$B$264&\" - \"&B268","v":"Instrumentation and Controls - Flow Meters - Residuals - Magnetic"},4,3,1,4,3,1,2,1,1,0,0]
[11.5,"Level Switch/Alarm (for vessels)",{"$f":"tot_level_switch","v":0},"units","NA",null,"NA",null,{"$f":"IF(tot_level_switch=0,\"NA\",VLOOKUP(0,alarm_cost_cl,3))","v":"NA"},{"$f":"IF(tot_level_switch=0,\"--\",IF(I269=\"contact vendor\",\"--\",C269*I269))","v":"--"},{"$f":"IF(tot_level_switch=0,\"NA\",VLOOKUP(0,alarm_cost_cl,IF(ss_cat=\"large\",4,5)))","v":"NA"},null,{"$f":"$B$248&\" - \"&B269","v":"Instrumentation and Controls - Level Switch/Alarm (for vessels)"},1,1,1,1,1,1,1,1,1,0,0]
[11.6,"High/Low Alarm (for backwash tanks)",{"$f":"tot_back_alarm","v":0},"units","NA",null,"NA",null,{"$f":"IF(C270=0,\"NA\",VLOOKUP(0,alarm_cost_cl,3))","v":"NA"},{"$f":"IF(C270=0,\"--\",IF(I270=\"contact vendor\",\"--\",C270*I270))","v":"--"},{"$f":"IF(C270=0,\"NA\",VLOOKUP(0,alarm_cost_cl,IF(ss_cat=\"large\",4,5)))","v":"NA"},null,"Instrumentation and Controls - High/Low Alarm (for backwash tanks)",1,1,1,1,1,1,1,1,1,0,0]
[11.7,"High/Low Alarm (for mixing tanks)",{"$f":"tot_brine_alarm","v":0},"units","NA",null,"NA",null,{"$f":"IF(tot_brine_alarm=0,\"NA\",VLOOKUP(0,alarm_cost_cl,3))","v":"NA"},{"$f":"IF(tot_brine_alarm=0,\"--\",IF(I271=\"contact vendor\",\"--\",C271*I271))","v":"--"},{"$f":"IF(tot_brine_alarm=0,\"NA\",VLOOKUP(0,alarm_cost_cl,IF(ss_cat=\"large\",4,5)))","v":"NA"},null,"Instrumentation and Controls - High/Low Alarm (for mixing tanks)",1,1,1,1,1,1,1,1,1,0,0]
[11.8,"High/Low Alarm (for acid tanks)",{"$f":"tot_acid_alarm","v":0},"units","NA",null,"NA",null,{"$f":"IF(tot_acid_alarm=0,\"NA\",VLOOKUP(0,alarm_cost_cl,3))","v":"NA"},{"$f":"IF(tot_acid_alarm=0,\"--\",IF(I272=\"contact vendor\",\"--\",C272*I272))","v":"--"},{"$f":"IF(tot_acid_alarm=0,\"NA\",VLOOKUP(0,alarm_cost_cl,IF(ss_cat=\"large\",4,5)))","v":"NA"},null,"Instrumentation and Controls - High/Low Alarm (for acid tanks)",1,1,1,1,1,1,1,1,1,0,0]
[11.9,"High/Low Alarm (for caustic tanks)",{"$f":"tot_caustic_alarm","v":0},"units","NA",null,"NA",null,{"$f":"IF(tot_caustic_alarm=0,\"NA\",VLOOKUP(0,alarm_cost_cl,3))","v":"NA"},{"$f":"IF(tot_caustic_alarm=0,\"--\",IF(I273=\"contact vendor\",\"--\",C273*I273))","v":"--"},{"$f":"IF(tot_caustic_alarm=0,\"NA\",VLOOKUP(0,alarm_cost_cl,IF(ss_cat=\"large\",4,5)))","v":"NA"},null,"Instrumentation and Controls - High/Low Alarm (for caustic tanks)",1,1,1,1,1,1,1,1,1,0,0]
[11.1,"High/Low Alarm (for holding tanks)",{"$f":"tot_res_alarm","v":0},"units","NA",null,"NA",null,{"$f":"IF(C274=0,\"NA\",VLOOKUP(0,alarm_cost_cl,3))","v":"NA"},{"$f":"IF(OR(I274=\"contact vendor\",I274=\"NA\"),\"--\",C274*I274)","v":"--"},{"$f":"IF(C274=0,\"NA\",VLOOKUP(0,alarm_cost_cl,IF(ss_cat=\"large\",4,5)))","v":"NA"},null,"Instrumentation and Controls - High/Low Alarm (for holding tanks)",1,1,1,1,1,1,1,1,1,0,0]
[11.11,"Temperature meters",{"$f":"IF(design_flow<1,temp_meters_small,temp_meters)","v":1},"units","NA",null,"NA",null,{"$f":"VLOOKUP(0,temp_meter_cost_cl,3)","v":593.29510833944676},{"$f":"IF(I275=\"contact vendor\",\"--\",C275*I275)","v":593.29510833944676},{"$f":"VLOOKUP(0,temp_meter_cost_cl,IF(ss_cat=\"large\",4,5))","v":15},1,"Instrumentation and Controls - Temperature meters",1,1,1,1,1,1,1,1,1,1,39.55300722262978]
[11.12,"Head loss sensors",{"$f":"tot_head_sens","v":59},"units","NA",null,"NA",null,{"$f":"VLOOKUP(0,headloss_cost_cl,3)","v":2121.0930305173688},{"$f":"IF(I276=\"contact vendor\",\"--\",C276*I276)","v":125144.48880052476},{"$f":"VLOOKUP(0,headloss_cost_cl,IF(ss_cat=\"large\",4,5))","v":15},1,"Instrumentation and Controls - Head loss sensors",1,1,1,1,1,1,1,1,1,1,8342.9659200349834]
[11.13,"Sampling Ports",null,null,null,null,null,null,null,null,null,null,null,null,null,null,null,null,null,null,null,null,0,0]
["11.13.1","Stainless Steel",{"$f":"ports","v":33},"units","NA",null,"NA",null,50,{"$f":"IF(OR(C278=0,I278=\"contact vendor\"),\"--\",C278*I278)","v":1650},{"$f":"IF(ss_cat=\"large\",35,30)","v":35},1,{"$f":"$B$248&\" - \"&$B$277&\" - \"&B278","v":"Instrumentation and Controls - Sampling Ports - Stainless Steel"},1,2,2,1,2,2,1,2,2,1,47.142857142857146]
["11.13.1","Carbon Steel",{"$f":"ports","v":33},"units","NA",null,"NA",null,50,1650,{"$f":"IF(ss_cat=\"large\",25,22)","v":25},0,{"$f":"$B$248&\" - \"&$B$277&\" - \"&B279","v":"Instrumentation and Controls - Sampling Ports - Carbon Steel"},2,1,1,2,1,1,2,1,1,0,0]
[11.14,"Electrical Enclosure",{"$f":"elec_encl","v":0},"units","NA",null,"NA",null,{"$f":"VLOOKUP(0,elec_encl_cost_cl,3)","v":1201.1687264911338},"--",{"$f":"VLOOKUP(0,elec_encl_cost_cl,IF(ss_cat=\"large\",4,5))","v":22},null,{"$f":"$B$248&\" - \"&B280","v":"Instrumentation and Controls - Electrical Enclosure"},1,1,1,1,1,1,1,1,1,0,0]
[11.15,"ORP sensors",{"$f":"ORP_sensor","v":0},"units","NA",null,"NA",null,{"$f":"VLOOKUP(0,orp_anal_cost_cl,3)","v":2030.9784551627101},"--",{"$f":"VLOOKUP(0,orp_anal_cost_cl,IF(ss_cat=\"large\",4,5))","v":15},null,{"$f":"$B$248&\" - \"&B281","v":"Instrumentation and Controls - ORP sensors"},1,1,1,1,1,1,1,1,1,0,0]
[11.16,"pH Meters",{"$f":"pH_controls","v":0},"units","NA",null,"NA",null,{"$f":"VLOOKUP(0,pH_meter_cost_cl,3)","v":2632.3973326835253},"--",{"$f":"VLOOKUP(0,pH_meter_cost_cl,IF(ss_cat=\"large\",4,5))","v":15},null,{"$f":"$B$248&\" - \"&B282","v":"Instrumentation and Controls - pH Meters"},1,1,1,1,1,1,1,1,1,0,0]
[11.17,"Turbidity meters",{"$f":"tot_turb_meters","v":1},"units","NA",null,"NA",null,{"$f":"VLOOKUP(0,turbidimeter_cost_cl,3)","v":5223.1635202481766},5223.1635202481766,{"$f":"VLOOKUP(0,turbidimeter_cost_cl,IF(ss_cat=\"large\",4,5))","v":15},1,{"$f":"$B$248&\" - \"&B283","v":"Instrumentation and Controls - Turbidity meters"},1,1,1,1,1,1,1,1,1,1,348.21090134987844]
[11.18,"Conductivity meters",{"$f":"tot_cond_meters","v":0},"units","NA",null,"NA",null,{"$f":"VLOOKUP(0,conduct_meter_cost_cl,3)","v":1615.8991512850687},"--",{"$f":"VLOOKUP(0,conduct_meter_cost_cl,IF(ss_cat=\"large\",4,5))","v":15},null,{"$f":"$B$248&\" - \"&B284","v":"Instrumentation and Controls - Conductivity meters"},1,1,1,1,1,1,1,1,1,0,0]
[12,"System Controls ",null,null,null,null,null,null,null,null,null,null,null,null,null,null,null,null,null,null,null,null,0,0]
[12.1,"PLC Units",null,null,null,null,null,null,null,null,null,null,null,null,null,null,null,null,null,null,null,null,0,0]
["12.1.1","PLC racks/power supplies",{"$f":"IF(manual=1,0,plc_rack)","v":5},"units","NA",null,"NA",null,{"$f":"IF(manual=1,\"NA\",VLOOKUP(0,plc_rack_cost_cl,3))","v":340.15912297436552},{"$f":"IF(I287=\"contact vendor\",\"--\",IF(manual=1,0,C287*I287))","v":1700.7956148718276},{"$f":"IF(manual=1,\"NA\",VLOOKUP(0,plc_rack_cost_cl,IF(ss_cat=\"large\",4,5)))","v":10},1,{"$f":"$B$285&\" - \"&$B$286&\" - \"&B287","v":"System Controls  - PLC Units - PLC racks/power supplies"},1,1,1,1,1,1,1,1,1,1,170.07956148718276]
["12.1.2","CPUs",{"$f":"IF(manual=1,0,plc_cpu)","v":2},"units","NA",null,"NA",null,{"$f":"IF(manual=1,\"NA\",VLOOKUP(0,plc_cpu_cost_cl,3))","v":628.20399656420727},{"$f":"IF(I288=\"contact vendor\",\"--\",IF(manual=1,0,C288*I288))","v":1256.4079931284145},{"$f":"IF(manual=1,\"NA\",VLOOKUP(0,plc_cpu_cost_cl,IF(ss_cat=\"large\",4,5)))","v":10},1,{"$f":"$B$285&\" - \"&$B$286&\" - \"&B288","v":"System Controls  - PLC Units - CPUs"},1,1,1,1,1,1,1,1,1,1,125.64079931284145]
["12.1.3","I/O discrete input modules",{"$f":"IF(manual=1,0,plc_discrete_input)","v":4},"units","NA",null,"NA",null,{"$f":"IF(manual=1,\"NA\",VLOOKUP(0,plc_discrete_input_cost_cl,3))","v":306.87179411739436},1227.4871764695774,{"$f":"IF(manual=1,\"NA\",VLOOKUP(0,plc_discrete_input_cost_cl,IF(ss_cat=\"large\",4,5)))","v":10},1,"System Controls  - PLC Units - I/O discrete input modules",1,1,1,1,1,1,1,1,1,1,122.74871764695774]
["12.1.4","I/O discrete output modules",{"$f":"IF(manual=1,0,plc_discrete_output)","v":1},"units","NA",null,"NA",null,{"$f":"IF(manual=1,\"NA\",VLOOKUP(0,plc_discrete_output_cost_cl,3))","v":374.94265970264058},{"$f":"IF(I290=\"contact vendor\",\"--\",IF(manual=1,0,C290*I290))","v":374.94265970264058},{"$f":"IF(manual=1,\"NA\",VLOOKUP(0,plc_discrete_output_cost_cl,IF(ss_cat=\"large\",4,5)))","v":10},1,"System Controls  - PLC Units - I/O discrete output modules",1,1,1,1,1,1,1,1,1,1,37.49426597026406]
["12.1.5","I/O combination analog modules",{"$f":"IF(manual=1,0,plc_combination_analog)","v":29},"units","NA",null,"NA",null,{"$f":"IF(manual=1,\"NA\",VLOOKUP(0,plc_combination_analog_cost_cl,3))","v":652.67796318607805},{"$f":"IF(I291=\"contact vendor\",\"--\",IF(manual=1,0,C291*I291))","v":18927.660932396262},{"$f":"IF(manual=1,\"NA\",VLOOKUP(0,plc_combination_analog_cost_cl,IF(ss_cat=\"large\",4,5)))","v":10},1,"System Controls  - PLC Units - I/O combination analog modules",1,1,1,1,1,1,1,1,1,1,1892.7660932396261]
["12.1.6","Ethernet modules",{"$f":"IF(manual=1,0,plc_ethernet)","v":2},"units","NA",null,"NA",null,{"$f":"IF(manual=1,\"NA\",VLOOKUP(0,plc_ethernet_cost_cl,3))","v":865.22261904631989},{"$f":"IF(I292=\"contact vendor\",\"--\",IF(manual=1,0,C292*I292))","v":1730.4452380926398},{"$f":"IF(manual=1,\"NA\",VLOOKUP(0,plc_ethernet_cost_cl,IF(ss_cat=\"large\",4,5)))","v":10},1,"System Controls  - PLC Units - Ethernet modules",1,1,1,1,1,1,1,1,1,1,173.04452380926398]
["12.1.7","Base expansion modules",{"$f":"IF(manual=1,0,plc_base_expansion)","v":4},"units","NA",null,"NA",null,{"$f":"IF(manual=1,\"NA\",VLOOKUP(0,plc_base_expansion_cost_cl,3))","v":118.37181499391322},473.48725997565288,{"$f":"IF(manual=1,\"NA\",VLOOKUP(0,plc_base_expansion_cost_cl,IF(ss_cat=\"large\",4,5)))","v":10},1,"System Controls  - PLC Units - Base expansion modules",1,1,1,1,1,1,1,1,1,1,47.348725997565289]
["12.1.8","Base expansion controller modules",{"$f":"IF(manual=1,0,plc_base_expansion_controller)","v":4},"units","NA",null,"NA",null,{"$f":"IF(manual=1,\"NA\",VLOOKUP(0,plc_base_expansion_controller_cost_cl,3))","v":85.678421835734241},342.71368734293696,{"$f":"IF(manual=1,\"NA\",VLOOKUP(0,plc_base_expansion_controller_cost_cl,IF(ss_cat=\"large\",4,5)))","v":10},1,"System Controls  - PLC Units - Base expansion controller modules",1,1,1,1,1,1,1,1,1,1,34.271368734293695]
["12.1.9","UPSs",{"$f":"IF(manual=1,0,ups)","v":1},"units","NA",null,"NA",null,{"$f":"IF(manual=1,\"NA\",VLOOKUP(0,ups_cost_cl,3))","v":563.15461702991672},{"$f":"IF(I295=\"contact vendor\",\"--\",IF(manual=1,0,C295*I295))","v":563.15461702991672},{"$f":"IF(manual=1,\"NA\",VLOOKUP(0,ups_cost_cl,IF(ss_cat=\"large\",4,5)))","v":10},1,"System Controls  - PLC Units - UPSs",1,1,1,1,1,1,1,1,1,1,56.315461702991669]
[12.2,"Operator Equipment",null,null,null,null,null,null,null,null,null,null,null,null,null,null,null,null,null,null,null,null,0,0]
["12.2.1","Drive controllers",{"$f":"IF(manual=1,0,tot_switches)","v":9},"units","NA",null,"NA",null,{"$f":"IF(manual=1,\"NA\",VLOOKUP(0,switch_cost_cl,3))","v":1072.4341728020522},{"$f":"IF(I297=\"contact vendor\",\"--\",IF(manual=1,0,C297*I297))","v":9651.9075552184695},{"$f":"IF(manual=1,\"NA\",VLOOKUP(0,switch_cost_cl,IF(ss_cat=\"large\",4,5)))","v":15},1,{"$f":"$B$285&\" - \"&$B$296&\" - \"&B297","v":"System Controls  - Operator Equipment - Drive controllers"},1,1,1,1,1,1,1,1,1,{"$f":"IF(ISERROR(K297*L297),0,IF(K297<1,0,L297))","v":1},{"$f":"IF(W297,J297/K297,0)","v":643.46050368123133}]
["12.2.2","Operator interface units",{"$f":"IF(manual=1,0,plc_interface)","v":2},"units","NA",null,"NA",null,{"$f":"IF(manual=1,\"NA\",VLOOKUP(ss_cat,plc_op_interface_cost_cl,3,FALSE))","v":459.89513426134209},{"$f":"IF(I298=\"contact vendor\",\"--\",IF(manual=1,0,C298*I298))","v":919.79026852268419},{"$f":"IF(manual=1,\"NA\",VLOOKUP(ss_cat,plc_op_interface_cost_cl,IF(ss_cat=\"large\",4,5),FALSE))","v":10},1,{"$f":"$B$285&\" - \"&$B$296&\" - \"&B298","v":"System Controls  - Operator Equipment - Operator interface units"},1,1,1,1,1,1,1,1,1,1,91.979026852268419]
["12.2.3","PC Workstations",{"$f":"IF(OR(manual=1,ss_cat=\"small\"),0,workstations)","v":1},"units","NA",null,"NA",null,{"$f":"IF(manual=1,\"NA\",VLOOKUP(0,pc_workstation_cost_cl,3))","v":1006.4840370291496},{"$f":"IF(I299=\"contact vendor\",\"--\",IF(manual=1,0,C299*I299))","v":1006.4840370291496},{"$f":"IF(manual=1,\"NA\",VLOOKUP(0,pc_workstation_cost_cl,IF(ss_cat=\"large\",4,5)))","v":10},1,{"$f":"$B$285&\" - \"&$B$296&\" - \"&B299","v":"System Controls  - Operator Equipment - PC Workstations"},1,1,1,1,1,1,1,1,1,1,100.64840370291496]
["12.2.4","Printers - laser jet",{"$f":"IF(OR(manual=1,ss_cat=\"small\"),0,printers)","v":1},"units","NA",null,"NA",null,{"$f":"IF(manual=1,\"NA\",VLOOKUP(0,laser_printer_cost_cl,3))","v":627.16285861019526},{"$f":"IF(I300=\"contact vendor\",\"--\",IF(manual=1,0,C300*I300))","v":627.16285861019526},{"$f":"IF(manual=1,\"NA\",VLOOKUP(0,laser_printer_cost_cl,IF(ss_cat=\"large\",4,5)))","v":10},1,{"$f":"$B$285&\" - \"&$B$296&\" - \"&B300","v":"System Controls  - Operator Equipment - Printers - laser jet"},1,1,1,1,1,1,1,1,1,1,62.716285861019529]
["12.2.5","Printers - dot matrix",{"$f":"IF(OR(manual=1,ss_cat=\"small\"),0,printers)","v":1},"units","NA",null,"NA",null,{"$f":"IF(manual=1,\"NA\",VLOOKUP(0,dotmatrix_printer_cost_cl,3))","v":641.91281559323488},{"$f":"IF(I301=\"contact vendor\",\"--\",IF(manual=1,0,C301*I301))","v":641.91281559323488},{"$f":"IF(manual=1,\"NA\",VLOOKUP(0,dotmatrix_printer_cost_cl,IF(ss_cat=\"large\",4,5)))","v":10},1,{"$f":"$B$285&\" - \"&$B$296&\" - \"&B301","v":"System Controls  - Operator Equipment - Printers - dot matrix"},1,1,1,1,1,1,1,1,1,1,64.191281559323485]
[12.3,"Controls Software",null,null,null,null,null,null,null,null,null,null,null,null,null,null,null,null,null,null,null,null,0,0]
["12.3.1","Operator interface software",{"$f":"IF(OR(manual=1,ss_cat=\"small\"),0,plc_interface)","v":2},"units","NA",null,"NA",null,{"$f":"IF(manual=1,\"NA\",VLOOKUP(0,op_interface_software_cost_cl,3))","v":183.22815160365667},{"$f":"IF(I303=\"contact vendor\",\"--\",IF(manual=1,0,C303*I303))","v":366.45630320731334},{"$f":"IF(manual=1,\"NA\",VLOOKUP(0,op_interface_software_cost_cl,IF(ss_cat=\"large\",4,5)))","v":10},1,{"$f":"$B$285&\" - \"&$B$302&\" - \"&B303","v":"System Controls  - Controls Software - Operator interface software"},1,1,1,1,1,1,1,1,1,1,36.645630320731335]
["12.3.2","PLC programming software",{"$f":"IF(OR(manual=1,ss_cat=\"small\"),0,workstations)","v":1},"units","NA",null,"NA",null,{"$f":"IF(manual=1,\"NA\",VLOOKUP(0,plc_software_cost_cl,3))","v":473.69298983008503},{"$f":"IF(I304=\"contact vendor\",\"--\",IF(manual=1,0,C304*I304))","v":473.69298983008503},{"$f":"IF(manual=1,\"NA\",VLOOKUP(0,plc_software_cost_cl,IF(ss_cat=\"large\",4,5)))","v":10},1,{"$f":"$B$285&\" - \"&$B$302&\" - \"&B304","v":"System Controls  - Controls Software - PLC programming software"},1,1,1,1,1,1,1,1,1,1,47.369298983008505]
["12.3.3","PLC data collection software",{"$f":"IF(OR(manual=1,ss_cat=\"small\"),0,workstations)","v":1},"units","NA",null,"NA",null,{"$f":"IF(manual=1,\"NA\",VLOOKUP(0,plc_data_software_cost_cl,3))","v":690.22366161995012},{"$f":"IF(I305=\"contact vendor\",\"--\",IF(manual=1,0,C305*I305))","v":690.22366161995012},{"$f":"IF(manual=1,\"NA\",VLOOKUP(0,plc_data_software_cost_cl,IF(ss_cat=\"large\",4,5)))","v":10},1,{"$f":"$B$285&\" - \"&$B$302&\" - \"&B305","v":"System Controls  - Controls Software - PLC data collection software"},1,1,1,1,1,1,1,1,1,1,69.022366161995009]
["12.3.4","Plant intelligence software",{"$f":"IF(OR(manual=1,ss_cat=\"small\"),0,workstations)","v":1},"units","NA",null,"NA",null,{"$f":"IF(OR(manual=1,ss_cat=\"small\"),\"NA\",VLOOKUP(0,plant_intel_software_cost_cl,3))","v":11480.115842868938},{"$f":"IF(I306=\"contact vendor\",\"--\",IF(OR(manual=1,ss_cat=\"small\"),0,C306*I306))","v":11480.115842868938},{"$f":"IF(OR(manual=1,ss_cat=\"small\"),\"NA\",VLOOKUP(0,plant_intel_software_cost_cl,IF(ss_cat=\"large\",4,5)))","v":10},1,{"$f":"$B$285&\" - \"&$B$302&\" - \"&B306","v":"System Controls  - Controls Software - Plant intelligence software"},1,1,1,1,1,1,1,1,1,1,1148.0115842868938]
[13,"Building Structures and HVAC",null,null,null,null,null,null,null,null,null,null,null,null,null,null,null,null,null,null,null,null,0,0]
[13.1,"Building 1",null,null,null,null,null,null,null,null,null,null,null,null,null,null,null,null,null,null,null,null,0,0]
["13.1.1","Small Low Cost Shed",{"$f":"IF(AND(build1_fp>0,build1_fp<500),1,0)","v":0},"units",{"$f":"build1_fp","v":22360},"sf",{"$f":"build1_fp","v":22360},"sf",{"$f":"IF(C309=0,\"NA\",VLOOKUP(build1_fp,bldg_shed_cost_cl,3))","v":"NA"},{"$f":"IF(OR(I309=\"NA\",I309=\"contact vendor\"),\"--\",G309*I309)","v":"--"},{"$f":"IF($C309=0,\"N/A\",VLOOKUP(build1_fp,bldg_shed_cost_cl,IF(ss_cat=\"large\",4,5)))","v":"N/A"},null,{"$f":"B307&\" - \"&B308&\" - \"&B309","v":"Building Structures and HVAC - Building 1 - Small Low Cost Shed"},{"$f":"IF(include_buildings=1,2,0)","v":2},2,2,2,2,2,2,2,2,0,0,{"$f":"IF(W309,K309,0)","v":0}]
["13.1.1","Low Quality",{"$f":"IF(build1_fp>=500,1,0)","v":1},"units",{"$f":"build1_fp","v":22360},"sf",{"$f":"build1_fp","v":22360},"sf",{"$f":"IF(C310=0,\"NA\",IF(curve=1,bldg_lo_eq_1,VLOOKUP(build1_fp, bldg_lo_cost_cl,3)))","v":58.876582172810558},{"$f":"IF(OR(I310=\"NA\",I310=\"contact vendor\"),\"--\",G310*I310)","v":1316480.377384044},{"$f":"IF($C310=0,\"N/A\",VLOOKUP(build1_fp,bldg_lo_cost_cl,IF(ss_cat=\"large\",4,5)))","v":40},1,{"$f":"B307&\" - \"&B308&\" - \"&B310","v":"Building Structures and HVAC - Building 1 - Low Quality"},{"$f":"include_buildings","v":1},null,null,{"$f":"include_buildings","v":1},null,null,{"$f":"include_buildings","v":1},null,null,1,32912.009434601103,{"$f":"IF(W310,K310,0)","v":40}]
["13.1.1","Medium Quality",{"$f":"IF(build1_fp>=500,1,0)","v":1},"units",{"$f":"build1_fp","v":22360},"sf",{"$f":"build1_fp","v":22360},"sf",{"$f":"IF(C311=0,\"NA\",IF(curve=1,bldg_mid_eq_1,VLOOKUP(build1_fp, bldg_mid_cost_cl,3)))","v":71.318725178273326},1594686.6949861916,{"$f":"IF($C311=0,\"N/A\",VLOOKUP(build1_fp,bldg_mid_cost_cl,IF(ss_cat=\"large\",4,5)))","v":40},0,{"$f":"B307&\" - \"&B308&\" - \"&B311","v":"Building Structures and HVAC - Building 1 - Medium Quality"},null,{"$f":"include_buildings","v":1},null,null,{"$f":"include_buildings","v":1},null,null,{"$f":"include_buildings","v":1},null,0,0,{"$f":"IF(W311,K311,0)","v":0}]
["13.1.1","High Quality",{"$f":"IF(build1_fp>=500,1,0)","v":1},"units",{"$f":"build1_fp","v":22360},"sf",{"$f":"build1_fp","v":22360},"sf",{"$f":"IF(C312=0,\"NA\",IF(curve=1,bldg_hi_eq_1,VLOOKUP(build1_fp, bldg_hi_cost_cl,3)))","v":89.008904792110499},1990239.1111515907,{"$f":"IF($C312=0,\"N/A\",VLOOKUP(build1_fp,bldg_hi_cost_cl,IF(ss_cat=\"large\",4,5)))","v":40},0,{"$f":"B307&\" - \"&B308&\" - \"&B312","v":"Building Structures and HVAC - Building 1 - High Quality"},null,null,{"$f":"include_buildings","v":1},null,null,{"$f":"include_buildings","v":1},null,null,{"$f":"include_buildings","v":1},0,0,{"$f":"IF(W312,K312,0)","v":0}]
["13.1.2",{"$f":"\"Heating System\"&IF(build1_heat=\"heat pump\",\" (included with cooling system)\",\"\")","v":"Heating System"},null,null,null,null,null,null,null,null,null,null,null,null,null,null,null,null,null,null,null,null,0,0]
["13.1.2.1","Electric resistance",{"$f":"IF(build1_heat=\"heat pump\",\"NA\",IF(build1_need_heat,build1_zones,\"NA\"))","v":1},{"$f":"IF(C314=\"NA\",\"\",\"zones\")","v":"zones"},{"$f":"IF(C314=\"NA\",\"NA\",build1_heat_mbh)","v":362.06159179643424},{"$f":"IF(C314=\"NA\",\"\",\"MBH\")","v":"MBH"},{"$f":"IF(C314=\"NA\",\"NA\",IF(curve=1,build1_heat_mbh,VLOOKUP(build1_heat_mbh,hvac_elec_cost_cl,2)))","v":362.06159179643424},{"$f":"IF(C314=\"NA\",\"\",\"MBH\")","v":"MBH"},{"$f":"IF(C314=\"NA\",\"NA\",IF(curve=1,hvac_elec_eq_1,VLOOKUP(build1_heat_mbh,hvac_elec_cost_cl,3)))","v":122814.3988587482},{"$f":"IF(OR(I314=\"NA\",I314=\"contact vendor\"),\"--\",C314*I314)","v":122814.3988587482},{"$f":"IF(C314=\"NA\",\"NA\",VLOOKUP(build1_heat_mbh,hvac_elec_cost_cl,IF(ss_cat=\"large\",4,5)))","v":25},0,{"$f":"B307&\" - \"&B308&\" - \"&B313&\" - \"&B314","v":"Building Structures and HVAC - Building 1 - Heating System - Electric resistance"},{"$f":"IF(include_HVAC=0,0,IF(build1_heat=$B314,1,\"\"))","v":""},"","","","","","","","",0,0]
["13.1.2.1","Natural gas non-condensing furnace",{"$f":"IF(build1_heat=\"heat pump\",\"NA\",IF(build1_need_heat,build1_zones,\"NA\"))","v":1},{"$f":"IF(C315=\"NA\",\"\",\"zones\")","v":"zones"},{"$f":"IF(C315=\"NA\",\"NA\",build1_heat_mbh)","v":362.06159179643424},{"$f":"IF(C315=\"NA\",\"\",\"MBH\")","v":"MBH"},{"$f":"IF(C315=\"NA\",\"NA\",IF(curve=1,build1_heat_mbh,VLOOKUP(build1_heat_mbh,hvac_gas_non_cost_cl,2)))","v":362.06159179643424},{"$f":"IF(C315=\"NA\",\"\",\"MBH\")","v":"MBH"},{"$f":"IF(C315=\"NA\",\"NA\",IF(curve=1,hvac_gas_non_eq_1,VLOOKUP(build1_heat_mbh,hvac_gas_non_cost_cl,3)))","v":79981.616570299171},{"$f":"IF(OR(I315=\"NA\",I315=\"contact vendor\"),\"--\",C315*I315)","v":79981.616570299171},{"$f":"IF(C315=\"NA\",\"NA\",VLOOKUP(build1_heat_mbh,hvac_gas_non_cost_cl,IF(ss_cat=\"large\",4,5)))","v":25},0,{"$f":"B307&\" - \"&B308&\" - \"&B313&\" - \"&B315","v":"Building Structures and HVAC - Building 1 - Heating System - Natural gas non-condensing furnace"},"","","","","","","","","",0,0]
["13.1.2.1","Natural gas condensing furnace",{"$f":"IF(build1_heat=\"heat pump\",\"NA\",IF(build1_need_heat,build1_zones,\"NA\"))","v":1},{"$f":"IF(C316=\"NA\",\"\",\"zones\")","v":"zones"},{"$f":"IF(C316=\"NA\",\"NA\",build1_heat_mbh)","v":362.06159179643424},{"$f":"IF(C316=\"NA\",\"\",\"MBH\")","v":"MBH"},{"$f":"IF(C316=\"NA\",\"NA\",IF(curve=1,build1_heat_mbh,VLOOKUP(build1_heat_mbh,hvac_gas_cost_cl,2)))","v":362.06159179643424},{"$f":"IF(C316=\"NA\",\"\",\"MBH\")","v":"MBH"},{"$f":"IF(C316=\"NA\",\"NA\",IF(curve=1,hvac_gas_eq_1,VLOOKUP(build1_heat_mbh,hvac_gas_cost_cl,3)))","v":79981.616570299171},{"$f":"IF(OR(I316=\"NA\",I316=\"contact vendor\"),\"--\",C316*I316)","v":79981.616570299171},{"$f":"IF(C316=\"NA\",\"NA\",VLOOKUP(build1_heat_mbh,hvac_gas_cost_cl,IF(ss_cat=\"large\",4,5)))","v":25},1,{"$f":"B307&\" - \"&B308&\" - \"&B313&\" - \"&B316","v":"Building Structures and HVAC - Building 1 - Heating System - Natural gas condensing furnace"},1,1,1,1,1,1,1,1,1,1,3199.2646628119669]
["13.1.2.1","Standard efficiency oil furnace",{"$f":"IF(build1_heat=\"heat pump\",\"NA\",IF(build1_need_heat,build1_zones,\"NA\"))","v":1},{"$f":"IF(C317=\"NA\",\"\",\"zones\")","v":"zones"},{"$f":"IF(C317=\"NA\",\"NA\",build1_heat_mbh)","v":362.06159179643424},{"$f":"IF(C317=\"NA\",\"\",\"MBH\")","v":"MBH"},{"$f":"IF(C317=\"NA\",\"NA\",IF(curve=1,build1_heat_mbh,VLOOKUP(E317,hvac_oil_std_cost_cl,2)))","v":362.06159179643424},{"$f":"IF(C317=\"NA\",\"\",\"MBH\")","v":"MBH"},{"$f":"IF(C317=\"NA\",\"NA\",IF(curve=1,hvac_oil_std_eq_1,VLOOKUP(build1_heat_mbh,hvac_oil_std_cost_cl,3)))","v":84859.017061863167},{"$f":"IF(OR(I317=\"NA\",I317=\"contact vendor\"),\"--\",C317*I317)","v":84859.017061863167},{"$f":"IF(C317=\"NA\",\"NA\",VLOOKUP(build1_heat_mbh,hvac_oil_std_cost_cl,IF(ss_cat=\"large\",4,5)))","v":25},0,{"$f":"B307&\" - \"&B308&\" - \"&B313&\" - \"&B317","v":"Building Structures and HVAC - Building 1 - Heating System - Standard efficiency oil furnace"},"","","","","","","","","",0,0]
["13.1.2.1","Mid-efficiency oil furnace",{"$f":"IF(build1_heat=\"heat pump\",\"NA\",IF(build1_need_heat,build1_zones,\"NA\"))","v":1},{"$f":"IF(C318=\"NA\",\"\",\"zones\")","v":"zones"},{"$f":"IF(C318=\"NA\",\"NA\",build1_heat_mbh)","v":362.06159179643424},{"$f":"IF(C318=\"NA\",\"\",\"MBH\")","v":"MBH"},{"$f":"IF(C318=\"NA\",\"NA\",IF(curve=1,build1_heat_mbh,VLOOKUP(build1_heat_mbh,hvac_oil_mid_cost_cl,2)))","v":362.06159179643424},{"$f":"IF(C318=\"NA\",\"\",\"MBH\")","v":"MBH"},{"$f":"IF(C318=\"NA\",\"NA\",IF(curve=1,hvac_oil_mid_eq_1,VLOOKUP(build1_heat_mbh,hvac_oil_mid_cost_cl,3)))","v":84859.017061863167},{"$f":"IF(OR(I318=\"NA\",I318=\"contact vendor\"),\"--\",C318*I318)","v":84859.017061863167},{"$f":"IF(C318=\"NA\",\"NA\",VLOOKUP(build1_heat_mbh,hvac_oil_mid_cost_cl,IF(ss_cat=\"large\",4,5)))","v":25},0,{"$f":"B307&\" - \"&B308&\" - \"&B313&\" - \"&B318","v":"Building Structures and HVAC - Building 1 - Heating System - Mid-efficiency oil furnace"},"","","","","","","","","",0,0]
["13.1.3",{"$f":"IF(build1_heat=\"heat pump\",\"Heating and \",\"\")&\"Cooling System\"","v":"Cooling System"},null,null,null,null,null,null,null,null,null,null,null,null,null,null,null,null,null,null,null,null,0,0]
["13.1.3.1","Air conditioner",{"$f":"IF(build1_need_cool,build1_zones,\"NA\")","v":1},{"$f":"IF(C320=\"NA\",\"\",\"zones\")","v":"zones"},{"$f":"IF(C320=\"NA\",\"NA\",build1_cooling_tons)","v":9.3165564509936409},{"$f":"IF(C320=\"NA\",\"\",\"tons\")","v":"tons"},{"$f":"IF(C320=\"NA\",\"NA\",IF(curve=1,build1_cooling_tons,VLOOKUP(build1_cooling_tons,hvac_ac_cost_cl,2)))","v":9.3165564509936409},{"$f":"IF(C320=\"NA\",\"\",\"tons\")","v":"tons"},{"$f":"IF(C320=\"NA\",\"NA\",IF(curve=1,hvac_ac_eq_1,VLOOKUP(build1_cooling_tons,hvac_ac_cost_cl,3)))","v":35689.537748661809},{"$f":"IF(OR(I320=\"NA\",I320=\"contact vendor\"),\"--\",C320*I320)","v":35689.537748661809},{"$f":"IF(C320=\"NA\",\"NA\",VLOOKUP(build1_cooling_tons,hvac_ac_cost_cl,IF(ss_cat=\"large\",4,5)))","v":25},1,{"$f":"B307&\" - \"&B308&\" - \"&B319&\" - \"&B320","v":"Building Structures and HVAC - Building 1 - Cooling System - Air conditioner"},{"$f":"IF(include_HVAC=0,0,IF(build1_cool=$B320,1,\"\"))","v":1},1,1,1,1,1,1,1,1,1,1427.5815099464724]
["13.1.3.1","Heat pump",{"$f":"IF(AND(hp_ok_1,build1_need_cool),build1_zones,\"NA\")","v":"NA"},{"$f":"IF(C321=\"NA\",\"\",\"zones\")","v":""},{"$f":"IF(C321=\"NA\",\"NA\",build1_cooling_tons)","v":"NA"},{"$f":"IF(C321=\"NA\",\"\",\"tons\")","v":""},{"$f":"IF(C321=\"NA\",\"NA\",IF(curve=1,build1_cooling_tons,VLOOKUP(build1_cooling_tons,hvac_hp_cost_cl,2)))","v":"NA"},{"$f":"IF(C321=\"NA\",\"\",\"tons\")","v":""},{"$f":"IF(C321=\"NA\",\"NA\",IF(curve=1,hvac_hp_eq_1,VLOOKUP(build1_cooling_tons,hvac_hp_cost_cl,3)))","v":"NA"},{"$f":"IF(OR(I321=\"NA\",I321=\"contact vendor\"),\"--\",C321*I321)","v":"--"},{"$f":"IF(C321=\"NA\",\"NA\",VLOOKUP(build1_cooling_tons,hvac_hp_cost_cl,IF(ss_cat=\"large\",4,5)))","v":"NA"},0,{"$f":"B307&\" - \"&B308&\" - \"&B319&\" - \"&B321","v":"Building Structures and HVAC - Building 1 - Cooling System - Heat pump"},"","","","","","","","","",0,0]
[13.2,"Building 2",null,null,null,null,null,null,null,null,null,null,null,null,null,null,null,null,null,null,null,null,0,0]
["13.2.1","Small Low Cost Shed",{"$f":"IF(AND(build2_fp>0,build2_fp<500),1,0)","v":0},"units",{"$f":"build2_fp","v":3810},"sf",{"$f":"build2_fp","v":3810},"sf",{"$f":"IF(C323=0,\"NA\",VLOOKUP(build2_fp,bldg_shed_cost_cl,3))","v":"NA"},{"$f":"IF(OR(I323=\"NA\",I323=\"contact vendor\"),\"--\",G323*I323)","v":"--"},{"$f":"IF($C323=0,\"N/A\",VLOOKUP(build2_fp,bldg_shed_cost_cl,IF(ss_cat=\"large\",4,5)))","v":"N/A"},null,{"$f":"B307&\" - \"&B322&\" - \"&B323","v":"Building Structures and HVAC - Building 2 - Small Low Cost Shed"},{"$f":"IF(include_buildings=1,2,0)","v":2},2,2,2,2,2,2,2,2,0,0,{"$f":"IF(W323,K323,0)","v":0}]
["13.2.1","Low Quality",{"$f":"IF(build2_fp>=500,1,0)","v":1},"units",{"$f":"build2_fp","v":3810},"sf",{"$f":"build2_fp","v":3810},"sf",{"$f":"IF(C324=0,\"NA\",IF(curve=1,bldg_lo_eq_2,VLOOKUP(build2_fp, bldg_lo_cost_cl,3)))","v":69.893148070999302},266292.89415050735,{"$f":"IF($C324=0,\"N/A\",VLOOKUP(build2_fp,bldg_lo_cost_cl,IF(ss_cat=\"large\",4,5)))","v":40},1,{"$f":"B307&\" - \"&B322&\" - \"&B324","v":"Building Structures and HVAC - Building 2 - Low Quality"},{"$f":"include_buildings","v":1},null,null,{"$f":"include_buildings","v":1},null,null,{"$f":"include_buildings","v":1},null,null,1,6657.3223537626836,{"$f":"IF(W324,K324,0)","v":40}]
["13.2.1","Medium Quality",{"$f":"IF(build2_fp>=500,1,0)","v":1},"units",{"$f":"build2_fp","v":3810},"sf",{"$f":"build2_fp","v":3810},"sf",{"$f":"IF(C325=0,\"NA\",IF(curve=1,bldg_mid_eq_2,VLOOKUP(build2_fp, bldg_mid_cost_cl,3)))","v":84.860536459409005},323318.6439103483,{"$f":"IF($C325=0,\"N/A\",VLOOKUP(build2_fp,bldg_mid_cost_cl,IF(ss_cat=\"large\",4,5)))","v":40},0,{"$f":"B307&\" - \"&B322&\" - \"&B325","v":"Building Structures and HVAC - Building 2 - Medium Quality"},null,{"$f":"include_buildings","v":1},null,null,{"$f":"include_buildings","v":1},null,null,{"$f":"include_buildings","v":1},null,0,0,{"$f":"IF(W325,K325,0)","v":0}]
["13.2.1","High Quality",{"$f":"IF(build2_fp>=500,1,0)","v":1},"units",{"$f":"build2_fp","v":3810},"sf",{"$f":"build2_fp","v":3810},"sf",{"$f":"IF(C326=0,\"NA\",IF(curve=1,bldg_hi_eq_2,VLOOKUP(build2_fp, bldg_hi_cost_cl,3)))","v":112.48956879724031},428585.25711748557,{"$f":"IF($C326=0,\"N/A\",VLOOKUP(build2_fp,bldg_hi_cost_cl,IF(ss_cat=\"large\",4,5)))","v":40},0,{"$f":"B307&\" - \"&B322&\" - \"&B326","v":"Building Structures and HVAC - Building 2 - High Quality"},null,null,{"$f":"include_buildings","v":1},null,null,{"$f":"include_buildings","v":1},null,null,{"$f":"include_buildings","v":1},0,0,{"$f":"IF(W326,K326,0)","v":0}]
["13.2.2",{"$f":"\"Heating System\"&IF(build2_heat=\"heat pump\",\" (included with cooling system)\",\"\")","v":"Heating System (included with cooling system)"},null,null,null,null,null,null,null,null,null,null,null,null,null,null,null,null,null,null,null,null,0,0]
["13.2.2.1","Electric resistance",{"$f":"IF(build2_heat=\"heat pump\",\"NA\",IF(build2_need_heat,build2_zones,\"NA\"))","v":"NA"},{"$f":"IF(C328=\"NA\",\"\",\"zones\")","v":""},{"$f":"IF(C328=\"NA\",\"NA\",build2_heat_mbh)","v":"NA"},{"$f":"IF(C328=\"NA\",\"\",\"MBH\")","v":""},{"$f":"IF(C328=\"NA\",\"NA\",IF(curve=1,build2_heat_mbh,VLOOKUP(build2_heat_mbh,hvac_elec_cost_cl,2)))","v":"NA"},{"$f":"IF(C328=\"NA\",\"\",\"MBH\")","v":""},{"$f":"IF(C328=\"NA\",\"NA\",IF(curve=1,hvac_elec_eq_2,VLOOKUP(build2_heat_mbh,hvac_elec_cost_cl,3)))","v":"NA"},{"$f":"IF(OR(I328=\"NA\",I328=\"contact vendor\"),\"--\",C328*I328)","v":"--"},{"$f":"IF(C328=\"NA\",\"NA\",VLOOKUP(build2_heat_mbh,hvac_elec_cost_cl,IF(ss_cat=\"large\",4,5)))","v":"NA"},null,{"$f":"B307&\" - \"&B322&\" - \"&B327&\" - \"&B328","v":"Building Structures and HVAC - Building 2 - Heating System (included with cooling system) - Electric resistance"},{"$f":"IF(include_HVAC=0,0,IF(build2_heat=$B328,1,\"\"))","v":""},"","","","","","","","",0,0]
["13.2.2.1","Natural gas non-condensing furnace",{"$f":"IF(build2_heat=\"heat pump\",\"NA\",IF(build2_need_heat,build2_zones,\"NA\"))","v":"NA"},{"$f":"IF(C329=\"NA\",\"\",\"zones\")","v":""},{"$f":"IF(C329=\"NA\",\"NA\",build2_heat_mbh)","v":"NA"},{"$f":"IF(C329=\"NA\",\"\",\"MBH\")","v":""},{"$f":"IF(C329=\"NA\",\"NA\",IF(curve=1,build2_heat_mbh,VLOOKUP(build2_heat_mbh,hvac_gas_non_cost_cl,2)))","v":"NA"},{"$f":"IF(C329=\"NA\",\"\",\"MBH\")","v":""},{"$f":"IF(C329=\"NA\",\"NA\",IF(curve=1,hvac_gas_non_eq_2,VLOOKUP(build2_heat_mbh,hvac_gas_non_cost_cl,3)))","v":"NA"},{"$f":"IF(OR(I329=\"NA\",I329=\"contact vendor\"),\"--\",C329*I329)","v":"--"},{"$f":"IF(C329=\"NA\",\"NA\",VLOOKUP(build2_heat_mbh,hvac_gas_non_cost_cl,IF(ss_cat=\"large\",4,5)))","v":"NA"},null,{"$f":"B307&\" - \"&B322&\" - \"&B327&\" - \"&B329","v":"Building Structures and HVAC - Building 2 - Heating System (included with cooling system) - Natural gas non-condensing furnace"},"","","","","","","","","",0,0]
["13.2.2.1","Natural gas condensing furnace",{"$f":"IF(build2_heat=\"heat pump\",\"NA\",IF(build2_need_heat,build2_zones,\"NA\"))","v":"NA"},{"$f":"IF(C330=\"NA\",\"\",\"zones\")","v":""},{"$f":"IF(C330=\"NA\",\"NA\",build2_heat_mbh)","v":"NA"},{"$f":"IF(C330=\"NA\",\"\",\"MBH\")","v":""},{"$f":"IF(C330=\"NA\",\"NA\",IF(curve=1,build2_heat_mbh,VLOOKUP(build2_heat_mbh,hvac_gas_cost_cl,2)))","v":"NA"},{"$f":"IF(C330=\"NA\",\"\",\"MBH\")","v":""},{"$f":"IF(C330=\"NA\",\"NA\",IF(curve=1,hvac_gas_eq_2,VLOOKUP(build2_heat_mbh,hvac_gas_cost_cl,3)))","v":"NA"},{"$f":"IF(OR(I330=\"NA\",I330=\"contact vendor\"),\"--\",C330*I330)","v":"--"},{"$f":"IF(C330=\"NA\",\"NA\",VLOOKUP(build2_heat_mbh,hvac_gas_cost_cl,IF(ss_cat=\"large\",4,5)))","v":"NA"},null,{"$f":"B307&\" - \"&B322&\" - \"&B327&\" - \"&B330","v":"Building Structures and HVAC - Building 2 - Heating System (included with cooling system) - Natural gas condensing furnace"},"","","","","","","","","",0,0]
["13.2.2.1","Standard efficiency oil furnace",{"$f":"IF(build2_heat=\"heat pump\",\"NA\",IF(build2_need_heat,build2_zones,\"NA\"))","v":"NA"},{"$f":"IF(C331=\"NA\",\"\",\"zones\")","v":""},{"$f":"IF(C331=\"NA\",\"NA\",build2_heat_mbh)","v":"NA"},{"$f":"IF(C331=\"NA\",\"\",\"MBH\")","v":""},{"$f":"IF(C331=\"NA\",\"NA\",IF(curve=1,build2_heat_mbh,VLOOKUP(E331,hvac_oil_std_cost_cl,2)))","v":"NA"},{"$f":"IF(C331=\"NA\",\"\",\"MBH\")","v":""},{"$f":"IF(C331=\"NA\",\"NA\",IF(curve=1,hvac_oil_std_eq_2,VLOOKUP(build2_heat_mbh,hvac_oil_std_cost_cl,3)))","v":"NA"},{"$f":"IF(OR(I331=\"NA\",I331=\"contact vendor\"),\"--\",C331*I331)","v":"--"},{"$f":"IF(C331=\"NA\",\"NA\",VLOOKUP(build2_heat_mbh,hvac_oil_std_cost_cl,IF(ss_cat=\"large\",4,5)))","v":"NA"},null,{"$f":"B307&\" - \"&B322&\" - \"&B327&\" - \"&B331","v":"Building Structures and HVAC - Building 2 - Heating System (included with cooling system) - Standard efficiency oil furnace"},"","","","","","","","","",0,0]
["13.2.2.1","Mid-efficiency oil furnace",{"$f":"IF(build2_heat=\"heat pump\",\"NA\",IF(build2_need_heat,build2_zones,\"NA\"))","v":"NA"},{"$f":"IF(C332=\"NA\",\"\",\"zones\")","v":""},{"$f":"IF(C332=\"NA\",\"NA\",build2_heat_mbh)","v":"NA"},{"$f":"IF(C332=\"NA\",\"\",\"MBH\")","v":""},{"$f":"IF(C332=\"NA\",\"NA\",IF(curve=1,build2_heat_mbh,VLOOKUP(build2_heat_mbh,hvac_oil_mid_cost_cl,2)))","v":"NA"},{"$f":"IF(C332=\"NA\",\"\",\"MBH\")","v":""},{"$f":"IF(C332=\"NA\",\"NA\",IF(curve=1,hvac_oil_mid_eq_2,VLOOKUP(build2_heat_mbh,hvac_oil_mid_cost_cl,3)))","v":"NA"},{"$f":"IF(OR(I332=\"NA\",I332=\"contact vendor\"),\"--\",C332*I332)","v":"--"},{"$f":"IF(C332=\"NA\",\"NA\",VLOOKUP(build2_heat_mbh,hvac_oil_mid_cost_cl,IF(ss_cat=\"large\",4,5)))","v":"NA"},null,{"$f":"B307&\" - \"&B322&\" - \"&B327&\" - \"&B332","v":"Building Structures and HVAC - Building 2 - Heating System (included with cooling system) - Mid-efficiency oil furnace"},"","","","","","","","","",0,0]
["13.2.3",{"$f":"IF(build2_heat=\"heat pump\",\"Heating and \",\"\")&\"Cooling System\"","v":"Heating and Cooling System"},null,null,null,null,null,null,null,null,null,null,null,null,null,null,null,null,null,null,null,null,0,0]
["13.2.3.1","Air conditioner",{"$f":"IF(build2_need_cool,build2_zones,\"NA\")","v":1},{"$f":"IF(C334=\"NA\",\"\",\"zones\")","v":"zones"},{"$f":"IF(C334=\"NA\",\"NA\",build2_cooling_tons)","v":30.62040749909627},{"$f":"IF(C334=\"NA\",\"\",\"tons\")","v":"tons"},{"$f":"IF(C334=\"NA\",\"NA\",IF(curve=1,build2_cooling_tons,VLOOKUP(build2_cooling_tons,hvac_ac_cost_cl,2)))","v":30.62040749909627},{"$f":"IF(C334=\"NA\",\"\",\"tons\")","v":"tons"},{"$f":"IF(C334=\"NA\",\"NA\",IF(curve=1,hvac_ac_eq_2,VLOOKUP(build2_cooling_tons,hvac_ac_cost_cl,3)))","v":143394.16141026179},{"$f":"IF(OR(I334=\"NA\",I334=\"contact vendor\"),\"--\",C334*I334)","v":143394.16141026179},{"$f":"IF(C334=\"NA\",\"NA\",VLOOKUP(build2_cooling_tons,hvac_ac_cost_cl,IF(ss_cat=\"large\",4,5)))","v":25},0,{"$f":"B307&\" - \"&B322&\" - \"&B333&\" - \"&B334","v":"Building Structures and HVAC - Building 2 - Heating and Cooling System - Air conditioner"},{"$f":"IF(include_HVAC=0,0,IF(build2_cool=$B334,1,\"\"))","v":""},"","","","","","","","",0,0]
["13.2.3.1","Heat pump",{"$f":"IF(AND(hp_ok_2,build2_need_cool),build2_zones,\"NA\")","v":1},{"$f":"IF(C335=\"NA\",\"\",\"zones\")","v":"zones"},{"$f":"IF(C335=\"NA\",\"NA\",build2_cooling_tons)","v":30.62040749909627},{"$f":"IF(C335=\"NA\",\"\",\"tons\")","v":"tons"},{"$f":"IF(C335=\"NA\",\"NA\",IF(curve=1,build2_cooling_tons,VLOOKUP(build2_cooling_tons,hvac_hp_cost_cl,2)))","v":30.62040749909627},{"$f":"IF(C335=\"NA\",\"\",\"tons\")","v":"tons"},{"$f":"IF(C335=\"NA\",\"NA\",IF(curve=1,hvac_hp_eq_2,VLOOKUP(build2_cooling_tons,hvac_hp_cost_cl,3)))","v":43667.717290503613},{"$f":"IF(OR(I335=\"NA\",I335=\"contact vendor\"),\"--\",C335*I335)","v":43667.717290503613},{"$f":"IF(C335=\"NA\",\"NA\",VLOOKUP(build2_cooling_tons,hvac_hp_cost_cl,IF(ss_cat=\"large\",4,5)))","v":25},1,{"$f":"B307&\" - \"&B322&\" - \"&B333&\" - \"&B335","v":"Building Structures and HVAC - Building 2 - Heating and Cooling System - Heat pump"},1,1,1,1,1,1,1,1,1,1,1746.7086916201445]
[13.3,"Concrete Pad",1,"units",{"$f":"concrete","v":471},"cy",{"$f":"concrete","v":471},"cy",{"$f":"VLOOKUP(0,conc_pad_cost_cl,3)","v":647.97398379459571},{"$f":"IF(I336=\"contact vendor\",\"--\",E336*I336)","v":305195.74636725459},{"$f":"VLOOKUP(0,conc_pad_cost_cl,IF(ss_cat=\"large\",4,5))","v":40},1,{"$f":"B307&\" - \"&B336","v":"Building Structures and HVAC - Concrete Pad"},{"$f":"include_pad","v":1},1,1,1,1,1,1,1,1,1,7629.8936591813645]
[14,"Evaporation Ponds",null,null,null,null,null,null,null,null,null,null,null,null,null,null,null,null,null,null,null,null,0,0]
[14.1,"Excavation",{"$f":"ep_cells","v":0},"cells",{"$f":"IF(C338=0,\"NA\",ep_excavation_vol/ep_cells)","v":"NA"},{"$f":"IF(C338=0,\"\",\"cy\")","v":""},{"$f":"IF(C338=0,\"NA\",ep_excavation_vol/ep_cells)","v":"NA"},{"$f":"IF(C338=0,\"\",\"cy\")","v":""},{"$f":"IF(C338=0,\"NA\",VLOOKUP(0,excavate_cost_cl,3)*ep_excavation_vol/ep_cells)","v":"NA"},{"$f":"IF(C338=0,\"--\",IF(I338=\"contact vendor\",\"--\",C338*I338))","v":"--"},{"$f":"IF(C338=0,\"NA\",VLOOKUP(0,ep_liner_cost_cl,IF(ss_cat=\"large\",4,5)))","v":"NA"},null,{"$f":"$B$337&\" - \"&\" - \"&B338","v":"Evaporation Ponds -  - Excavation"},1,1,1,1,1,1,1,1,1,0,0]
[14.2,"Backfill",{"$f":"ep_cells","v":0},"cells",{"$f":"IF(C339=0,\"NA\",ep_backfill_vol/ep_cells)","v":"NA"},{"$f":"IF(C339=0,\"\",\"cy\")","v":""},{"$f":"IF(C339=0,\"NA\",ep_backfill_vol/ep_cells)","v":"NA"},{"$f":"IF(C339=0,\"\",\"cy\")","v":""},{"$f":"IF(C339=0,\"NA\",VLOOKUP(0,backfill_cost_cl,3)*ep_excavation_vol/ep_cells)","v":"NA"},{"$f":"IF(C339=0,\"--\",IF(I339=\"contact vendor\",\"--\",C339*I339))","v":"--"},{"$f":"IF(C339=0,\"NA\",VLOOKUP(0,ep_liner_cost_cl,IF(ss_cat=\"large\",4,5)))","v":"NA"},null,{"$f":"$B$337&\" - \"&\" - \"&B339","v":"Evaporation Ponds -  - Backfill"},1,1,1,1,1,1,1,1,1,0,0]
[14.3,"Liner",{"$f":"ep_cells","v":0},"cells",{"$f":"IF(C340=0,\"NA\",liner_area/ep_cells)","v":"NA"},{"$f":"IF(C340=0,\"\",\"sf\")","v":""},{"$f":"IF(C340=0,\"NA\",liner_area/ep_cells)","v":"NA"},{"$f":"IF(C340=0,\"\",\"sf\")","v":""},{"$f":"IF(C340=0,\"NA\",VLOOKUP(0,ep_liner_cost_cl,3)*liner_area/ep_cells)","v":"NA"},{"$f":"IF(C340=0,\"--\",IF(I340=\"contact vendor\",\"--\",C340*I340))","v":"--"},{"$f":"IF(C340=0,\"NA\",VLOOKUP(0,ep_liner_cost_cl,IF(ss_cat=\"large\",4,5)))","v":"NA"},null,{"$f":"$B$337&\" - \"&\" - \"&B340","v":"Evaporation Ponds -  - Liner"},1,1,1,1,1,1,1,1,1,0,0]
[14.4,"Dike Construction",{"$f":"ep_cells","v":0},"cells",{"$f":"IF(C341=0,\"NA\",dike_volume/ep_cells)","v":"NA"},{"$f":"IF(C341=0,\"\",\"cy\")","v":""},{"$f":"IF(C341=0,\"NA\",dike_volume/ep_cells)","v":"NA"},{"$f":"IF(C341=0,\"\",\"cy\")","v":""},{"$f":"IF(C341=0,\"NA\",ep_dike_construct_cl*dike_volume/ep_cells)","v":"NA"},{"$f":"IF(C341=0,\"--\",IF(I341=\"contact vendor\",\"--\",E341*I341))","v":"--"},{"$f":"IF(C341=0,\"NA\",VLOOKUP(0,ep_liner_cost_cl,IF(ss_cat=\"large\",4,5)))","v":"NA"},null,{"$f":"$B$337&\" - \"&\" - \"&B341","v":"Evaporation Ponds -  - Dike Construction"},1,1,1,1,1,1,1,1,1,0,0]
[15,"Solids drying pad",null,null,null,null,null,null,null,null,null,null,null,null,null,null,null,null,null,null,null,null,0,0]
[15.1,"Solids drying pad",{"$f":"IF(solids_pad_area=0,0,1)","v":0},"units",{"$f":"solids_pad_concrete","v":0},"cy",{"$f":"solids_pad_concrete","v":0},"cy",{"$f":"VLOOKUP(0,conc_pad_cost_cl,3)","v":647.97398379459571},{"$f":"IF(I343=\"contact vendor\",\"--\",E343*I343)","v":0},{"$f":"IF(C343=0,\"NA\",VLOOKUP(0,conc_pad_cost_cl,IF(ss_cat=\"large\",4,5)))","v":"NA"},null,{"$f":"B343","v":"Solids drying pad"},1,1,1,1,1,1,1,1,1,0,0]
[null,null,null,null,null,null,null,null,null,null,null,null,null,null,null,null,null,null,null,null,null,null,"direct_for_UL","total_direct_depreciation","build_UL"]
["Total of direct line items above:",null,null,null,null,null,null,null,null,null,null,null,null,null,null,null,null,null,null,null,null,null,{"$f":"SUMPRODUCT(W33:W343,J33:J343)","v":8862706.3654263932},{"$f":"SUM(X33:X343)","v":283791.73139971099},{"$f":"MAX(Y323:Y326,Y309:Y312)","v":40}]
[null,"Direct cost category","Total","Guidance"]
[null,"Process costs",{"$f":"SUMPRODUCT(J33:J306,L33:L306)+SUMPRODUCT(J338:J343,L338:L343)","v":12748971.494108092},"Excludes components in italics (which are alternate costs for comparison).  Includes installation, transportation, and O&P"]
[null,"Building costs",{"$f":"SUMPRODUCT(J309:J336,L309:L336)","v":2047307.8895112707},"See input sheet to exclude buildings/HVAC; indirect assumptions sheet to exclude concrete pad"]
[null,"Total direct capital cost",{"$f":"process_cost+building_cost","v":14796279.383619362},"Total of process and building costs"]
[]
["Add-on Cost Details (See indirect assumptions sheet to exclude individual add-on items)"]
[null,"Add-on Line Item","Total","Guidance"]
[null,"Permits",{"$f":"include_permits*permit_cost","v":47},"See indirect assumptions sheet to exclude individual add-on items"]
[null,"Pilot Study",{"$f":"include_pilot*VLOOKUP(tech_name,CHOOSE(ss_cat2,pilot_cost_small_cl,pilot_cost_medium_cl,pilot_cost_large_cl),2,FALSE)","v":69717.429975702486}]
[null,"Land Cost",{"$f":"include_land*land_required*land_cost","v":109995.08133126987},{"$f":"\"For \"&TEXT(land_required,\"#0.00\")&\" acres\"","v":"For 0.99 acres"}]
[null,"Total add-on costs",{"$f":"SUM(C353:C354,C355)","v":179759.51130697236}]
[]
["Indirect Capital Cost Details (See indirect assumptions sheet to exclude individual indirect items)"]
[null,"Indirect Line Item","Total","Percent","Guidance"]
[null,"Mobilization and Demobilization",{"$f":"(direct_cost+C362+C363+C364+C365+C366+C367+C368+C371)*D360","v":364663.28946634033},{"$f":"CHOOSE(ss_cat2,mob_pct_small,mob_pct_medium,mob_pct_large)","v":0.02},"Excluded for pre-engineered packages"]
[null,"Architectural Fees for Treatment Building",{"$f":"IF(ss_cat2=1,include_arch_small,include_arch)*building_cost*D361","v":126933.08914969878},{"$f":"VLOOKUP(building_cost,architectural_table_cl,3)","v":6.2E-2},"Excluded by default for small systems"]
[null,"Installation, Transportation, and O&P",{"$f":"building_cost*D362","v":0},{"$f":"inst_pct","v":0}]
[null,"Site Work",{"$f":"include_sitework*sitework_cost","v":335378.61538461538},null,"Calculated based on system requirements."]
[null,"Yard Piping",{"$f":"include_yardpipe*yard_cost","v":180527.6398484224},null,"Calculated based on system requirements."]
[null,"Geotechnical",{"$f":"IF(OR(res_holding=\"basins\",ep_cells<>0),1,IF(component_level=\"\",include_geo_low,IF(component_level=1,include_geo_medium,include_geo_high)))*geotech_cost","v":0},null,"Calculated based on system requirements."]
[null,"Standby Power",{"$f":"IF(ss_cat2=1,include_standby_small,include_standby)*std_power_cost","v":166453.74669187146},null,"Calculated based on system requirements.  Excluded by default for small systems."]
[null,"Electrical (including yard wiring)",{"$f":"process_cost*D367","v":1274897.1494108094},{"$f":"elect_pct","v":0.1},"Percentage is applied only to process cost. Building direct costs include electrical components."]
[null,"Instrumentation and Control",{"$f":"direct_cost*D368","v":0},{"$f":"i_c_pct","v":0}]
[null,"Contingency",{"$f":"IF(component_level=\"\",include_conting_low,IF(component_level=1,include_conting_medium,include_conting_high))*(direct_cost+addon_cost+SUM(C360:C368,C370:C375))*D369","v":0},{"$f":"IF(component_level=\"\",include_conting_low,IF(component_level=1,include_conting_medium,include_conting_high))*VLOOKUP(direct_cost,contingency_table_cl,3)*complexity","v":0},"Included for high cost systems only."]
[null,"Process Engineering",1183702.350689549,{"$f":"CHOOSE(ss_cat2,eng_pct_small,eng_pct_medium,eng_pct_large)","v":0.08}]
[null,"Miscellaneous Allowance",1479627.9383619362,{"$f":"misc_pct","v":0.1}]
[null,"Legal, Fiscal, and Administrative",295925.58767238725,{"$f":"legal_pct","v":0.02}]
[null,"Sales Tax",0,{"$f":"tax_pct","v":0}]
[null,"Financing during Construction",739813.96918096812,{"$f":"IF(ss_cat2=1,finance_pct_small,finance_pct)","v":0.05}]
[null,"Construction Management and GC Overhead",{"$f":"cm_cost","v":632315.96648184163}]
[null,"Total indirect capital cost",{"$f":"indirect_cost_mult*direct_cost+indirect_cost_add","v":6780239.3423384391}]
[]
["TOTAL CAPITAL COST DETAILS"]
[null,"Assumption","Value","Guidance"]
[null,"City Index",1,"User adjustable.  Can be used to adjust estimated costs to be more reflective of a specific geographical location"]
[]
[null,"Capital Cost Category","Total"]
[null,"Total Direct Capital Cost (from above)",{"$f":"direct_cost","v":14796279.383619362}]
[null,"Total Add-on Cost (from above)",{"$f":"addon_cost","v":179759.51130697236}]
[null,"Total Indirect Cost (from above)",{"$f":"C376","v":6780239.3423384391}]
[null,"Grand total capital cost (incorporating city index)",{"$f":"(direct_cost*(1+SUM(cul_indir_mult_table))+SUM(cul_indir_add_table))*C380","v":21756278.237264775}]
[]
["Annual Operating and Maintenance Cost Details (items in italics, without a 1 in the \"Use?\" column, represent alternate costs and are excluded from total)"]
[null,"Item","Quantity",null,"Unit Cost",null,"Total Cost ($/yr)","Use?","Guidance"]
[null,"Labor"]
[null,"Manager",{"$f":"Manager_LOE","v":251.77944730106498},"hrs/yr",{"$f":"VLOOKUP(design_flow,labor_table_cl,5)","v":71.848801722076047},"/hr",{"$f":"E391*C391","v":18090.051586828111},1]
[null,"Clerical",{"$f":"Clerical_LOE","v":251.77944730106498},"hrs/yr",{"$f":"VLOOKUP(design_flow,labor_table_cl,6)","v":39.356326237742159},"/hr",{"$f":"E392*C392","v":9909.1140679391228},1]
[null,"Operator",{"$f":"Operator_LOE","v":2517.7944730106497},"hrs/yr",{"$f":"VLOOKUP(design_flow,labor_table_cl,4)","v":43.842678784979661},"/hr",{"$f":"E393*C393","v":110386.85432680306},1,"Includes labor for regular operations, maintenance, regeneration, etc."]
[null,"Materials"]
[null,"Materials for booster pumps","calculated as a percentage of capital",null,null,null,{"$f":"pump_mtl","v":5770.2786575601294},{"$f":"IF(G395=0,0,1)","v":1}]
[null,"Materials for backwash/rinse pumps","calculated as a percentage of capital",null,null,null,{"$f":"back_pump_mtl","v":0},{"$f":"IF(G396=0,0,1)","v":0}]
[null,"Materials for residuals pumps","calculated as a percentage of capital",null,null,null,{"$f":"res_pump_mtl","v":0},{"$f":"IF(G397=0,0,1)","v":0}]
[null,"Materials for regenerant pumps","calculated as a percentage of capital",null,null,null,{"$f":"regen_pump_mtl","v":0},{"$f":"IF(G398=0,0,1)","v":0}]
[null,"Cartridge filter replacement",{"$f":"pre_filter_replacement","v":1296},"filters/yr",{"$f":"IF(C399=0,0,IF(curve=1,cart_replace_eq_ro,VLOOKUP(filter_size,cart_replace_cost_ro_cl,3))*(1-VLOOKUP(pre_filter_replacement,cart_filter_discount_table,2)))","v":206.94681307753075},"/sf/yr",{"$f":"IF(C399=0,\"--\",E399*C399)","v":268203.06974847987},{"$f":"IF(C399=0,0,1)","v":1}]
[null,"Building and HVAC maintenance (materials and labor)",{"$f":"total_fp","v":26170},"sf",{"$f":"G400/C400","v":5.9928623025451078},"/sf/yr",{"$f":"bldg_maint_cost","v":156833.20645760547},{"$f":"IF(C400=0,0,1)","v":1}]
[null,"Chemicals"]
[null,{"$f":"\"Sodium Chloride\"&salt_purchase","v":"Sodium Chloride - Small Qty"},{"$f":"salt_year","v":0},"lbs/yr",{"$f":"IF(C402=0,\"NA\",VLOOKUP(B402,chem_cost_cl,3,FALSE))","v":"NA"},"/lb",{"$f":"IF(C402=0,\"--\",E402*C402)","v":"--"},{"$f":"IF(C402=0,0,1)","v":0}]
[null,{"$f":"\"Hydrochloric Acid\"&HCl_purchase","v":"Hydrochloric Acid"},{"$f":"HCl_year","v":0},"lbs/yr",{"$f":"IF(C403=0,\"NA\",VLOOKUP(B403,chem_cost_cl,3,FALSE))","v":"NA"},"/lb",{"$f":"IF(C403=0,\"--\",E403*C403)","v":"--"},{"$f":"IF(C403=0,0,1)","v":0}]
[null,{"$f":"\"Ferric Chloride\"&FeCl3_purchase","v":"Ferric Chloride - Small Qty"},{"$f":"FeCl3_year+coag_yr","v":0},"lbs/yr",{"$f":"IF(C404=0,\"NA\",VLOOKUP(B404,chem_cost_cl,3,FALSE))","v":"NA"},"/lb",{"$f":"IF(C404=0,\"--\",E404*C404)","v":"--"},{"$f":"IF(C404=0,0,1)","v":0}]
[null,{"$f":"\"Sodium Hydroxide\"&NaOH_purchase","v":"Sodium Hydroxide - Small Qty"},{"$f":"NaOH_year","v":0},"lbs/yr",{"$f":"IF(C405=0,\"NA\",VLOOKUP(B405,chem_cost_cl,3,FALSE))","v":"NA"},"/lb",{"$f":"IF(C405=0,\"--\",E405*C405)","v":"--"},{"$f":"IF(C405=0,0,1)","v":0}]
[null,{"$f":"\"Polymers\"&polymer_purchase","v":"Polymers - Small Qty"},{"$f":"polymer_yr","v":0},"lbs/yr",{"$f":"IF(C406=0,\"NA\",VLOOKUP(B406,chem_cost_cl,3,FALSE))","v":"NA"},"/lb",{"$f":"IF(C406=0,\"--\",E406*C406)","v":"--"},{"$f":"IF(C406=0,0,1)","v":0}]
[null,"Resin loss replacement"]
[null,{"$f":"VLOOKUP(\"resin_name\",resin_table,resin_type+1,FALSE)","v":"Perchlorate-selective"},{"$f":"resin_loss_vol_annual","v":0},"cf/yr",{"$f":"IF(resin_type=5,VLOOKUP(\"resin_unit_cost\",resin_table,resin_type+1,FALSE),VLOOKUP(B408,an_ClO4_cost_cl,3,FALSE))","v":242.38451871703288},"/cf",{"$f":"E408*C408","v":0},{"$f":"IF(C408=0,0,1)","v":0},{"$f":"IF(C408>0,\"\",\"Not relevant for throwaway systems without frequent backwash\")","v":"Not relevant for throwaway systems without frequent backwash"}]
[null,"Complete bed replacement (annual average)"]
[null,{"$f":"VLOOKUP(\"resin_name\",resin_table,resin_type+1,FALSE)","v":"Perchlorate-selective"},{"$f":"resin_yr","v":7326.5454545454531},"cf/yr",{"$f":"IF(resin_type=5,VLOOKUP(\"resin_unit_cost\",resin_table,resin_type+1,FALSE),VLOOKUP(B410,an_ClO4_cost_cl,3,FALSE))","v":242.38451871703288},"/cf",{"$f":"E410*C410","v":1775841.1938584645},1]
[null,"Energy"]
[null,"Energy for booster pumps",{"$f":"pump_energy","v":3308.0111680959812},"Mwh/yr",{"$f":"energy_cost_cl","v":0.12121832061068702},"/kwh",{"$f":"E412*C412*1000","v":400991.55835799198},{"$f":"IF(C412=0,0,1)","v":1}]
[null,"Energy for backwash/rinse pumps",{"$f":"back_pump_energy","v":3.6005748871994904E-2},"Mwh/yr",{"$f":"energy_cost_cl","v":0.12121832061068702},"/kwh",{"$f":"E413*C413*1000","v":4.3645564105933605},{"$f":"IF(C413=0,0,1)","v":1}]
[null,"Energy for residuals pumps",{"$f":"res_pump_energy","v":0},"Mwh/yr",{"$f":"IF(C414=0,\"NA\",energy_cost_cl)","v":"NA"},{"$f":"IF(C414=0,\"\",\"/kwh\")","v":""},{"$f":"IF(C414=0,\"--\",E414*C414*1000)","v":"--"},{"$f":"IF(C414=0,0,1)","v":0}]
[null,"Energy for lighting",{"$f":"lighting","v":65.890681358688695},"Mwh/yr",{"$f":"energy_cost_cl","v":0.12121832061068702},"/kwh",{"$f":"E415*C415*1000","v":7987.1577381941452},1]
[null,"Energy for ventilation",{"$f":"ventilation","v":36.045200872727271},"Mwh/yr",{"$f":"energy_cost_cl","v":0.12121832061068702},"/kwh",{"$f":"E416*C416*1000","v":4369.3387158668693},1]
[null,"Energy for cooling"]
[null,"Air conditioning",{"$f":"cooling","v":89.093382381174834},"Mwh/yr",{"$f":"energy_cost_cl","v":0.12121832061068702},"/kwh",{"$f":"E418*C418*1000","v":10799.750189771785},{"$f":"IF(G418=0,0,1)","v":1}]
[null,"Heat pump (cooling mode)",{"$f":"cooling_hp","v":376.85216578019077},"Mwh/yr",{"$f":"energy_cost_cl","v":0.12121832061068702},"/kwh",{"$f":"E419*C419*1000","v":45681.386654374939},{"$f":"IF(G419=0,0,1)","v":1}]
[null,"Energy for heating"]
[null,"Electric resistance",{"$f":"heating","v":0},"Mwh/yr",{"$f":"energy_cost_cl","v":0.12121832061068702},"/kwh",{"$f":"E421*C421*1000","v":0},{"$f":"IF(G421=0,0,1)","v":0}]
[null,"Heat pump",{"$f":"heating_hp","v":97.891658762288785},"Mwh/yr",{"$f":"energy_cost_cl","v":0.12121832061068702},"/kwh",{"$f":"E422*C422*1000","v":11866.262476959091},1]
[null,"Natural gas non-condensing furnace",{"$f":"heating_gas_non","v":0},"therms/yr",{"$f":"gas_cost_cl","v":0.79405665355998734},"/therm",{"$f":"E423*C423","v":0},0]
[null,"Natural gas condensing furnace",{"$f":"heating_gas","v":33408.756986184664},"therms/yr",{"$f":"gas_cost_cl","v":0.79405665355998734},"/therm",{"$f":"E424*C424","v":26528.445772048643},1]
[null,"Standard efficiency oil furnace",{"$f":"heating_diesel_non","v":0},"gal/yr",{"$f":"diesel_cost_cl","v":2.3528514873883046},"/gal",{"$f":"E425*C425","v":0},0]
[null,"Mid-efficiency oil furnace",{"$f":"heating_diesel","v":0},"gal/yr",{"$f":"diesel_cost_cl","v":2.3528514873883046},"/gal",{"$f":"E426*C426","v":0},0]
[null,"Residuals"]
[null,{"$f":"IF(res_s2_opt=4,\"Hazardous brine disposal\",\"POTW discharge fees\")","v":"POTW discharge fees"},{"$f":"IF(OR(res_s2_opt=2,res_s2_opt=4),res_flow_annual,0)","v":253611.18881118877},"gal/yr",{"$f":"IF(OR(res_s2_opt=2,res_s2_opt=4),G428/C428,\"NA\")","v":0.16740192909996646},"/gal",{"$f":"IF(C428=0,0,IF(res_s2_opt=2,POTW_fee,IF(res_s2_opt=4,lhaz_fee,\"--\")))","v":42455.002248328827},{"$f":"IF(C428=0,0,IF(OR(res_s2_opt=2,res_s2_opt=4),1,0))","v":1}]
[null,"Spent resin disposal",{"$f":"spent_media_yr","v":157.52072727272724},"ton/yr",{"$f":"G429/C429","v":697.67441860465112},"/ton",{"$f":"disposal_fee","v":109898.18181818179},{"$f":"IF(C429=0,0,1)","v":1}]
[null,{"$f":"IF(res_s2_opt=3,\"Evaporation pond solids disposal\",IF(res_holding<>\"none\",\"Holding \"&res_holding&\" solids disposal\",\"\"))","v":""},{"$f":"IF(B430=\"\",\"\",res_solids*sol_disp_freq)","v":""},{"$f":"IF(B430=\"\",\"\",\"ton/yr\")","v":""},{"$f":"IF(B430=\"\",\"\",IF(C430=0,\"NA\",G430/C430))","v":""},{"$f":"IF(B430=\"\",\"\",\"/ton\")","v":""},{"$f":"IF(B430=\"\",\"\",sol_disposal_fee)","v":""},{"$f":"IF(B430=\"\",\"\",IF(C430=0,0,1))","v":""},{"$f":"IF(AND(res_solids<>0,solids_haz=1,solids_method=2),\"Land application assumed to be zero cost, but labor cost for handling is still included in operator hours\",\"\")","v":""}]
[null,"Spent cartridge filter disposal",{"$f":"cart_disp_wt*cart_disp_freq","v":15.552},{"$f":"IF(B431=\"\",\"\",\"ton/yr\")","v":"ton/yr"},{"$f":"IF(C431=0,0,G431/C431)","v":74.91523842510081},{"$f":"IF(B431=\"\",\"\",\"/ton\")","v":"/ton"},{"$f":"IF(C431=0,\"--\",cart_disposal_fee)","v":1165.0817879871677},{"$f":"IF(B431=\"\",\"\",IF(C431=0,0,1))","v":1}]
[null,"Miscellaneous Allowance",{"$f":"misc_pct","v":0.1},null,null,null,{"$f":"SUMPRODUCT(G391:G431,H391:H431)*C432","v":300678.02990197967},1]
[null,"Total Annual O&M Cost",null,null,null,null,{"$f":"SUMPRODUCT(G391:G432,H391:H432)","v":3307458.3289217763}]
[]
["ANNUALIZED COSTS"]
[null,"Assumption","Value","Guidance"]
[null,"Discount rate",7.0000000000000007E-2,"User adjustable"]
[null,"Calculate households based on:","ground water","User adjustable"]
[null,"Household size (people per household)",2.6,"User adjustable"]
[]
[null,"Calculation","Value","Units"]
[null,"Useful Life (Reciprocal Weighted Average)",{"$f":"ROUND((direct_for_UL+IF(build_UL=0,0,addon_cost+indirect_cost))/(total_direct_depreciation+IF(build_UL=0,0,(addon_cost+indirect_cost)/build_UL)),1)","v":34.6},"years"]
[null,"Number of households served",{"$f":"IF(source_select=\"ground water\",(average_flow*1000/0.08558)^(1/1.0584),(average_flow*1000/0.14004)^(1/0.99703))/hh_size","v":82373.214414475762},"households"]
[null,"Annualized Capital Cost",{"$f":"-PMT(Discount_rate,useful_life,system_cost)","v":1685100.7574088592},"/year"]
[null,"Annual O&M Cost",{"$f":"OM_cost","v":3307458.3289217763},"/year"]
[null,"Total Annualized Cost",{"$f":"Annualized_Capital_Cost+OM_cost","v":4992559.0863306355},"/year"]
[null,"Annualized cost per 1,000 gallons average flow",{"$f":"Annualized_Cost/(average_flow*365*1000)","v":0.36440334804291147},"/kgal"]
[null,"Annualized cost per household",{"$f":"Annualized_Cost/households","v":60.609011337225098},"/household/year"]
[]
[]
["Internal use"]
[null,"Mobilization and Demobilization",{"$f":"C360","v":364663.28946634033}]
[null,"Architectural Fees for Treatment Building",{"$f":"C361","v":126933.08914969878}]
[null,"Installation, Transportation, and O&P",{"$f":"D362","v":0}]
[null,"Site Work",{"$f":"C363","v":335378.61538461538}]
[null,"Yard Piping",{"$f":"C364","v":180527.6398484224}]
[null,"Geotechnical",{"$f":"C365","v":0}]
[null,"Standby Power",{"$f":"C366","v":166453.74669187146}]
[null,"Electrical (including yard wiring)",{"$f":"C367","v":1274897.1494108094}]
[null,"Instrumentation and Control",{"$f":"D368","v":0}]
[null,"Contingency",{"$f":"D369","v":0}]
[null,"Process Engineering",{"$f":"C370","v":1183702.350689549}]
[null,"Miscellaneous Allowance",{"$f":"D371","v":0.1}]
[null,"Legal, Fiscal, and Administrative",{"$f":"D372","v":0.02}]
[null,"Sales Tax",{"$f":"D373","v":0}]
[null,"Financing during Construction",{"$f":"D374","v":0.05}]
[null,"Construction Management",{"$f":"C375","v":632315.96648184163}]
[null,"Indirect cost multiplier",{"$f":"SUM(cul_indir_mult_table)","v":0.17}]
[null,"Indirect costs added",{"$f":"SUM(cul_indir_add_table)-addon_cost","v":4264871.8471231479}]
[null,"Subtotal indirect and add-on cost"]
[]
[null,"Validity Checks",{"$f":"INPUT!B32","v":true},{"$f":"INPUT!B36","v":true},{"$f":"INPUT!B50","v":true},{"$f":"INPUT!B51","v":true},{"$f":"INPUT!B52","v":true},{"$f":"INPUT!B53","v":true},{"$f":"INPUT!B55","v":true},{"$f":"INPUT!B63","v":true},{"$f":"INPUT!B81","v":true}]
[null,"Missing Cost?:",{"$f":"IF(COUNTIF(use_column,\"x\")>0,TRUE,FALSE)","v":false}]
[null,"Buildup error?",{"$f":"IF(COUNTIF(use_column,\"ec\")+COUNTIF(use_column,\"ep\")>0,TRUE,FALSE)","v":false}]

{"sheet":"Critical Design Assumptions","index":4,"n_rows":314,"n_cols":8,"rows_kept":314,"cut":false,"hidden":false,"merged":[]}
["Default Critical Design Assumptions"]
["Users may change any of the cells in the Value column; cells in gold are most important and may vary based on contaminant treated and site-specific conditions"]
[]
["Assumption","Range Name","Value","Units","Guidance"]
["Cost estimating method","curve",1,"<-- enter 1 to use cost equations, leave blank to use lookup tables for component costs","Keeping this assumption with a value of 1 is strongly recommended; the cost equations method is more appropriate for national cost estimating and will be more accurate for nearly all user-specified designs"]
["Minimum average flow as percentage of design","min_avg_flow",0.1,null,"The minimum ratio of average flow to design flow. If the ratio falls below this value, it will trigger a warning on the INPUT sheet. If this value is zero, no minimum is enforced."]
[]
["Vessel Design"]
["Number of redundant vessels for small systems with only one vessel","NRD_small_1",1,"units","If a design includes only one operating vessel, there should be at least one additional vessel"]
["Number of redundant vessels for small systems with multiple vessels","NRD_small",0,"units","Small systems can operate at reduced capacity while one vessel is down for backwash, if there are multiple vessels"]
["Add a redundant unit per x parallel lines","redund_freq",4,"number of parallel lines/redundant unit"]
["Bypass percentage","bp_pct",0,null,"Typically bypass flow ranges between 0 % and 50 % of inflow. Enter zero to remove bypass piping and components. 0% is default consistent with the type of cost curves that EPA will need for its national cost simulation model."]
["Loading rate minimum","load_min",1,"gpm/square ft"]
["Maximum vessel height (circular vessels)","max_height",14,"feet","Systems have used vessels up to 14' diam and height in practice (AWWA Inorganic Contaminants Workshop 2006)"]
["Maximum vessel diameter","max_diam_override",null,"feet","Maximum vessel diameter will be chosen from a table of conventional sizes for commercial vessels, unless entered here.  Systems have used vessels up to 14' diam and height in practice (AWWA Inorganic Contaminants Workshop 2006)"]
["Maximum vessel length (longitudinal vessels)","max_length",53,"feet","Limitation on transportation is 53 feet in length"]
["Free board above media at full expansion","free_board",0.5,"feet"]
["Underdrain space for horizontal vessels","horiz_underdrain",1.5,"feet","1.5 feet is a conservative value for a 10' tank. Bob Dvorin, 5/16/05."]
["Vessel thickness of wall","Vessel_thickness",0,"feet","Set to zero because vendor designs and quotes are usually expressed in inside diameter.  Increase if user desires to input outside diameter."]
["Ratio of  length to diameter for horizontal vessels","length_diam_ratio",2.5,null,"Used only for autosize procedure"]
["Resin expansion during backwash","bed_expansion",0.5,null,"Boodoo peer review comments"]
["Resin density","media_density",43,"lbs/ft3","Generally varies between 41 to 46  lbs/ft3 with an average of 43 /bs/ft3 (Based on peer review)"]
["Minimum bed depth for autosize","min_bed_depth",2.4,"feet","Guidance: practical bed depths range from 30 inches to 6 ft."]
["Maximum bed depth for autosize","max_bed_depth",6,"feet"]
["Volume Tolerance, vertical vessels <1 mgd","vol_tol_vert_small",0.5,null,"Used to check size compatibility of sepecified volume with required volume"]
["Volume Tolerance, vertical vessels >1 mgd","vol_tol_vert_med",0.4]
["Volume Tolerance, horizontal vessels","vol_tol_horiz",0.4]
[]
["Pumping"]
["Safety factor for pumps","pump_safety_factor",0.25]
["Safety factor for tetrachloroferrate mixing equipment","FeCl4_safety_factor",0.5,null,"To guarantee preparation of regenerant can be completed in the interval between regenerations"]
["Redundant booster pumps","NRD_pumps",0,"pumps","Multiple pump approach eliminates need for redundant pumps."]
["Redundant backwash pumps","NRD_back_pumps",1,"pump"]
["Redundant regenerant pumps","NRD_regen_pumps",1,"pump"]
["Redundant pumps for regenerant mixing (FeCl4 only)","NRD_mix_pumps",1,"pump"]
["Redundant pumps for acid rinse (FeCl4 only)","NRD_rinse_pumps",1,"pump"]
["Number of redundant polymer metering pumps","NRD_cm_pump",1,"pumps"]
["Redundant pumps for pH adjustment","NRD_pH_pumps",1,"pump"]
["Minimum chemical feed pump size","min_chem_flow",0.13,"gph","Metering pumps will be designed to meet this minimum"]
[]
["Backwash and Regeneration"]
["Backwash loading rate","h2oflush_backwash_rate",3,"gpm/square ft","1-5 gpm/square ft"]
["Backwash time","backwash_time",12,"minutes","10 to 15 minutes"]
["Backwash frequency outside of regeneration/initial rinse","add_backwash_freq",null,"days","Leave blank to assume backwash occurs only at regneration/resin replacement (initial rinse), enter a value to incorporate additional, out-of-cycle backwashes"]
["Water rinse loading rate","rinse_rate",3,"gpm/square ft","Assumes same as backwash rate"]
["Regenerant reuse","regen_reuse",0,"times","With brine storage/mixing tanks, brine may be reused up to 25 times.  Cannot reuse brine with salt saturator as the delivery method -- additional tanks would be required.  No data available on reuse of tetrachloroferrate regenerant."]
["Resin life","resin_life",7,"years","Even when regenerated, media eventually will reach permanent exhaustion."]
["Saturated brine concentration","brine_conc_sat",3.1,"lb/gal"]
["Salt density","salt_density",72,"lbs/ft3","For calculating storage footprint"]
["Hydrochloric acid weight percent as delivered","HCl_pct",0.36]
["Hydrochloric acid molecular weight","HCl_mw",36.5,"g/mol"]
["Ferric chloride molecular weight","FeCl3_mw",162.21,"g/mol"]
["Ferric chloride bulk density","FeCl3_dens",43,"lbs/ft3"]
["Chemical storage height","storage_height",10,"ft"]
["Days of chemical storage","cstore_days",30,"days","Applies to regenerant storage and caustic for pH adjustment"]
["Include mixers for chemical tanks","include_cmix",0,"<--- enter 1 for yes, 0 for no"]
["Chemical tank mixer horsepower","cmix_hp_per",0.25,"hp per 1,000 gal"]
["Minimum chemical tank mixer horsepower","min_cmix_hp",{"$f":"1/3","v":0.33333333333333331},"hp"]
["Mixer size for regenerant tanks","mixer_size",1,"hp"]
["Smallest size of salt saturator","min_saltbox",5,"tons","The smallest size for which costs are available.  Used to determine whether a system will store 1 month, 1 week, or 1 day of salt in the saturators."]
["Annual resin loss","resin_loss_annual",4.4999999999999998E-2,"percent/year","Assume 4 to 5%"]
[]
["pH Adjustment"]
["Treated water pH","pHo",7,"SU","Removal of carbonates can lower pH and result in red water problems in older homes with galvanized steel pipes"]
["Desired treated water pH","pHf",8.1999999999999993,"SU"]
["Desired treated water alkalinity as CaCO3","alk_I",25,"ppm"]
["Influent water total dissolved solids","TDS_I",200,"mg/L"]
["Influent water temperature","t_I",10,"degrees centigrade"]
["Sodium hydroxide weight percent as delivered","NaOH_pct",0.5]
["Include a separate day tank if daily volume is x or greater","day_tank_needed",5,"gal"]
[]
["Secondary Containment Requirements"]
["Include secondary containment","include_sec_cont",1,"<--- enter 1 for yes, 0 for no"]
["Volume required as a percentage of the largest tank","sec_cont_pct_of_largest",1.1000000000000001]
["Volume required as a percentage of total storage","sec_cont_pct_of_total",0.1]
["Additional freeboard","sec_cont_freeboard",6,"inches","Additional freeboard is typically required to contain precipitation when storage is outside; we also include freeboard indoors to ensure a minimum reasonable curb height"]
["Maximum curb thickness","sec_cont_max_thick",1,"foot","Calculations assume thickness equal to height, up to this maximum"]
["Chemical resistant coating coverage","sec_cont_coating_cvg",125,"square feet/gallon"]
[]
["Cartridge Filters for Pretreatment"]
["Include cartridge filters","include_cart",1,"<-- enter 1 for yes, 0 for no"]
["Minimum number of cartridge filters above 1 MGD","min_cart",2,"units","For small systems (<1 MGD), this limit is ignored."]
[]
["Number of redundant cartridge filters","init_NRD_cart",1]
["Additional redundant cartridge filter per x MGD inflow","addl_redund_cart_per_flow",50,"MGD"]
["Access space for cartridge filters","space_other_equip",3,"feet","Provide a minimum of 3 ft (1 m) of clear space around each item of equipment (American Water Works Association and American Society of Civil Engineers. Water Treatment Plant Design. Third Edition. New York: McGraw Hill, 1998. Pp. 695)."]
[]
["Valves and Instrumentation"]
["Number of manual valves on influent and effluent line","tot_man_valves",2,"valves"]
["Number of manual valves on process line per vessel","proc_man_vessel",1,"valve/vessel","For filter to waste"]
[]
["Number of check valves on backwash line per backwash pump","back_chv_pump",1,"valves/pump"]
["Number of check valves on regenerant line per regenerant pump","brine_chv_pump",1,"valves/pump","Applies only with tetrachlorferrate regeneration"]
["Number of check valves on acid line per metering pump","acid_chv_pump",1,"valves/pump","Applies only with tetrachlorferrate regeneration"]
["Number of check valves on caustic line per metering pump","caustic_chv_pump",1,"valves/pump","Applies only with pH adjustment"]
["Number of check valves on polymer line per metering pump","polymer_chv_pump",1,"valves/pump","Applies only with polymer addition to residuals"]
["Number of check valves on influent line","tot_in_chv",2,"valves","At both inlet and outlet in this technology"]
["Number of check valves on bypass line","tot_bp_chv",1,"valves"]
["     For small systems","tot_bp_chv_small",0,"valves"]
[]
["Flow meters for influent and effluent line","tot_fm_in",1,"units","Flow meter assemblies include pressure gauges"]
["Flow meters for process line per vessel","fm_proc",0,"units/vessel"]
["Flow meters for backwash line","fm_back",1,"units","At backwash discharge outlet"]
["Level switch/alarms per vessel","level_switch",0,"units/vessel"]
["     For small systems","level_switch_small",0,"units/vessel"]
["High/Low alarms per backwash tank","alarm_back",1,"units/tank"]
["High/Low alarms per regenerant mixing tank","alarm_brine",1,"units/tank","Salt saturators come equipped with level alarms, so only added if mixing tanks are used."]
["High/Low alarms per HCl tank","alarm_acid",1,"units/tank"]
["High/Low alarms per NaOH tank","alarm_caustic",1,"units/tank"]
["ORP sensors","ORP_sensor",0,"units"]
["pH meters for systems without corrosion control","pH_nocorr",0,"units"]
["pH meters for systems with corrosion control","pH_corr",2,"units"]
["Temperature meters","temp_meters",1,"units","One for influent line, one for effluent line"]
["     For small systems","temp_meters_small",0,"units"]
["Turbidity meters per vessel","turb_tank",0,"units/vessel"]
["     For small systems","turb_tank_small",0,"units/vessel"]
["Additional turbididy meters","add_turb",1,"units","One at backwash discharge outlet"]
["     For small systems","add_turb_small",0,"units"]
["Conductivity meters per vessel","cond_tank",0,"units/vessel"]
["Additional conductivity meters","add_cond",0,"units"]
["Head loss sensors per vessel","head_tank",1,"units/vessel"]
["     For small systems","head_tank_small",0,"units/vessel"]
["Head loss sensors per cartridge filter","headloss_cart",1,"units/filter"]
["Sampling ports per vessel","ports_tank",1,"units/vessel"]
["Sampling ports for bypass line","ports_bp",1,"units"]
["Additional sampling ports","add_ports",3,"units","One for influent line, one for effluent line, one on residual side of backwash line"]
["Number of electrical enclosures","elec_encl",0,"units","Required only for technologies with significant electric-powered equipment outside a building."]
[]
["System Controls"]
["Controllers are used only under full automation"]
["To change the degree of automation, change the number of controllers to zero for the appropriate items."]
["Drive controllers per booster pump","S_booster_pump",1,"units"]
["Drive controllers per backwash pump","S_back_pump",1,"units"]
["Drive controllers per eductor","S_eductor",1,"units"]
["Drive controllers per regenerant mixer","S_mixer",1,"units"]
["Drive controllers per regenerant pump","S_regen_pump",1,"units"]
["Drive controllers per metering pump","S_cm_pump",1,"units"]
["Drive controllers per chemical feeder","S_chem_feed",1,"units"]
[]
["Number of CPUs","plc_cpu",2,"units","One CPU is needed to run the local and expansion bases and modules (max 8192 I/O); using two to provide redundancy"]
["Ethernet modules","plc_ethernet ",2,"units","One ethernet module is needed; using two to provide redundancy"]
["Operator interfaces","plc_interface",2,"units","Two to provide redundancy in the event of SCADA node failure"]
["UPSs","ups",1,"unit","UPS protects the PLC system from undesired outages and surges that can adversely affect the performance of the PLC unit"]
["Computer workstations per x operators","workstation_ratio",1,"operator/workstation","Minimum will always be one, but larger systems will have multiple workstations to control the system"]
["Number of shifts","shifts_day",3,"shifts/day","Used to determine number of workstations"]
["Printers per x computer workstations","printer_ratio",4,"workstations/printer","Minimum will always be one, but larger systems will have multiple printers"]
[]
["Structure/Floorplan"]
["Maximum access space per vessel or tank for custom designed systems","max_space_vessels_cust",6,"feet","This is the MAXIMUM; space between vessels and tanks defaults to vessel or tank diameter, up to this maximum.  Maximum provides space for sandblasting and painting for large vessels (5-8 feet per Richard E. Hubel, Peter Keenan, American Water Works Service Company)."]
["Maximum access space per vessel or tank for pre-engineered systems","max_space_vessels_pre",1,"feet","Assumes skid-mounting with minimal access space"]
["Access space per pump for custom designed systems","space_pumps_cust",4,"feet","Provide a minimum of 3 ft (1 m) of clear space around each item of equipment (American Water Works Association and American Society of Civil Engineers. Water Treatment Plant Design. Third Edition. New York: McGraw Hill, 1998. Pp. 695)."]
["Access space per pump for pre-engineered packages","space_pumps_pre",0,"feet","Pumps on skid for pre-engineered packages, no additional access space"]
[]
["Non fire Buffer for buildings","non_fire_buffer",10,"feet"]
["Fire Buffer for Buildings","fire_buffer",40,"feet"]
["Top and bottom dished vessel sections height and access space ","Top_bottom_Vessel_space",6,"feet","This is used to determine the building height for purposes of heating and cooling cost.  "]
["Office space per employee","space_office",100,"square ft"]
["Office space per employee","space_office_small",0,"square ft","Small systems do not require office space"]
["Concrete pad thickness","pad_thick",{"$f":"6/12","v":0.5},"feet"]
["Concrete pad thickness for small systems","pad_thick_small",{"$f":"4/12","v":0.33333333333333331},"feet"]
["Clearance space beneath the ceiling","ceiling_clearance",3,"feet","Minimum space between the tops of storage tanks and the ceiling"]
["Additional building after…","add_2nd_building",10000,"sf"]
[]
["Residuals Discharge"]
["Add coagulant to holding tank?","coag_res",0,"<-- 1 for yes, 0 for no","For additional TSS removal, if desired"]
["Type of coagulant added","coag_type",1,"<-- 1 for polymer, 2 for ferric chloride, 3 for both polymer & ferric chloride"]
["Minimum settling time when coagulant is used","res_coag_settle_time",90,"minutes","When coagulant is used, holding tanks will be sized so that residuals are present for at least this long. Based on 90-120 minute settling time in sedimentation basins (Water Treatment Plant Design, 4th ed.)"]
["Polymer dosage","polymer_dose",100,"mg/L"]
["Polymer solution density","polymer_density",9.6,"lb/gal"]
["Polymer sludge production factor","polymer_spf",1,"lbs accumulated per pound added"]
["Ferric chloride dosage","coag_dose",10,"mg/L"]
["Ferric chloride bulk density","coag_density",43,"lb/ft3","For chemical storage area calculations"]
["Ferric chloride sludge production factor","coag_spf",0.99,"lbs accumulated per pound added"]
["Holding tank/basin solids density","ht_solids_density",25,"lb/ft3"]
["Holding tank/basin suspended solids removal efficiency without coagulant","htank_TSSrem",0,null,"Cartridge filtration should result in low solids accumulation on resin, thus no settling without coagulant addition"]
["Holding tank/basin suspended solids removal efficiency with coagulant","coag_TSSrem",0.5]
["Clean holding tanks/basins when solids accumulation =x% of capacity","htank_clean_pct",0.1]
["Holding tank/basin capacity factor","res_cap_factor",2,null,"Holding tanks are designed with a capacity of one generation event, multiplied by this safety factor. This multiplier accounts for less than perfect staggering of generation events and provides for solids accumulation (i.e., it provides excess capacity)."]
["Default number of residuals basins","hbasins_default",1,null,"This assumption applies if concrete basins are used. Additonal basins are used, however, if needed to achieve minimum holding time. If tanks are used, number calculated on design sheet."]
["Holding basin depth to volume ratio","holding_ratio",{"$f":"3/5","v":0.6},null,"This assumption used only if concrete basins are used."]
["Holding basin freeboard","holding_freeboard",3,"feet","This assumption used only if concrete basins are used."]
["Overexcavation for storage basins","overexcavate",4,"ft","2 feet each side in each dimension.  This assumption used only if concrete basins are used."]
["Concrete thickness for holding basins","conc_thick",1,"ft","This assumption used only if concrete basins are used."]
["Holding tank mixer horsepower (if coagulant is used)","hmix_hp_per",0.25,"hp per 1,000 gallons"]
["Minimum holding tank mixer horsepower","min_hmix_hp",{"$f":"1/3","v":0.33333333333333331},"hp"]
["Residual solids transfer method","res_transfer_method",3,"<-- 1 for slurry pumps, 2 for eductors, 3 for manual trabsfer"]
["Time to empty holding tank","transfer_time",4,"hrs","Target for systems using mechanical transfer.  For systems with manual transfer, calcuated based on solids volume."]
["Minimum residuals pipe diameter","min_res_pipe_size",1,"in. diam."]
["Residual solids storage height (for drying pad)","solids_storage_height",2,"ft"]
["Redundant residuals pumps","NRD_res_pump",1,"units","Applies only if pumping is included"]
["Distance to discharge point or evaporation pond","add_res_pipe_length",40,"ft"]
["Number of check valves on residuals line per residuals pump","res_chv_pump",1,"valves/pump"]
["Number of check valves on residuals line if no pumping","res_chv_no_pump",1,"valves"]
["Drive controllers per residuals pump","S_res_pump",1]
["Drive controllers per coagulant feeder","S_feeder",1]
["Flow meters for residuals line","tot_fm_res",1,"units"]
["High/Low alarms per holding tank","alarm_res",1,"units/tank"]
["TSS in system influent","influent_TSS",2,"ppm","This is INFLUENT TSS.  Backwash TSS is calculated and will be higher, as TSS removed are concentrated."]
["TSS in treated water","effluent_TSS",0.5,"ppm"]
["POTW rate structure","POTW_rate_type",1,"<-- 1 for national average rate, 2 for a specific rate structure"]
["Apply POTW discharge base charge (i.e., $/month)","POTW_base_fee",1,"<-- 1 for yes, 2 for no"]
["Apply POTW discharge volume charge (i.e., $/1000 gallons)","POTW_volume_fee",1,"<-- 1 for yes, 2 for no"]
["Apply POTW discharge TSS charge (i.e., $/lb of TSS over limit below)","POTW_TSS_fee",1,"<-- 1 for yes, 2 for no"]
["POTW TSS discharge limit (over which fee would be imposed)","POTW_TSS_limit",250,"ppm","Most common limit for cities with a limit."]
["Disposal method for non-hazardous secondary solids","solids_method",1,"<-- 1 for landfill, 2 for land application","Ignored if solids are hazardous or radioactive"]
["Maximum hazardous waste shipment size","max_haz_ship",18,"tons"]
["Maximum liquid hazardous waste shipment size","max_lhaz_ship",6000,"gal"]
["Maximum radioactive (non-hazardous) waste shipment size","max_rad_ship",18,"tons"]
["Maximum radioactive hazardous waste shipment size","max_hazrad_ship",18,"tons"]
["Miles to non-hazardous solid waste disposal site","non_haz_miles",10,"miles"]
["Miles to hazardous solid waste disposal site","haz_miles",200,"miles"]
["Miles to radioactive (non-hazardous) waste disposal site","rad_miles",700,"miles"]
["Miles to radioactive hazardous waste disposal site","hazrad_miles",700,"miles"]
[]
["Average annual pan evaporation rate","pan_evap",180,"cm/year","Reflects an arid climate.  If evaporation ponds are used, climate assumptions on O&M assumptions page should also be changed to reflect an arid climate."]
["Evaporation ratio","evap_ratio",0.7,null,"A safety factor to account for conversion of pan to lake evaporation rate and effect of salinity"]
["Average annual precipitation","precip",70,"cm/year","Reflects an arid climate.  If evaporation ponds are used, climate assumptions on O&M assumptions page should also be changed to reflect an arid climate."]
["Days of winter (i.e., days of storage during periods with no net evaporation)","winter_days",180,"days","Accounts for wet periods in which residuals are stored without evaporation"]
["Evaporation pond safety factor","ep_safety_factor",1.1000000000000001,null,"Accounts for years of below average evaporation"]
["Maximum evaporation pond cell area","max_ep_cell_area",5,"acres"]
["Minimum number of pond cells","min_ep_cells",2,"cells","A minimum of 2 two cells is essential to ensure availability of storage space during cleaning, maintainance or emergency conditions. \"Dewatering Municipal Wastewater Sludge,EPA design Manual, Dewatering Municipal Wastewater Sludges.EPA/625/1-87/014, September 1987\"."]
["Evaporation pond freeboard","ep_freeboard",0.5,"feet","Additional freeboard provided by dike"]
["Overexcavation for evaporation pond","ep_overexcavate",4,"ft","2 feet each side in each dimension"]
["Evaporation pond solids removal frequency","dredging_freq",1,"per year","Range from 1 to 3 yrs.  Depending on the final solid concentration required and local climate.  \"Dewatering Municipal Wastewater Sludge,EPA design Manual, Dewatering Municipal Wastewater Sludges.EPA/625/1-87/014, September 1987\"."]
["Evaporation pond solids density","ep_solids_density",25,"lb/ft3"]
["Evaporation pond dike cross-sectional area","dike_xsection",35.630000000000003,"square ft","13' top and 1:2 side slope, 2'6\" height"]
[]
["Resin Specific Assumptions"]
["Resin name","resin_name","Strong Base Polyacrylic","Strong Base Polystyrenic","Nitrate-selective","Perchlorate-selective","Alternative Resin","Resin name displayed on the output page; do not change, except for alternative resin"]
["Media unit cost in $/cubic ft","resin_unit_cost","see database","see database","see database","see database",null,"Unit cost required for user defined alternative media only"]
["Loading rate maximum in gpm/square ft","load_max",12,12,12,12]
["Regeneration solution (1 for brine, 2 for tetrachloroferrate)","regen_sol",1,1,2,2]
["Brine concentration in lbs/gal","brine_conc",0.25,0.53,"NA","NA"]
["Brine loading rate in lbs/square ft","brine_load",25,35,"NA","NA"]
["Tetrachloroferrate bed volumes","FeCl4_BV","NA","NA",6,6]
["Molarity of HCl in tetrachloroferrate solution","HCl_M","NA","NA",4,4]
["Molarity of FeCl3 in tetrachloroferrate solution","FeCl3_M","NA","NA",1,1]
["Time for regeneration in minutes","time_regen",45,63,21,21]
["Dilute HCl rinse bed volumes","HCl_BV","NA","NA",14,14]
["Molarity of dilute HCl rinse","dil_HCl_M","NA","NA",0.01,0.01]
["Water rinse bed volumes","rinse_BV",3,3,21,21]
["Target Bed Depth (Designs < 1MGD)","target_bed_depth_under",4.5,4.5,3.2,2.8,null,"Used only for autosize procedure"]
["Target Bed Depth (Vertical Designs > 1 MGD)","target_bed_depth_over",4.7,4.7,4.5999999999999996,4.5999999999999996,null,"Used only for autosize procedure"]
["Target Bed Depth (Horizontal Designs)","target_bed_depth_horiz",4.5999999999999996,4.7,4.3,4.3,null,"Used only for autosize procedure"]
[]
["I/O Port Table"]
["Full automation includes all inputs and outputs, semi-automated uses inputs only, manual control uses neither"]
["To change the degree of automation, the user may replace the numbers in each of the blue columns."]
["I/O Ports needed per….","Lookup name","Discrete Inputs","Discrete Outputs","Analog Inputs","Analog Outputs"]
["Alarm (including level switch/alarms, high/low alarms, low alarms)","alarm",1,1,0,0]
["Conductivity meter","cond",0,0,1,0]
["Magnetic flow meter","flow_mag",0,0,1,0]
["Orifice plate flow meter","flow_op",0,0,2,1,"Additional analog input because flow meters include pressure gauges"]
["Propeller flow meter","flow_prop",0,0,1,0]
["Venturi flow meter","flow_ven",0,0,2,1,"Additional analog input because flow meters include pressure gauges"]
["Head loss sensor","head",1,0,0,0]
["ORP sensor","ORP",0,0,1,0]
["pH meter","ph",0,0,1,0]
["Sampling port","port",1,0,0,0]
["On/off switch (to operate pump motors, mixers, valves, etc)","switch",3,1,0,0]
["Temperature meter","temp",0,0,1,0]
["Turbidity meter","turb",0,0,1,0]
["Motor/air operated valve","valve",0,0,1,1]
[]
["Valve Table"]
["Under assumptions below, valves are motorized for fully automated systems, manual for semi-automated and manual systems"]
["To change the degree of automation, the user may replace the numbers in each of the blue columns."]
["Number of control valves of x type on y line per z","Lookup name","Manual","Semi-auto","Fully Auto"]
["Number of motor/air operated control valves on process line per vessel (parallel systems)","proc_MOV_vessel_par",0,0,3,"valves/vessel"]
["Number of motor/air operated control valves on process line per vessel (series systems)","proc_MOV_vessel_ser",0,0,2,"valves/vessel"]
["Number of motor/air operated control valves on process line per booster pump","proc_MOV_pump",0,0,2,"valves/pump"]
["Motor/air operated on process line per cartridge filter","proc_MOV_filter",0,0,1,"valves/filter"]
["Number of motor/air operated control valves on backwash line per vessel","back_MOV_vessel",0,0,2,"valves/vessel"]
["Number of motor/air operated control valves on backwash line per backwash pump","back_MOV_pump",0,0,1,"valves/pump"]
["Number of motor/air operated control valves on backwash line per backwash tank","back_MOV_tank",0,0,1,"valves/tank","For filling backwash tank"]
["Number of motor/air operated control valves on backwash line per mixing tank or salt saturator","back_MOV_brine",0,0,1,"valves/tank","For adding water to create regenerant solution"]
["Additional motor/air operated control valves on backwash line","back_MOV_add",0,0,1,"valves","Motive for eductor when backwash pumps not operated, applies for brine regeneration only"]
["Number of motor/air operated control valves on backwash line per eductor","back_MOV_eductor",0,0,1,"valves/eductor"]
["Number of motor/air operated control valves on regenerant line per mixing tank or salt saturator","brine_MOV_tank",0,0,1,"valves/tank"]
["Number of motor/air operated control valves on regenerant line per process vessel","brine_MOV_vessel",0,0,2,"valves/vessel"]
["Number of motor/air operated control valves on regenerant line per regenerant pump","brine_MOV_pump",0,0,1,"valves/pump","Applies only with tetrachlorferrate regeneration"]
["Number of motor/air operated control valves on acid line per HCl tank","acid_MOV_tank",0,0,1,"valves/tank","Applies only with tetrachlorferrate regeneration"]
["Number of motor/air operated control valves on acid line per metering pump","acid_MOV_pump",0,0,2,"valves/pump","Applies only with tetrachlorferrate regeneration"]
["Number of motor/air operated control valves on acid line per regenerant mixing tank","acid_MOV_mixtank",0,0,1,"valves/tank","Applies only with tetrachlorferrate regeneration"]
["Number of motor/air operated control valves on caustic line per metering pump","caustic_MOV_pump",0,0,2,"valves/pump","Applies only with pH adjustment"]
["Number of motor/air operated control valves on residuals line per residuals pump","res_MOV_pump",0,0,1,"valves/pump"]
["Number of motor/air operated control valves on residuals line per holding tank","res_MOV_tank",0,0,1,"valves/tank"]
["Number of motor/air operated control valves on residuals line per cell for evaporation pond","res_MOV_ep",0,0,1,"valves/cell"]
["Number of motor/air operated control valves on bypass line","tot_bp_MOVs",0,0,1,"valves"]
["Manual valves on process line per vessel (parallel systems)","proc_man_vessel_par",3,3,0,"valves/vessel"]
["Manual valves on process line per vessel (series systems)","proc_man_vessel_ser",2,2,0,"valves/vessel"]
["Manual valves on process line per booster pump","proc_man_pump",2,2,0,"valves/pump"]
["Manual on feed line per cartridge filter","proc_man_filter",1,1,0,"valves/filter"]
["Manual valves on backwash line per vessel","back_man_vessel",2,2,0,"valves/vessel"]
["Manual valves on backwash line per backwash pump","back_man_pump",1,1,0,"valves/pump"]
["Manual valves on backwash line per backwash tank","back_man_tank",1,1,0,"valves/tank","For filling backwash tank"]
["Manual valves on backwash line per mixing tank or salt saturator","back_man_brine",1,1,0,"valves/tank","For adding water to create regenerant solution"]
["Additional manual valves on backwash line","back_man_add",1,1,0,"valves","Motive for eductor when backwash pumps not operated, applies for brine regeneration only"]
["Manual valves on backwash line per eductor","back_man_eductor",1,1,0,"valves/eductor"]
["Manual valves on regenerant line per mixing tank or salt saturator","brine_man_tank",1,1,0,"valves/tank"]
["Manual valves on regenerant line per process vessel","brine_man_vessel",2,2,0,"valves/vessel"]
["Manual valves on regenerant line per regenerant pump","brine_man_pump",1,1,0,"valves/pump","Applies only with tetrachlorferrate regeneration"]
["Manual valves on acid line per HCl tank","acid_man_tank",1,1,0,"valves/tank","Applies only with tetrachlorferrate regeneration"]
["Manual valves on acid line per metering pump","acid_man_pump",2,2,0,"valves/pump","Applies only with tetrachlorferrate regeneration"]
["Manual valves on acid line per regenerant mixing tank","acid_man_mixtank",1,1,0,"valves/tank","Applies only with tetrachlorferrate regeneration"]
["Manual valves on caustic line per metering pump","caustic_man_pump",2,2,0,"valves/pump","Applies only with pH adjustment"]
["Number of motor/air operated control valves per day tank","chem_mov_day",0,0,1,"valves/tank"]
["Number of manual valves per day tank","chem_man_day",1,1,0,"valves/tank"]
["Number of motor/air operated control valves on polymer line per chemical pump","chem_MOV_pump",0,0,2,"valves/pump"]
["Number of manual control valves on polymer line per chemical pump","chem_man_pump",2,2,0,"valves/pump"]
["Manual valves on residuals line per residuals pump","res_man_pump",1,1,0,"valves/pump"]
["Manual valves on residuals line per holding tank","res_man_tank",1,1,0,"valves/tank"]
["Manual valves on residuals line per cell for evaporation pond","res_man_ep",1,1,0,"valves/cell"]
["Manual valves on bypass line","tot_bp_man",1,1,0,"valves"]

{"sheet":"O&M Assumptions","index":5,"n_rows":70,"n_cols":5,"rows_kept":70,"cut":false,"hidden":false,"merged":[]}
["Default O&M Assumptions"]
["Users may change any of the cells in the Value column"]
[]
["Assumption","Range Name","Value","Units","Guidance"]
["Media Disposal"]
["Alternate media disposal cost (including transportation)","alt_media_disp",{"$f":"15*2000/media_density","v":697.67441860465112},"/ton","Leave blank to use cl.xls disposal cost.  Cost shown here is for incineration of perchlorate laden media.  From Frank Boodoo, Purolite, 12/7/04."]
[]
["Materials"]
["Cost for parts & maintenance for booster pumps","booster_pump_maintenance",0.01,"of installed cost","For calculating cost of actual maintenance materials; not to be confused with depreciation.  Initial proposed estimate of 5% seems high  (Richard E. Hubel, Peter Keenan, American Water Works Service Company, Inc)"]
["Life of cartridge filters","cart_life",5,"months","US EPA, Draft of \"Design and Cost Estimates for Advanced Water Treatment Technologies\", December 2000."]
[]
["Labor"]
["Labor hours per cartridge filter","hrs_filter",12,"hrs/unit/yr"]
["Mangerial LOE as a percent of average technical labor ","Manager_percent",0.1,"fraction"]
["Administrative LOE as a percent of average technical labor ","Clerical_percent",0.1,"fraction"]
[]
["Operating LOE assumptions"]
["Minutes per instrument per day","uloe_inst",5,"min/day","For manual systems only"]
["Recording operating paramenters for automated systems","uloe_inst_auto",5,"min/day","For semiautomated and automated systems"]
["Minutes per pump per day","uloe_pump",5,"min/day","For manual and semiautomated systems"]
["Minutes per valve per week","uloe_valve",5,"min/week","For manual and semiautomated systems"]
["Minutes per 100 sf per day","uloe_fp",1,"min/100 sf/day"]
["Minutes per regeneration/backwash for automated systems","uloe_autoregen",10,"min/event","Manual and semiautomated systems use actual regeneration/backwash time"]
["Hours per resin changeout","uloe_throwaway",{"$f":"8/(20*27)","v":1.4814814814814815E-2},"hours/cubic foot","Based on 20 cubic yards per day, applied separately to removal and replacement."]
[]
["Maintenance LOE assumptions"]
["For instruments (includes calibration)","uloe_inst_maint",10,"min/month"]
["For pumps","uloe_pump_maint",30.25,"hours/year","Based on vendor recommended maintenance activities; applied to large, frequently operated pumps only"]
["For valves","uloe_valve_maint",5,"min/year","Applied to main process valves only"]
["For chemical supply systems","uloe_chem_maint",120,"min/month"]
[]
["Energy"]
["Pump head for booster pumps","booster_pump_head",25,"psi"]
["Residuals pump head","res_pump_psi",25,"psi"]
["Pump efficiency for booster pumps","booster_pump_efficiency",0.75]
["Pump head for backwash pumps","backwash_pump_head",14.7,"psi"]
[]
["Lighting and HVAC"]
["Lighting power per sf, low-quality buildings and sheds","lighting_power_low",1,"W/sf","1, 2, and 4 W/sf are the assumptions used for building capital costs."]
["Lighting power per sf, mid-quality buildings","lighting_power_mid",2,"W/sf"]
["Lighting power per sf, high-quality buildings","lighting_power_high",4,"W/sf"]
[]
["Ventilation air change rate for contactor","Air_changes_contactor",3,"air changes/hr"]
["Ventilation air change rate for pump room","Air_changes_pump",20,"air changes/hr","Could be lower (annual average 3 changes/hr) in a northern climate"]
["Ventilation air change rate for chemical storage","Air_changes_chem_storage",2,"air changes/hr"]
["Ventilation air change rate for offices","Air_changes_office",2,"air changes/hr"]
["Pressure drop across the fan","Fan_pressure_drop",0.25,"lbs/ft2"]
["Number of mechanical ventilation days per year first building (small system)","fan_days_build1_small",90,"days/year","Number of days per year where natural ventilation is applicable cannot be greater than 365 days"]
["Number of mechanical ventilation days per year 2nd building (small system)","fan_days_build2_small",90,"days/year","For small systems (<1 MGD)"]
["Number of mechanical ventilation days per year first building (medium system)","fan_days_build1_medium",120,"days/year","For medium systems (1 - 10 MGD)"]
["Number of mechanical ventilation days per year 2nd building (medium system)","fan_days_build2_medium",120,"days/year"]
["Number of mechanical ventilation days per year first building (large system)","fan_days_build1_large",185,"days/year","For large systems (> 10 MGD)"]
["Number of mechanical ventilation days per year 2nd building (large system)","fan_days_build2_large",185,"days/year"]
[]
["R-value for walls","R_wall",13,"hr-sf-degF/BTU","Assumes standard building materials.  If higher R-value materials are desired, user may also need to adjust the cost of building materials in cl.xls"]
["R-value for ceilings","R_ceiling",38,"hr-sf-degF/BTU","Assumes standard building materials.  If higher R-value materials are desired, user may also need to adjust the cost of building materials in cl.xls"]
["Annual heating degree days","heat_DD",4923,"degree days","Heating and cooling assumptions should be consistent with one another.  Assumed values are for a climate that results in a total energy usage for heating and cooling equal to the national median."]
["Annual cooling degree days","cool_DD",1697,"degree days","Heating and cooling assumptions should be consistent with one another.  Assumed values are for a climate that results in a total energy usage for heating and cooling equal to the national median."]
["Heating ventilation/infiltration load","heat_viload",168679,"BTU/cfm","Heating and cooling assumptions should be consistent with one another.  Assumed values are for a climate that results in a total energy usage for heating and cooling equal to the national median."]
["Cooling ventilation/infiltration load","cool_viload",51771,"BTU/cfm","Heating and cooling assumptions should be consistent with one another.  Assumed values are for a climate that results in a total energy usage for heating and cooling equal to the national median."]
["Electric resistance heating efficiency","resist_eff",0.98,null,"See Appendix E"]
["Heat pump heating coefficient of performance","COP",3.2,null,"See Appendix E"]
["Natural gas non-condensing furnace efficiency","gas_non_eff",0.8,null,"See Appendix E"]
["Natural gas condensing furnace efficiency","gas_eff",0.95,null,"See Appendix E"]
["Standard oil furnace efficiency","diesel_non_eff",0.78,null,"See Appendix E"]
["Mid-efficiency oil furnace efficiency","diesel_eff",0.85,null,"See Appendix E"]
["Air conditioning EER","EER",11,"Whr/BTU","See Appendix E"]
["Heat pump cooling mode EER","hp_EER",10.1,"Whr/BTU","See Appendix E"]
[]
["Heating Oil Heat Content","diesel_heat_content",139000,"BTU/gal","U.S. DOE, Energy Information Administration."]

{"sheet":"Indirect Assumptions","index":6,"n_rows":128,"n_cols":5,"rows_kept":128,"cut":false,"hidden":false,"merged":[]}
["Default Assumptions for Indirect and Add-On Costs"]
["Users may change any of the cells in the Value column"]
[]
["Assumption","Range Name","Value","Units","Guidance"]
["Concrete Pad"]
["Include concrete pad in total capital cost?","include_pad",1,"<--- enter 1 for yes, 0 for no"]
[]
["Permits"]
["Include permit costs?","include_permits",1,"<--- enter 1 for yes, 0 for no"]
["Always include NEPA compliance costs?","include_NEPA",0,"<--- enter 1 for yes, 2 for no","Default of 0 means NEPA compliance is included in the high component cost estimate only.  Selecting 1 means NEPA compliance will be included in all estimates.  Selecting 0 means NEPA compliance will never be included"]
["HCl strength to trigger RMP requirement","HCl_strength_RMP",0.37]
["HCl quantity to trigger RMP requirement","HCl_quant_RMP",15000,"lbs"]
[]
["Pilot Study"]
["Include pilot study costs?","include_pilot",1,"<--- enter 1 for yes, 0 for no"]
[]
["Mobilization and Demobilization"]
["Mobilization percentage for small systems","mob_pct_small",0,"of direct capital cost","Typically 2-5% of the estimated construction cost. Enter 0% to exclude. Excluded by default for pre-engineered packages"]
["Mobilization percentage for medium systems","mob_pct_medium",0.04,"of direct capital cost"]
["Mobilization percentage for large systems","mob_pct_large",0.02,"of direct capital cost"]
[]
["Architectural Fees for Treatment Building"]
["Include architectural fee?","include_arch",1,"<--- enter 1 for yes, 0 for no","Must be added to building cost. Change for special considerations. Includes structural, mechanical, and electrical engineering for building only."]
["Include architectural fee for small systems?","include_arch_small",0,"<--- enter 1 for yes, 0 for no"]
[]
["Installation, Transportatation, and O&P"]
["Installation, Transportatation, and O&P percentage","inst_pct",0,"of direct capital cost","Included in line item unit costs.  Add a percentage for special considerations such as a remote site or high cost location."]
[]
["Sitework"]
["Include sitework costs?","include_sitework",1,"<--- enter 1 for yes, 0 for no"]
[]
["Standby Power"]
["Include standby power costs?","include_standby",1,"<--- enter 1 for yes, 0 for no"]
["Include standby power costs for small systems?","include_standby_small",0,"<--- enter 1 for yes, 0 for no"]
["Design safety factor for standby power","std_safety_factor",0,null,"Default 0%.  Apply a percentage to increase standby power requirements."]
["Include heating in standby power","need_heat",0,"<--- enter 1 for yes, 0 for no","If a system uses gas or diesel heat, heating will not be included, regardless of this assumption."]
["Include cooling in standby power","need_cool",0,"<--- enter 1 for yes, 0 for no","If both heating and cooling are included, standby power requirements will be based on the maximum of the two."]
["Minimum standby power generator size","min_standby",10,"kW","Minimum size for full standby generators"]
[]
["Geotechnical"]
["Include geotechnical costs for low cost systems?","include_geo_low",0,"<--- enter 1 for yes, 0 for no","Note: geotechnical is always included when evaporation ponds or holding basins are used, regardless of the numbers entered here, because of excavation"]
["Include geotechnical costs for medium cost systems?","include_geo_medium",0,"<--- enter 1 for yes, 0 for no"]
["Include geotechnical costs for high cost systems?","include_geo_high",1,"<--- enter 1 for yes, 0 for no"]
["Test pit length","pit_length",4,"feet"]
["Test pit width","pit_width",4,"feet"]
["Test pit depth","pit_depth",7,"feet"]
["Borehole depth without basins","bore_depth_nobasin",10,"feet"]
["Borehole depth for shallow basins","bore_depth_min",25,"feet"]
["Borehole depth for deep basins","bore_depth_max",50,"feet"]
["Basin excavation depth above which deeper boreholes are needed","deep_bore_need",20,"feet","Systems with deep basins require deeper investigation"]
["Technology footprint above which boreholes are needed","bore_need",2000,"square feet","Small system geotechnical investigation can be completed with test pits, larger systems and those with basins require boreholes"]
["Minimum number of boreholes","min_holes",4]
["Borehole needed every x square feet","hole_per_sf",1000,"square feet"]
["Boreholes per job","hole_per_job",24,"boreholes/job"]
["Linear feet bored per day","hole_per_day",55.5,"l.f./day","RS Means Costworks 2001"]
[]
["Yard Piping"]
["Include yard piping costs?","include_yardpipe",1,"<--- enter 1 for yes, 0 for no"]
["Frost depth","frost",38,"inches","Should be consistent with (reflect same climate as) heating and cooling assumptions on O&M assumptions page.  Assumptions are for St. Louis, Missouri."]
["Minimum trench depth to top of pipe","min_trench_depth",36,"inches","US Army Corps of Engineers recommended minimum cover for distribution pipes of 2.5 ft in grassed areas, 3 ft if buried under pavement or roadways but not less than frost penetration depth (USACOE 1984)"]
["Soil density","soil_dens",97,"lb/cubic ft.","Based on soil density of loamy sand (1.55 gm/cc)"]
["Coefficient of passive pressure","Coeff_Kp",3]
["Reduction factor","Reduction",0.46700000000000003]
["Bedding depth below pipe","bedding_depth",6,"inches"]
["Bedding depth surrounding the pipe","bedding_pct",0.25,"of pipe diameter"]
["Trench inside angle","trench_angle",{"$f":"RADIANS(45)","v":0.78539816339744828},"radians"]
["Pipe length from water source to the boundary of the 10 foot buffer","yard_in",0,"feet","Use if technology is first step in treatment process"]
["Pipe length the boundary of the 10 foot buffer to distribution network","yard_out",0,"feet","Use if technology is last step in treatment process"]
[]
["Electrical (including yard wiring)"]
["Electrical percentage","elect_pct",0.1,"of direct cost"]
[]
["Instrumentation and Control"]
["Instrumentation and control percentage","i_c_pct",0,"of direct cost","Included as a direct cost line item."]
[]
["Contingency"]
["Include contingency costs for low cost systems?","include_conting_low",0,"<--- enter 1 for yes, 0 for no"]
["Include contingency costs for medium cost systems?","include_conting_medium",0,"<--- enter 1 for yes, 0 for no"]
["Include contingency costs for high cost systems?","include_conting_high",1,"<--- enter 1 for yes, 0 for no"]
["Technology complexity factor","complexity",1.5,null,"Technology-specific factor.  See Appendices for details.  Low complexity = 0.5; Average complexity = 1.0; High complexity = 1.5; Very high complexity = 2.0."]
[]
["Process Engineering"]
["Engineering percentage for small systems","eng_pct_small",0.2,"of direct capital cost","Enter 0% to exclude."]
["Engineering percentage for medium systems","eng_pct_medium",0.12,"of direct capital cost"]
["Engineering percentage for large systems","eng_pct_large",0.08,"of direct capital cost"]
[]
["Miscellaneous Allowance"]
["Miscellaneous allowance percentage","misc_pct",0.1,"of direct capital cost","Enter 0% to exclude.  "]
[]
["Legal, Fiscal, and Administrative"]
["Legal percentage","legal_pct",0.02,"of direct capital cost","Enter 0% to exclude.  Highly site-specific.  Can range from 2-5% of equipment, installation, construction, electrical, and standby power.  To estimate, add 5% to total estimated construction cost."]
[]
["Sales Tax"]
["Sales tax percentage","tax_pct",0,"of direct capital cost","May be exempt if constructed with public funds.  May be as high as 7.25% of equipment and construction, with national average 4.75%."]
[]
["Financing during Construction"]
["Financing percentage","finance_pct",0.05,"of direct capital cost","Enter 0% to exclude.  Typically assumed to be one year's interest on capital cost."]
["Financing percentage for small systems","finance_pct_small",0,"of direct capital cost","Small system construction assumed to take less than one year"]
[]
["Construction Management and General Contractor Overhead"]
["Builder's risk insurance percentage","br_ins_pct",3.3999999999999998E-3,null,"Enter 0% to exclude. 0.34% is national average rate. RSMeans Building Construction Cost Data 2009, reference section R01100-070"]
["Include performance bond cost?","include_bond",1,"<--- enter 1 for yes, 0 for no"]
["Include construction management cost?","include_cm",1,"<--- enter 1 for yes, 0 for no"]
["Include construction management cost for pre-engineered packages?","include_cm_pre",0,"<--- enter 1 for yes, 0 for no"]
[]
["Heating Table (1=include heating in buildings and O&M, 0 = do not include heating)"]
[null,null,"System Size"]
["Component Level",null,"Small (<1 mgd)","Medium (1-10 mgd)","Large (>10 mgd)"]
["Buildings 500 square feet or greater"]
["low cost","heating_table",0,1,1]
["mid cost",null,1,1,1]
["high cost",null,1,1,1]
["Buildings less than 500 ft2 (other than those used for chlorine storage)"]
["low cost","heating_table_shed",0,0,1]
["mid cost",null,0,0,1]
["high cost",null,1,1,1]
[]
["Cooling Table (1=include cooling in buildings and O&M, 0 = do not include cooling)"]
[null,null,"System Size"]
["Cost Level",null,"Small (<1 mgd)","Medium (1-10 mgd)","Large (>10 mgd)"]
["Buildings 500 square feet or greater"]
["low cost","cooling_table",0,0,1]
["mid cost",null,0,1,1]
["high cost",null,1,1,1]
["Buildings less than 500 ft2 (other than those used for chlorine storage)"]
["low cost","cooling_table_shed",0,0,0]
["mid cost",null,0,0,0]
["high cost",null,0,0,0]

{"sheet":"Vessel Constraints","index":7,"n_rows":79,"n_cols":5,"rows_kept":79,"cut":false,"hidden":false,"merged":[]}
["Vessel Constraint Calculations"]
["This sheet performs calculations to confirm that the vessel design on the Input page meets engineering constraints"]
[]
["Calculation","Range Name","Value","Units","Guidance"]
["From Inputs"]
["Design Flow","design_flow",{"$f":"IF(df_units=\"gpm\",(1-bp_pct)*design_flow_I*24*60/1000000,(1-bp_pct)*design_flow_I)","v":75.072000000000003},"MGD","From Inputs, less bypass"]
["Average Flow","average_flow",{"$f":"(1-bp_pct)*IF(af_units=\"gpm\",average_flow_I*24*60/1000000,IF(af_units=\"fraction of design flow\",average_flow_I*design_flow,average_flow_I))","v":37.536000000000001},"MGD","From Inputs, less bypass"]
["Design Flow Rate","design_flow_rate",{"$f":"design_flow*1000000/(24*60)","v":52133.333333333336},"gpm","Design flow expressed in gpm"]
["Average Flow Rate","average_flow_rate",{"$f":"average_flow*1000000/(24*60)","v":26066.666666666668},"gpm","Average flow expressed in gpm"]
["Bypass Flow Rate (design)","bp_flow_rate",{"$f":"bp_pct/(1-bp_pct)*design_flow_rate","v":0},"gpm"]
["Resin type chosen","resin_type",4,"<-- 1 for Strong Base Polyacrylic, 2 for Strong Base Polystyrenic, 3 for Nitrate-selective, 4 for Perchlorate-selective, 5 for alternative user-defined"]
["Theoretical total empty bed contact time (EBCT)","EBCT",{"$f":"EBCT_I","v":3},"minutes"]
["Minimum number of vessels in series","Num_tanks",{"$f":"num_tanks_I","v":2},"units"]
["Vessel geometry","tank_geom",{"$f":"IF(tank_geom_I=\"horizontal\",2,1)","v":2},"<-- 1 for upright cylindrical, 2 for horizontally-laid cylinder "]
[]
["From Central Cost Database"]
["Maximum Standard Vessel Diameter","max_diam_std_size",{"$f":"max_vessel_diam_cl","v":14},"feet"]
["Minimum Vessel Diameter","min_diam",{"$f":"min_vessel_diam_cl","v":1.5},"feet"]
["Maximum Vessel Diameter","max_diam",{"$f":"IF(max_diam_override>0,max_diam_override,max_diam_std_size)","v":14},"feet","Standard unless overridden on CDA's"]
[]
["Vessel Constraint Verification"]
["Loading rate maximum","load_max",{"$f":"VLOOKUP(\"load_max\",resin_table,resin_type+1,FALSE)","v":12},"gpm/square ft"]
["EBCT per vessel","EBCT_tank",{"$f":"EBCT/Num_tanks","v":1.5},"minutes"]
["Vessel surface area","max_sa",{"$f":"IF(tank_geom=1,(comm_diam-(2*Vessel_thickness))^2*PI()/4,IF(tank_geom=2,(comm_diam-(2*Vessel_thickness))*comm_height_length,0))","v":340},"square feet"]
["Height available above media bed (for horizontal vessels)","distance_above",{"$f":"IF(tank_geom=2,comm_diam-bed_depth-horiz_underdrain,\"NA\")","v":6.1},"ft"]
["Void space above media bed (for horizontal vessels)","void_above",{"$f":"IF(tank_geom=2,comm_height_length*(comm_diam*comm_diam/2*ASIN(SQRT(distance_above/comm_diam))-(comm_diam/2-distance_above)*SQRT((comm_diam-distance_above)*distance_above)),\"NA\")","v":1706.1376537358649},"cubic feet"]
["Maximum flow per vessel","flow_per_vessel",{"$f":"IF(tank_geom=1,(max_sa*bed_depth*7.48)/EBCT_tank,media_volume*7.48/EBCT_tank)","v":4069.1200000000003},"gpm","This represents the maximum flow a given vessel could handle, not the flow during normal operating conditions"]
["Number of parallel treatment trains","num_treat_lines",{"$f":"ROUNDUP(design_flow_rate/flow_per_vessel,0)","v":13},"lines"]
["Number of vessels excluding redundancy","op_num_tanks",{"$f":"ROUNDUP(design_flow_rate/flow_per_vessel,0)*Num_tanks","v":26},"units"]
["Number of redundant units","NRD",{"$f":"IF(NRD_I<>\"\",NRD_I,IF(design_flow>=1,ROUNDUP(num_treat_lines/redund_freq,0),IF(op_num_tanks=1,NRD_small_1,NRD_small)))","v":4}]
["Total number of vessels including redundancy","final_num_tanks",{"$f":"op_num_tanks+NRD","v":30},"units"]
[]
["Vessel requirements based on bed depth and contact time"]
["Minimum total contact material needed","contact_material",{"$f":"design_flow_rate*EBCT/(7.481)","v":20906.295949739339},"cubic feet"]
["Minimum volume of resin per vessel","contact_mat_per_vessel",{"$f":"contact_material/op_num_tanks","v":804.08830575920535},"cubic feet"]
["Minimum volume of vessel","vol_vessel",{"$f":"contact_mat_per_vessel*(1+bed_expansion)","v":1206.132458638808},"cubic feet"]
["Minimum surface area of contact material","SA",{"$f":"contact_mat_per_vessel/(bed_depth)","v":335.03679406633557},"square feet"]
[]
["Quantities based on user-specified vessel dimensions"]
["Final surface area of contact material","comm_SA",{"$f":"IF(tank_geom=1,(comm_diam-(2*Vessel_thickness))^2*PI()/4,IF(tank_geom=2,(comm_diam-(2*Vessel_thickness))*comm_height_length))","v":340},"square feet"]
["Final surface loading rate","comm_load_rate",{"$f":"(design_flow_rate/num_treat_lines)/comm_SA","v":11.794871794871796},"gpm/square ft"]
["Media volume per tank","media_volume",{"$f":"comm_SA*bed_depth","v":816},"cubic feet"]
[null,"media_volume_gal",{"$f":"media_volume*7.48","v":6103.68},"gallons"]
["Media mass per vessel","media_per_vessel",{"$f":"media_volume*media_density","v":35088},"lbs/vessel"]
["Total media required","total_media",{"$f":"media_per_vessel*final_num_tanks","v":1052640},"lbs"]
[]
["Media volume when expanded","media_volume_expanded",{"$f":"media_volume*(1+bed_expansion)","v":1224},"cubic feet"]
[]
["Total vessel volume","comm_vol",{"$f":"PI()*comm_diam^2/4*comm_height_length","v":2670.3537555513244},"cubic feet"]
["Total vessel volume galons","comm_vol_gal",{"$f":"comm_vol*7.48","v":19974.246091523906},"gal"]
[]
["Checks on user-specified dimensions"]
["Design dimensions for vertical vessels:"]
["    Height of vessel required","height",{"$f":"bed_depth*(1+bed_expansion)+free_board","v":4.0999999999999996},"feet"]
["    Required vessel diameter (circular vessels)","diameter",{"$f":"(SA*4/PI())^0.5+(2*Vessel_thickness)","v":20.653863927762998},"feet"]
["    Minimum commercial height given diameter","min_comm_height",{"$f":"VLOOKUP(comm_diam,vessel_size_table_cl,2)","v":6},"feet"]
["    Maximum commercial height given diameter","max_comm_height",{"$f":"VLOOKUP(comm_diam,vessel_size_table_cl,3)","v":24},"feet"]
[]
["Void space required for horizontal vessels:"]
["For freeboard","freeboard_horiz_void",{"$f":"comm_height_length*(comm_diam*comm_diam/2*ASIN(SQRT(free_board/comm_diam))-(comm_diam/2-free_board)*SQRT((comm_diam-free_board)*free_board))","v":49.917020845961531},"cubic feet","Volume of a horizontal slice taken out of a cylinder"]
["For underdrain","underdrain_horiz_void",{"$f":"comm_height_length*(comm_diam*comm_diam/2*ASIN(SQRT(horiz_underdrain/comm_diam))-(comm_diam/2-horiz_underdrain)*SQRT((comm_diam-horiz_underdrain)*horiz_underdrain))","v":251.17401415822246},"cubic feet"]
["Total","horiz_void",{"$f":"freeboard_horiz_void+underdrain_horiz_void","v":301.09103500418399},"cubic feet"]
[]
["Volume available for media and expansion:"]
["Vertical vessel","vert_vol_available",{"$f":"(comm_height_length-free_board)*PI()*comm_diam^2/4","v":2631.0838473814515},"cubic feet"]
["Horizontal vessel","horiz_vol_available",{"$f":"comm_vol-62:62","v":2369.2627205471404},"cubic feet"]
["For selected vessel geometry","input_vol_vess",{"$f":"CHOOSE(tank_geom,vert_vol_available,horiz_vol_available)","v":2369.2627205471404},"cubic feet","To be compared to vol_vessel, to determine whether vessel is oversized."]
[]
["Tolerance for oversized vessels","vol_tol",{"$f":"CHOOSE(tank_geom,IF(ss_cat2=1,vol_tol_vert_small,vol_tol_vert_med),vol_tol_horiz)","v":0.4},null,"Tolerance added to vol_vessel in checking for oversized vessels."]
[]
["Cartridge Filters for Pretreatment"]
["Maximum flow per cartridge filter","cart_per_flow",{"$f":"VLOOKUP(10^6,cart_cost_cl,1)-0.001","v":2.88},"MGD"]
["Number of active cartridge filters","active_filters",{"$f":"IF(include_cart=0,0,MAX(ROUNDUP(design_flow/cart_per_flow,0),IF(design_flow>=1,min_cart,0)))","v":27},"units"]
["Number of redundant cartridge filters","NRD_filters",{"$f":"IF(include_cart=0,0,init_NRD_cart+ROUNDDOWN(design_flow/addl_redund_cart_per_flow,0))","v":2},"units"]
["Total number of cartridge filters","num_filters",{"$f":"active_filters+NRD_filters","v":29},"units"]
["Flow per filter","filter_size",{"$f":"IF(include_cart=0,0,design_flow/active_filters)","v":2.7804444444444445},"MGD"]
["Filter length","filter_len",{"$f":"IF(include_cart=0,0,VLOOKUP(filter_size,cart_dim_table_cl,5))","v":7.7458333333333336},"feet"]
["Filter width","filter_wid",{"$f":"IF(include_cart=0,0,VLOOKUP(filter_size,cart_dim_table_cl,6))","v":1.8333333333333333},"feet"]
["Elements per filter","filter_elements",{"$f":"IF(include_cart=0,0,VLOOKUP(filter_size,cart_dim_table_cl,7))","v":20},"elements/housing"]

{"sheet":"Backwash and Regeneration","index":8,"n_rows":139,"n_cols":5,"rows_kept":139,"cut":false,"hidden":false,"merged":[]}
["Backwash and Regeneration Calculations"]
[]
["Calculation","Range Name","Value","Units","Guidance"]
["From Input"]
["Media regeneration or throwaway operation?","regen_type",{"$f":"IF(throwaway_I=\"regeneration\",1,2)","v":2},"<-- 1 for regeneration, 2 for throwaway"]
["Number of bed volumes before regeneration/throwaway",null,{"$f":"BV_regen","v":250000},"For reference only"]
["No backwash","no_backwash",{"$f":"IF(no_backwash_I=\"existing pumps\",1,IF(no_backwash_I=\"new pumps\",\"\",IF(ss_cat2=1,1,\"\")))","v":""},"<-- 1 = backwash using existing supply or treated water pumps, blank = include backwash pumps in costs"]
["No backwash tanks","no_back_tank",{"$f":"IF(no_back_tank_I=\"existing storage\",1,IF(no_back_tank_I=\"new storage\",\"\",IF(ss_cat2=2,\"\",1)))","v":1},"<-- 1 = backwash from existing storage or supply, blank = include backwash tanks in costs"]
["Brine delivery method","brine_method",{"$f":"IF(brine_method_I=\"\",\"\",IF(brine_method_I=\"brine mixing tanks\",1,2))","v":""},"<-- 1 for brine mixing tanks, 2 for salt saturator"]
[]
["Regeneration Needs"]
["Total resin volume","resin_volume_total",{"$f":"final_num_tanks*media_volume","v":24480},"cubic feet"]
["Regeneration solution type","regen_sol",{"$f":"VLOOKUP(\"regen_sol\",resin_table,resin_type+1,FALSE)","v":2},"<-- 1 for brine, 2 for tetrachloroferrate"]
["Time for regeneration","time_regen",{"$f":"VLOOKUP(\"time_regen\",resin_table,resin_type+1,FALSE)","v":21},"minutes"]
[]
["Brine Regeneration"]
["Brine concentration","brine_conc",{"$f":"IF(AND(regen_type=1,regen_sol=1),VLOOKUP(\"brine_conc\",resin_table,resin_type+1,FALSE),0)","v":0},"lb/gal"]
["Brine loading rate","brine_load",{"$f":"IF(AND(regen_type=1,regen_sol=1),VLOOKUP(\"brine_load\",resin_table,resin_type+1,FALSE),0)","v":0},"lb/square ft"]
["Salt needed per vessel","salt_regen",{"$f":"comm_SA*brine_load","v":0},"lbs"]
["Volume of saturated brine needed per vessel","vol_brine_sat",{"$f":"IF(AND(regen_type=1,regen_sol=1),salt_regen/brine_conc_sat,0)","v":0},"gallons"]
["Volume of dilute brine needed per vessel","vol_brine",{"$f":"IF(AND(regen_type=1,regen_sol=1),salt_regen/brine_conc,0)","v":0},"gallons"]
["Salt needed in storage","salt_store",{"$f":"(regen_month*cstore_days/30)*salt_regen*final_num_tanks/(regen_reuse+1)","v":0},"lbs"]
[]
["Sodium Chloride Purchasing"]
["Quantity required for large quantity purchase",null,{"$f":"VLOOKUP(\"Sodium Chloride - Large Qty\",chem_break_table_cl,2,FALSE)","v":3500},"lbs","#N/A indicates that price data do not depend on volume purchased."]
["Quantity required for mid quantity purchase",null,{"$f":"VLOOKUP(\"Sodium Chloride - Mid Qty\",chem_break_table_cl,2,FALSE)","v":3500},"lbs","#N/A indicates that price data do not depend on volume purchased."]
["Quantity required for small quantity purchase",null,{"$f":"VLOOKUP(\"Sodium Chloride - Small Qty\",chem_break_table_cl,2,FALSE)","v":0},"lbs","#N/A indicates that price data do not depend on volume purchased."]
["Purchase Type","salt_purchase",{"$f":"IF(AND(ISNA(C25),ISNA(C26),ISNA(C27)),\"\",IF(salt_store>=C25,\" - Large Qty\",IF(salt_store>=C26,\" - Mid Qty\",\" - Small Qty\")))","v":" - Small Qty"},null,"Returns descriptive term based on volume of each purchase for use in determining pricing. Blank indicates that price data do not depend on volume purchased."]
[]
["Tetrachloroferrate Regeneration"]
["Tetrachloroferrate bed volumes","FeCl4_BV",{"$f":"IF(AND(regen_type=1,regen_sol=2),VLOOKUP(\"FeCl4_BV\",resin_table,resin_type+1,FALSE),0)","v":0},"bed volumes"]
["Volume of tetrachoroferrate per vessel","vol_FeCl4",{"$f":"FeCl4_BV*media_volume_gal","v":0},"gallons"]
["Molarity of HCl in solution","HCl_M",{"$f":"IF(AND(regen_type=1,regen_sol=2),VLOOKUP(\"HCl_M\",resin_table,resin_type+1,FALSE),0)","v":0},"M"]
["Molarity of FeCl3 in solution","FeCl3_M",{"$f":"IF(AND(regen_type=1,regen_sol=2),VLOOKUP(\"FeCl3_M\",resin_table,resin_type+1,FALSE),0)","v":0},"M"]
["HCl specific gravity","HCl_sg",{"$f":"VLOOKUP(HCl_pct,hcl_table_cl,2)","v":1.1789000000000001},"kg/L"]
["HCl required for tetrachloroferrate solution","HCl_in_solution",{"$f":"HCl_M/(HCl_pct*1000*HCl_sg/HCl_mw)*vol_FeCl4","v":0},"gallons"]
["FeCl3 required","FeCl3_in_solution",{"$f":"FeCl3_M*FeCl3_mw*vol_FeCl4*3.785/453.59","v":0},"lbs"]
["FeCl3 needed in storage","FeCl3_store",{"$f":"MAX(FeCl3_in_solution,(regen_month*cstore_days/30)*FeCl3_in_solution*final_num_tanks/(regen_reuse+1))","v":0},"lbs"]
["Molarity of dilute HCl rinse","dil_HCl_M",{"$f":"IF(AND(regen_type=1,regen_sol=2),VLOOKUP(\"dil_HCl_M\",resin_table,resin_type+1,FALSE),0)","v":0},"M"]
["HCl rinse bed volumes","HCl_BV",{"$f":"IF(AND(regen_type=1,regen_sol=2),VLOOKUP(\"HCl_BV\",resin_table,resin_type+1,FALSE),0)","v":0},"bed volumes"]
["HCl rinse volume per vessel","HCl_rinse_vol",{"$f":"HCl_BV*media_volume_gal","v":0},"gallons"]
["HCl required for rinse","HCl_in_rinse",{"$f":"dil_HCl_M/(HCl_pct*1000*HCl_sg/HCl_mw)*HCl_rinse_vol","v":0},"gallons"]
["HCl rinse time","HCl_rinse_time",{"$f":"HCl_rinse_vol/(comm_SA*comm_load_rate)","v":0},"minutes","Assumes rinse rate = design loading rate"]
["HCl metering rate for rinse","HCl_to_rinse_gph",{"$f":"IF(HCl_rinse_time=0,0,HCl_in_rinse/HCl_rinse_time)*60","v":0},"gph"]
[]
["Backwash and water rinse"]
["Backwash rate (gpm)","water_flush",{"$f":"ROUND(h2oflush_backwash_rate*comm_SA,0)","v":1020},"gpm"]
["Backwash volume","waterflush_vol",{"$f":"water_flush*backwash_time","v":12240},"gallons"]
["Brine dilution water","brine_dilution_vol",{"$f":"vol_brine-vol_brine_sat","v":0},"gallons"]
["Brine dilution water flow","brine_dilution_gpm",{"$f":"brine_dilution_vol/time_regen","v":0},"gpm"]
["Water rinse bed volumes","rinse_BV",{"$f":"IF(regen_type=1,VLOOKUP(\"rinse_BV\",resin_table,resin_type+1,FALSE),0)","v":0},"bed volumes"]
["Water rinse volume","rinse_vol",{"$f":"media_volume_gal*rinse_BV","v":0},"gallons"]
["Water rinse time","rinse_time",{"$f":"rinse_vol/(comm_SA*rinse_rate)","v":0},"minutes"]
["Water rinse rate (gpm)","rinse_gpm",{"$f":"IF(rinse_time=0,0,rinse_vol/rinse_time)","v":0},"gpm"]
["HCl dilution water","dilution_vol",{"$f":"HCl_rinse_vol-HCl_in_rinse","v":0},"gallons"]
["HCl dilution water rate (gpm)","dilution_gpm",{"$f":"IF(HCl_rinse_time=0,0,HCl_rinse_vol/HCl_rinse_time)","v":0},"gpm"]
["Total water volume","total_backwash",{"$f":"waterflush_vol+rinse_vol+dilution_vol+brine_dilution_vol","v":12240},"gallons"]
["Backwashes per year per vessel",null,{"$f":"365/regen_days+IF(add_backwash_freq=0,0,365/add_backwash_freq)","v":0.69066227889757292},"backwash per year"]
["Total number of backwashes per year (all vessels)",null,{"$f":"C58*final_num_tanks","v":20.719868366927187},"backwash per year","Number of backwash events per year for all vessels includes redundancy"]
[]
["Regenerant Use"]
["Volume of regenerant","vol_regen",{"$f":"IF(regen_type=1,CHOOSE(regen_sol,vol_brine,vol_FeCl4),0)","v":0},"gallons"]
["Regenerant loading rate","regen_rate",{"$f":"vol_regen/(time_regen*comm_SA)","v":0},"gpm/square ft"]
["Regeneration per vessel frequency","regen_days",{"$f":"((num_treat_lines*media_volume_gal*BV_regen)/(average_flow*1000000))","v":528.47826086956525},"days","Using average flow"]
["Time between regenerations","regen_freq",{"$f":"regen_days/final_num_tanks*24*60","v":25366.956521739132},"minutes","Assumes staggered regeneration"]
["Number of regeneration washes per month","regen_month",{"$f":"30/regen_days","v":5.6766762649115586E-2},"washes/vessel/month"]
["Regeneration downtime","regeneration_downtime",{"$f":"backwash_time+rinse_time+time_regen+HCl_rinse_time","v":33},"minutes"]
["Total days for full regeneration","total_downtime",{"$f":"regeneration_downtime*final_num_tanks/(24*60)","v":0.6875},"days"]
["Number of vessels regenerated at a time","regen_redun",{"$f":"ROUNDUP(total_downtime/regen_days,0)","v":1}]
[]
["Regenerant Mixing Tanks"]
["Volume required","mix_tank_vol_tot",{"$f":"IF(OR(regen_type=2,brine_method=2),0,IF(regen_sol=1,vol_brine_sat,vol_regen))","v":0},"gallons"]
["Maximum chemical storage tank size","max_chem_tank_size",{"$f":"MAX(VLOOKUP(10^6,pl_cst_cost_cl,1)-1,VLOOKUP(10^6,fg_cst_cost_cl,1)-1,VLOOKUP(10^6,ss_cst_cost_cl,1)-1)","v":30000},"gallons","The largest size for which costs are available."]
["Mixing tanks","mix_tanks",{"$f":"IF(OR(regen_type=2,brine_method=2),0,IF(mix_tank_vol_tot>max_chem_tank_size,ROUNDUP(mix_tank_vol_tot/max_chem_tank_size,0)*regen_redun,regen_redun))","v":0},"units"]
["Mixing tank volume","mix_tank_vol",{"$f":"IF(mix_tanks=0,0,mix_tank_vol_tot*regen_redun/mix_tanks)","v":0},"gallons"]
["Number of mixers","mixers",{"$f":"mix_tanks","v":0},"units"]
[]
["Salt Saturators (brine only)"]
["Maximum size of salt saturator","max_saltbox",{"$f":"MAX(VLOOKUP(10^6,fg_saltbox_cost_cl,1)-0.1,VLOOKUP(10^6,pl_saltbox_cost_cl,1)-0.1)","v":80},"tons","The largest size for which costs are available."]
["Salt saturator size needed","salt_box_need",{"$f":"IF(salt_store/cstore_days/2000>=min_saltbox,salt_store/cstore_days/2000,IF(salt_store/(cstore_days/7)/2000>=min_saltbox,salt_store/(cstore_days/7)/2000,salt_store/(cstore_days/30)/2000))","v":0},"tons","Provides one day, one week, or one month of storage, depending on quantity needed"]
["Days of storage provided by salt saturator","salt_box_days",{"$f":"IF(salt_store/cstore_days/2000>=min_saltbox,1,IF(salt_store/(cstore_days/7)/2000>=min_saltbox,7,30))","v":30},"days"]
["Additional salt storage needed","add_salt_store",{"$f":"IF(cstore_days-salt_box_days>0,cstore_days-salt_box_days,0)","v":0},"days","Additonal storage to total at least as many days supply onsite as specified in CDAs"]
["Number of salt saturators","num_salt_box",{"$f":"IF(AND(regen_type=1,regen_sol=1,brine_method=2),ROUNDUP(salt_box_need/max_saltbox,0),0)","v":0},"units"]
["Salt saturator size","salt_box_size",{"$f":"IF(AND(regen_type=1,regen_sol=1,brine_method=2),IF(ROUNDUP(salt_box_need/num_salt_box,0)<min_saltbox,min_saltbox,ROUNDUP(salt_box_need/num_salt_box,0)),0)","v":0},"tons"]
[]
["Eductors (brine only)"]
["Maximum eductor size","max_eductor_size",{"$f":"VLOOKUP(10^6,eductor_size_table_cl,1)","v":53.5},"gpm","The largest size for which costs are available."]
["Number of eductors","eductors",{"$f":"IF(regen_type=2,0,IF(regen_sol=1,IF(brine_method=1,mix_tanks,num_salt_box),0))","v":0},"units"]
[]
["HCl tanks (tetrachloroferrate only)"]
["Total HCl volume required","total_HCl",{"$f":"(HCl_in_solution+HCl_in_rinse)*regen_redun*regen_month*cstore_days/30","v":0},"gallons"]
["Maximum chemical storage tank size excluding stainless steel","max_chem_tank_size_noSS",{"$f":"MAX(VLOOKUP(10^6,pl_cst_cost_cl,1)-1,VLOOKUP(10^6,fg_cst_cost_cl,1)-1)","v":30000},"gallons","The largest size for which costs are available (not including stainless, which is not compatible with hydrochloric acid)"]
["HCl tanks","HCl_tanks",{"$f":"IF(total_HCl=0,0,ROUNDUP(total_HCl/max_chem_tank_size_noSS,0))","v":0},"units"]
["HCl tank volume","HCl_tank_vol",{"$f":"IF(total_HCl=0,0,ROUNDUP(total_HCl/HCl_tanks,0))","v":0},"gallons"]
["HCl density","HCl_dens",{"$f":"VLOOKUP(HCl_pct,hcl_table_cl,4)","v":3.5419999999999998},"lbs/gal"]
["Total HCl in lbs needed in storage","total_HCl_lbs",{"$f":"total_HCl*C95","v":0},"lbs"]
[]
["Hydrochloric Acid Purchasing"]
["Quantity required for large quantity purchase",null,{"$f":"VLOOKUP(\"Hydrochloric Acid - Large Qty\",chem_break_table_cl,2,FALSE)","v":{"$error":"#N/A"}},"lbs","#N/A indicates that price data do not depend on volume purchased."]
["Quantity required for mid quantity purchase",null,{"$f":"VLOOKUP(\"Hydrochloric Acid- Mid Qty\",chem_break_table_cl,2,FALSE)","v":{"$error":"#N/A"}},"lbs","#N/A indicates that price data do not depend on volume purchased."]
["Quantity required for small quantity purchase",null,{"$f":"VLOOKUP(\"Hydrochloric Acid - Small Qty\",chem_break_table_cl,2,FALSE)","v":{"$error":"#N/A"}},"lbs","#N/A indicates that price data do not depend on volume purchased."]
["Purchase Type","HCl_purchase",{"$f":"IF(AND(ISNA(C99),ISNA(C100),ISNA(C101)),\"\",IF(total_HCl_lbs>=C99,\" - Large Qty\",IF(total_HCl_lbs>=C100,\" - Mid Qty\",\" - Small Qty\")))","v":""},null,"Returns descriptive term based on volume of each purchase for use in determining pricing. Blank indicates that price data do not depend on volume purchased."]
[]
["To Fill Mixing Tanks (tetrachloroferrate only)"]
["Fill time","fill_time",{"$f":"IF(AND(regen_type=1,regen_sol=2),regen_freq-regeneration_downtime,\"NA\")","v":"NA"},"minutes"]
["HCl fill rate","HCl_fill_rate",{"$f":"IF(HCl_in_solution=0,0,HCl_in_solution/fill_time*(1+FeCl4_safety_factor))","v":0},"gpm"]
["FeCl3 fill rate (lbs/min)","FeCl3_fill_rate",{"$f":"IF(FeCl3_in_solution=0,0,FeCl3_in_solution/fill_time/mix_tanks*(1+FeCl4_safety_factor))","v":0},"lbs/min"]
["FeCl3 fill rate (cfm)","FeCl3_fill_cfm",{"$f":"FeCl3_fill_rate/FeCl3_dens","v":0},"cfm"]
["Number of gravimetric dry feeders per mix tank","grav_per",{"$f":"IF(FeCl3_fill_rate=0,0,ROUNDUP(FeCl3_fill_rate/max_grav_size,0))","v":0},"units"]
["Total gravimetric dry feeders","num_grav",{"$f":"grav_per*mix_tanks","v":0},"units"]
["Gravimetric dry feeder rating","grav_feed_rate",{"$f":"IF(grav_per=0,0,FeCl3_fill_rate/grav_per)","v":0},"lbs/min"]
["Number of volumetric dry feeders per mix tank","vol_per",{"$f":"IF(FeCl3_fill_cfm=0,0,ROUNDUP(FeCl3_fill_cfm/max_vol_size,0))","v":0},"units"]
["Total volumetric dry feeders","num_vol",{"$f":"vol_per*mix_tanks","v":0},"units"]
["Volumetric dry feeder rating","vol_feed_rate",{"$f":"IF(vol_per=0,0,FeCl3_fill_cfm/vol_per)","v":0},"cfm"]
[]
["Backwash tanks"]
["Maximum backwash tank size","max_back_tank_size",{"$f":"MAX(VLOOKUP(10^6,st_bwt_cost_cl,1)-1,VLOOKUP(10^6,fg_bwt_cost_cl,1)-1,VLOOKUP(10^6,hdpe_bwt_cost_cl,1)-1)","v":282094},"gallons","The largest size for which costs are available."]
["Backwash tanks","back_tanks",{"$f":"IF(no_back_tank=1,0,ROUNDUP(total_backwash/max_back_tank_size,0))","v":0},"units"]
["Backwash tank volume","back_tank_vol",{"$f":"IF(total_backwash=0,0,IF(back_tanks=0,0,total_backwash/back_tanks))","v":0},"gal"]
[]
["Secondary Containment for HCl Tanks"]
["Minimum volume required","hcl_cont_volume",{"$f":"MAX(HCl_tanks*HCl_tank_vol*sec_cont_pct_of_total,HCl_tank_vol*sec_cont_pct_of_largest)/7.48","v":0},"cubic feet","7.48 converts gallons to cubic feet"]
["Footprint available","hcl_cont_fp",{"$f":"IF(HCl_tanks=0,0,acid_tank_fp-HCl_tanks*PI()*(at_diam/2)^2)","v":0},"square feet","Total footprint minus displacement by tanks themselves"]
["Curb height required","hcl_curb_height",{"$f":"IF(HCl_tanks=0,0,hcl_cont_volume/hcl_cont_fp+sec_cont_freeboard/12)","v":0},"feet"]
["Curb thickness","hcl_curb_thick",{"$f":"IF(HCl_tanks=0,0,MIN(sec_cont_max_thick,hcl_curb_height))","v":0},"feet"]
["Curb length (long side)","hcl_curb_len_long",{"$f":"IF(HCl_tanks=0,0,HCl_tanks*at_diam+2*space_at+(HCl_tanks-1)*space_at+2*hcl_curb_thick)","v":0},"feet"]
["Curb length (short side)","hcl_curb_len_short",{"$f":"IF(HCl_tanks=0,0,at_diam+2*space_at)","v":0},"feet"]
["Curb concrete volume","hcl_curb_concrete",{"$f":"IF(HCl_tanks=0,0,ROUNDUP((hcl_curb_len_long*2+hcl_curb_len_short*2)*hcl_curb_height*hcl_curb_thick/27,0))","v":0},"cubic yards","27 converts cubic feet to cubic yards"]
["Chemical resistant coating required","hcl_coating_gal",{"$f":"IF(HCl_tanks=0,0,ROUNDUP((acid_tank_fp+2*(hcl_curb_len_long-2*hcl_curb_thick)*hcl_curb_height+2*hcl_curb_len_short*hcl_curb_height)/sec_cont_coating_cvg,0))","v":0},"gallons","Covers total footprint plus inside surface and top of curbs"]
[]
["Secondary Containment for Regenerant Mixing Tanks"]
["Minimum volume required","mix_cont_volume",{"$f":"MAX(mix_tanks*mix_tank_vol*sec_cont_pct_of_total,mix_tank_vol*sec_cont_pct_of_largest)/7.48","v":0},"cubic feet","7.48 converts gallons to cubic feet"]
["Footprint available","mix_cont_fp",{"$f":"IF(mix_tanks=0,0,mix_tank_fp-mix_tanks*PI()*(mx_diam/2)^2)","v":0},"square feet","Total footprint minus displacement by tanks themselves"]
["Curb height required","mix_curb_height",{"$f":"IF(mix_tanks=0,0,mix_cont_volume/mix_cont_fp+sec_cont_freeboard/12)","v":0},"feet"]
["Curb thickness","mix_curb_thick",{"$f":"IF(mix_tanks=0,0,MIN(sec_cont_max_thick,mix_curb_height))","v":0},"feet"]
["Curb length (long side)","mix_curb_len_long",{"$f":"IF(mix_tanks=0,0,mix_tanks*mx_diam+2*space_st+(mix_tanks-1)*space_st+2*mix_curb_thick)","v":0},"feet"]
["Curb length (short side)","mix_curb_len_short",{"$f":"IF(mix_tanks=0,0,mx_diam+2*space_st)","v":0},"feet"]
["Curb concrete volume","mix_curb_concrete",{"$f":"IF(mix_tanks=0,0,ROUNDUP((mix_curb_len_long*2+mix_curb_len_short*2)*mix_curb_height*mix_curb_thick/27,0))","v":0},"cubic yards","27 converts cubic feet to cubic yards"]
["Chemical resistant coating required","mix_coating_gal",{"$f":"IF(mix_tanks=0,0,ROUNDUP((mix_tank_fp+2*(mix_curb_len_long-2*mix_curb_thick)*mix_curb_height+2*mix_curb_len_short*mix_curb_height)/sec_cont_coating_cvg,0))","v":0},"gallons","Covers total footprint plus inside surface and top of curbs"]

{"sheet":"pH Adjust","index":9,"n_rows":86,"n_cols":5,"rows_kept":86,"cut":false,"hidden":false,"merged":[]}
["Adjusting pH and alkalinity of finished water"]
[]
["Calculation","Range Name","Value","Units","Guidance"]
["pH Adjustment Chemistry"]
["Ionic strength (I)","I_ion_str",{"$f":"TDS_I/40000","v":5.0000000000000001E-3},"mol/L","40,000 converts TDS to ionic strength, Equation 4, Trussell 1998"]
["Temperature variance from 25 degrees centigrade","t_minus25",{"$f":"t_I-25","v":-15},"degrees C","For use in Equation S14, Trussell 1998"]
["Dielectric constant (D)","D_dielectric",{"$f":"78.54*(1-0.004579*t_minus25+0.0000119*t_minus25^2+0.000000028*t_minus25^3)","v":84.137388720000004},null,"Equation S14, Trussell 1998"]
["Temperature in degrees Kelvin","T_K",{"$f":"t_I+273","v":283},"degrees K","273 converts degrees C to degrees K"]
["Limiting theoretical slope (A)","A_slope_lim",{"$f":"1290000*(SQRT(2)/(D_dielectric*T_K)^1.5)","v":0.49652544704237711},null,"Equation S13, Trussell 1998"]
["Monovalent activity coefficient (-log form)","log_gamma_1",{"$f":"A_slope_lim*1^2*(SQRT(I_ion_str)/(1+SQRT(I_ion_str))-0.3*I_ion_str)","v":3.2046190551368897E-2},null,"Modified Davies equation, Equation S12, Trussell 1998"]
["Divalent activity coefficient (-log form)","log_gamma_2",{"$f":"A_slope_lim*2^2*(SQRT(I_ion_str)/(1+SQRT(I_ion_str))-0.3*I_ion_str)","v":0.12818476220547559},null,"Modified Davies equation, Equation S12, Trussell 1998"]
["Monovalent activity coefficient (ɣ1)","gamma_1",{"$f":"10^-log_gamma_1","v":0.92886758932889413}]
["Divalent activity coefficient (ɣ2)","gamma_2",{"$f":"10^-log_gamma_2","v":0.74441520944640127}]
["Equilibrium constant for carbonic acid (H2CO3) (-log form)","pK_1",{"$f":"a1_K1+a2_K1/T_K+a3_K1*LOG10(T_K)+a4_K1*T_K+a5_K1/T_K^2","v":6.4766411440902338}]
["Equilibrium constant for bicarbonate (HCO3-) (-log form)","pK_2",{"$f":"a1_K2+a2_K2/T_K+a3_K2*LOG10(T_K)+a4_K2*T_K+a5_K2/T_K^2","v":10.488538243033085}]
["Equilibrium constant for water (H2O) (-log form)","pK_w",{"$f":"a1_Kw+a2_Kw/T_K+a3_Kw*LOG10(T_K)+a4_Kw*T_K+a5_Kw/T_K^2","v":14.538566572438164}]
["Equilibrium constant for carbonic acid (H2CO3) (K1)","K_1",{"$f":"10^-pK_1","v":3.3370203562126103E-7}]
["Equilibrium constant for bicarbonate (HCO3-) (K2)","K_2",{"$f":"10^-pK_2","v":3.2468464988066683E-11}]
["Equilibrium constant for water (H2O) (Kw)","K_w",{"$f":"10^-pK_w","v":2.8935662320507785E-15}]
["Intermediate calculation","term1_i",{"$f":"gamma_1*10^-pHo/K_1","v":0.27835238931030171},null,"ɣ110-pH / K1"]
["Intermediate calculation","term2_i",{"$f":"(gamma_1*K_2)/(gamma_2*10^-pHo)","v":4.0513552678623203E-4},null,"ɣ1K2 / ɣ210-pH"]
["Intermediate calculation","term3_i",{"$f":"alk_I/50000","v":5.0000000000000001E-4},"eq/L","Alk / 50,000 (where 50,000 converts mg/L to eq/L)"]
["Intermediate calculation","term4_i",{"$f":"K_w/(gamma_1*10^-pHo)","v":3.1151546951286968E-8},null,"Kw / ɣ110-pH"]
["Intermediate calculation","term5_i",{"$f":"10^-pHo/gamma_1","v":1.0765797100558745E-7},null,"10-pH / ɣ1"]
["Intermediate calculation","term6_i",{"$f":"(2*K_2*gamma_1)/(gamma_2*10^-pHo)","v":8.1027105357246406E-4},null,"2K2ɣ1 / ɣ210-pH"]
["Initial total inorganic carbon (CT)","C_T_i",{"$f":"(1+term1_i+term2_i)*((term3_i-term4_i+term5_i)/(1+term6_i))","v":6.3895886571069282E-4},"mol/L","Equation 15, Najm 2001"]
["Intermediate calculation","term1_f",{"$f":"(2*K_2*gamma_1)/(gamma_2*10^-pHf)","v":1.2841930768552922E-2},null,"2K2ɣ1 / ɣ210-pH"]
["Intermediate calculation","term2_f",{"$f":"(gamma_1*10^-pHf)/K_1","v":1.7562848438894489E-2},null,"ɣ110-pH / K1"]
["Intermediate calculation","term3_f",{"$f":"(gamma_1*K_2)/(gamma_2*10^-pHf)","v":6.4209653842764612E-3},null,"ɣ1K2 / ɣ210-pH"]
["Intermediate calculation","term4_f",{"$f":"K_w/(gamma_1*10^-pHf)","v":4.9371874697727459E-7},null,"Kw / ɣ110-pH"]
["Intermediate calculation","term5_f",{"$f":"10^-pHf/gamma_1","v":6.7927587497811107E-9},null,"10-pH / ɣ1"]
["Treated water alkalinity","alk_f",{"$f":"50000*((C_T_i*(1+term1_f))/(1+term2_f+term3_f)+term4_f-term5_f)","v":31.624666660523044},"mg/L as CaCO3","Equation 17, Najm 2001, where 50,000 converts eq/L to mg/L"]
["Hydroxide (OH-) required","OH_tot",{"$f":"(alk_f-alk_I)/50000","v":1.3249333321046087E-4},"mol/L","Equation 20, Najm 2001, where 50,000 converts from mg/L to mol/L"]
[]
["Chemical Usage"]
["NaOH required to raise alkalinity and pH","NaOH_tot",{"$f":"IF(pH_adj=\"yes\",39.997*OH_tot*1000,0)","v":0},"mg/L","39.997 is molar mass of NaOH in g/mol, 1,000 converts g to mg"]
["NaOH concentration in lbs/gal","caustic_conc_lb",{"$f":"VLOOKUP(NaOH_pct,NaOH_table_cl,2)","v":6.3639999999999999},"lbs/gal"]
["Pounds of pure NaOH needed per day","lb_NaOH_day",{"$f":"1000000*3.7854*NaOH_tot*2.2*average_flow/1000000","v":0},"lbs"]
["Pounds of pure NaOH needed in storage","lb_NaOH_store",{"$f":"ROUNDUP(lb_NaOH_day*cstore_days,0)","v":0},"lbs"]
["Gallons of NaOH needed per day","gal_NaOH_day",{"$f":"lb_NaOH_day/caustic_conc_lb","v":0},"gal"]
["Gallons of NaOH needed in storage","gal_NaOH_store",{"$f":"ROUNDUP(lb_NaOH_store/caustic_conc_lb,0)","v":0},"gal"]
["Max NaOH flow (based on design flow)","des_NaOH_flow",{"$f":"gal_NaOH_day/24*design_flow/average_flow","v":0},"gph"]
["NaOH solution specific gravity","NaOH_spgr",{"$f":"VLOOKUP(NaOH_pct,NaOH_table_cl,4)","v":1.5249999999999999}]
["Total weight of bulk NaOH solution in storage","NaOH_lbs",{"$f":"IF(gal_NaOH_store=0,0,ROUNDUP(gal_NaOH_store*NaOH_spgr*8.345,0))","v":0},"lbs"]
[]
["NaOH tanks"]
["NaOH tanks","NaOH_tanks",{"$f":"IF(gal_NaOH_store=0,0,ROUNDUP(gal_NaOH_store/max_chem_tank_size,0))","v":0},"units"]
["NaOH tank volume","NaOH_tank_vol",{"$f":"IF(gal_NaOH_store=0,0,ROUNDUP(gal_NaOH_store/NaOH_tanks,0))","v":0},"gallons"]
["Day tank storage volume required (based on design flow)","NaOH_day_tank_vol_needed",{"$f":"1000000*3.7854*NaOH_tot*2.2*design_flow/1000000/caustic_conc_lb","v":0},"gallons"]
["Number of day tanks","NaOH_day_tanks",{"$f":"IF(NaOH_day_tank_vol_needed<day_tank_needed,0,ROUNDUP(NaOH_day_tank_vol_needed/max_chem_tank_size,0))","v":0},"units"]
["Volume of day tanks","NaOH_day_tank_vol",{"$f":"IF(NaOH_day_tanks=0,0,ROUNDUP(NaOH_day_tank_vol_needed/NaOH_day_tanks,0))","v":0},"gallons"]
[]
["Sodium Hydroxide Purchasing"]
["Quantity required for large quantity purchase",null,{"$f":"VLOOKUP(\"Sodium Hydroxide - Large Qty\",chem_break_table_cl,2,FALSE)","v":25228.5},"lbs","#N/A indicates that price data do not depend on volume purchased."]
["Quantity required for mid quantity purchase",null,{"$f":"VLOOKUP(\"Sodium Hydroxide - Mid Qty\",chem_break_table_cl,2,FALSE)","v":12751.75},"lbs","#N/A indicates that price data do not depend on volume purchased."]
["Quantity required for small quantity purchase",null,{"$f":"VLOOKUP(\"Sodium Hydroxide - Small Qty\",chem_break_table_cl,2,FALSE)","v":0},"lbs","#N/A indicates that price data do not depend on volume purchased."]
["Purchase Type","NaOH_purchase",{"$f":"IF(AND(ISNA(C54),ISNA(C55),ISNA(C56)),\"\",IF(NaOH_lbs>=C54,\" - Large Qty\",IF(NaOH_lbs>=C55,\" - Mid Qty\",\" - Small Qty\")))","v":" - Small Qty"},null,"Returns descriptive term based on volume of each purchase for use in determining pricing. Blank indicates that price data do not depend on volume purchased."]
[]
["Mixers"]
["Maximum chemical tank mixer horsepower","cmix_hp_max",{"$f":"MAX(VLOOKUP(10^6,port_mix_cost_cl,1)-0.1,VLOOKUP(10^6,mount_mix_cost_cl,1)-0.1,VLOOKUP(10^6,imp_mix_cost_cl,1)-0.1)","v":20},"hp"]
["Mixers per storage tank","cmix_per_tank",{"$f":"IF(AND(include_cmix=1,NaOH_tanks<>0),ROUNDUP(NaOH_tank_vol/1000*cmix_hp_per/cmix_hp_max,0),0)","v":0},"units"]
["Number of storage tank mixers","cmixers",{"$f":"NaOH_tanks*cmix_per_tank","v":0},"units"]
["Mixer size for storage tanks","cmix_size",{"$f":"IF(cmixers<>0,MAX(min_cmix_hp,NaOH_tank_vol/1000*cmix_hp_per/cmix_per_tank),0)","v":0},"hp"]
["Mixers per day tank","dmix_per_tank",{"$f":"IF(AND(include_cmix=1,NaOH_day_tanks<>0),ROUNDUP(NaOH_day_tank_vol/1000*cmix_hp_per/cmix_hp_max,0),0)","v":0},"units"]
["Number of day tank mixers","dmixers",{"$f":"NaOH_day_tanks*dmix_per_tank","v":0},"units"]
["Mixer size for day tanks","dmix_size",{"$f":"IF(dmixers<>0,MAX(min_cmix_hp,NaOH_day_tank_vol/1000*cmix_hp_per/dmix_per_tank),0)","v":0},"hp"]
[]
["Secondary Containment for NaOH Storage Tanks"]
["Minimum volume required","ct_cont_volume",{"$f":"MAX(NaOH_tanks*NaOH_tank_vol*sec_cont_pct_of_total,NaOH_tank_vol*sec_cont_pct_of_largest)/7.48","v":0},"cubic feet","7.48 converts gallons to cubic feet"]
["Footprint available","ct_cont_fp",{"$f":"IF(NaOH_tanks=0,0,NaOH_tank_fp-NaOH_tanks*PI()*(NaOHtank_diam/2)^2)","v":0},"square feet","Total footprint minus displacement by tanks themselves"]
["Curb height required","ct_curb_height",{"$f":"IF(NaOH_tanks=0,0,ct_cont_volume/ct_cont_fp+sec_cont_freeboard/12)","v":0},"feet"]
["Curb thickness","ct_curb_thick",{"$f":"IF(NaOH_tanks=0,0,MIN(sec_cont_max_thick,ct_curb_height))","v":0},"feet"]
["Curb length (long side)","ct_curb_len_long",{"$f":"IF(NaOH_tanks=0,0,NaOH_tanks*NaOHtank_diam+2*space_NaOHtank+(NaOH_tanks-1)*space_NaOHtank+2*ct_curb_thick)","v":0},"feet"]
["Curb length (short side)","ct_curb_len_short",{"$f":"IF(NaOH_tanks=0,0,NaOHtank_diam+2*space_NaOHtank)","v":0},"feet"]
["Curb concrete volume","ct_curb_concrete",{"$f":"IF(NaOH_tanks=0,0,ROUNDUP((ct_curb_len_long*2+ct_curb_len_short*2)*ct_curb_height*ct_curb_thick/27,0))","v":0},"cubic yards","27 converts cubic feet to cubic yards"]
["Chemical resistant coating required","ct_coating_gal",{"$f":"IF(NaOH_tanks=0,0,ROUNDUP((NaOH_tank_fp+2*(ct_curb_len_long-2*ct_curb_thick)*ct_curb_height+2*ct_curb_len_short*ct_curb_height)/sec_cont_coating_cvg,0))","v":0},"gallons","Covers total footprint plus inside surface and top of curbs"]
[]
["Secondary Containment for NaOH Day Tanks"]
["Minimum volume required","dt_cont_volume",{"$f":"MAX(NaOH_day_tanks*NaOH_day_tank_vol*sec_cont_pct_of_total,NaOH_day_tank_vol*sec_cont_pct_of_largest)/7.48","v":0},"cubic feet","7.48 converts gallons to cubic feet"]
["Footprint available","dt_cont_fp",{"$f":"IF(NaOH_day_tanks=0,0,NaOHday_tank_fp-NaOH_day_tanks*PI()*(NaOHdaytank_diam/2)^2)","v":0},"square feet","Total footprint minus displacement by tanks themselves"]
["Curb height required","dt_curb_height",{"$f":"IF(NaOH_day_tanks=0,0,dt_cont_volume/dt_cont_fp+sec_cont_freeboard/12)","v":0},"feet"]
["Curb thickness","dt_curb_thick",{"$f":"IF(NaOH_day_tanks=0,0,MIN(sec_cont_max_thick,dt_curb_height))","v":0},"feet"]
["Curb length (long side)","dt_curb_len_long",{"$f":"IF(NaOH_day_tanks=0,0,NaOH_day_tanks*NaOHdaytank_diam+2*space_NaOHdaytank+(NaOH_day_tanks-1)*space_NaOHdaytank+2*dt_curb_thick)","v":0},"feet"]
["Curb length (short side)","dt_curb_len_short",{"$f":"IF(NaOH_day_tanks=0,0,NaOHdaytank_diam+2*space_NaOHdaytank)","v":0},"feet"]
["Curb concrete volume","dt_curb_concrete",{"$f":"IF(NaOH_day_tanks=0,0,ROUNDUP((dt_curb_len_long*2+dt_curb_len_short*2)*dt_curb_height*dt_curb_thick/27,0))","v":0},"cubic yards","27 converts cubic feet to cubic yards"]
["Chemical resistant coating required","dt_coating_gal",{"$f":"IF(NaOH_day_tanks=0,0,ROUNDUP((NaOHday_tank_fp+2*(dt_curb_len_long-2*dt_curb_thick)*dt_curb_height+2*dt_curb_len_short*dt_curb_height)/sec_cont_coating_cvg,0))","v":0},"gallons","Covers total footprint plus inside surface and top of curbs"]

{"sheet":"Pumps Pipe Structure","index":10,"n_rows":100,"n_cols":5,"rows_kept":100,"cut":false,"hidden":false,"merged":[]}
["Pumps, Piping, and Structure Calculations"]
[]
["Calculation","Range Name","Value","Units","Guidance"]
["Pump Design"]
["Flow of each booster pump","pump_rating",{"$f":"IF(lines_pump_I=\"\",IF(ss_cat2=1,0,MIN(MAX(average_flow_rate+bp_flow_rate*average_flow_rate/design_flow_rate,(design_flow_rate+bp_flow_rate)/2)*(1+pump_safety_factor),max_pump_size)),IF(lines_pump_I=0,0,(design_flow_rate+bp_flow_rate)*(1+pump_safety_factor)/lines_pump_I))","v":10000},"gpm","Includes safety factor"]
["Maximum pump size","max_pump_size",{"$f":"VLOOKUP(10^6,pump_cost_cl,1)-1","v":10000},"gpm","The largest pump size for which costs are available.  For booster pumps, will override lines per pump input, if this input results in pumps that are too large."]
["Number of booster pumps","booster_pumps",{"$f":"IF(pump_rating=0,0,ROUNDUP((design_flow_rate+bp_flow_rate)*(1+pump_safety_factor)/pump_rating,0))","v":7},"units"]
["Total booster pumps","total_booster_pumps",{"$f":"IF(booster_pumps=0,0,booster_pumps+NRD_pumps)","v":7},"units"]
["Maximum required backwash pump flow","max_back_flow",{"$f":"MAX(water_flush,rinse_gpm,dilution_gpm)","v":1020},"gpm"]
["Number of backwash pumps","backwash_pumps",{"$f":"IF(OR(no_backwash=1,max_back_flow=0),0,ROUNDUP(max_back_flow*(1+pump_safety_factor)/max_pump_size,0)+NRD_back_pumps)","v":2},"pumps","Includes one pump for redundancy"]
["Backwash pump rating","back_pump_rating",{"$f":"IF(backwash_pumps=0,0,max_back_flow*(1+pump_safety_factor)/(backwash_pumps-NRD_back_pumps))","v":1275},"gpm","Includes safety factor"]
[]
["Additional pumps for tetrachloroferrate regeneneration"]
["Regenerant flow rate","regen_flow",{"$f":"vol_regen/time_regen","v":0},"gpm"]
["Maximum chemical pump size","max_chem_pump_size",{"$f":"VLOOKUP(10^6,chem_pump_cost_cl,1)-0.01","v":30000},"gph","The largest size for which costs are available.  Applies to chemical pumps for regeneration."]
["Regenerant pumps","regen_pumps",{"$f":"IF(OR(regen_sol=1,regen_type=2),0,ROUNDUP(regen_flow*(1+pump_safety_factor)/max_pump_size,0)+NRD_regen_pumps)","v":0},"pumps","Includes one pump for redundancy"]
["Regenerant pump rating","regen_pump_rating",{"$f":"IF(regen_pumps=0,0,regen_flow*(1+pump_safety_factor)/(regen_pumps-NRD_regen_pumps))","v":0},"gpm","Includes safety factor"]
["Maximum chemical metering pump size","max_cm_pump_size",{"$f":"MAX(VLOOKUP(10^6,ss_empump_cost_cl,1)-0.01,VLOOKUP(10^6,ss_mmpump_cost_cl,1)-0.01,VLOOKUP(10^6,pvc_empump_cost_cl,1)-0.01,VLOOKUP(10^6,pvc_mmpump_cost_cl,1)-0.01)","v":360},"gph","The largest pump size for which costs are available."]
["Acid pumps for regenerant mixing","mix_pumps",{"$f":"IF(OR(regen_sol=1,regen_type=2),0,ROUNDUP(HCl_fill_rate*60/max_chem_pump_size,0)+NRD_mix_pumps)","v":0},"pumps","Includes one pump for redundancy"]
["Pump rating for regenerant mixing","mix_pump_rating",{"$f":"IF(mix_pumps=0,0,HCl_fill_rate*60/(mix_pumps-NRD_mix_pumps))","v":0},"gph","Fill rate already includes safety factor"]
["Acid pumps for acid rinse","rinse_pumps",{"$f":"IF(OR(regen_sol=1,regen_type=2),0,ROUNDUP(HCl_to_rinse_gph*(1+pump_safety_factor)/max_chem_pump_size,0)+NRD_rinse_pumps)","v":0},"pumps","Includes one pump for redundancy"]
["Pump rating for acid rinse","rinse_pump_rating",{"$f":"IF(rinse_pumps=0,0,HCl_to_rinse_gph*(1+pump_safety_factor)/(rinse_pumps-NRD_rinse_pumps))","v":0},"gph","Includes safety factor"]
[]
["Additional pumps for pH adjustment"]
["Metering pumps for caustic","pH_pumps",{"$f":"IF(pH_adj=\"yes\",ROUNDUP(des_NaOH_flow*(1+pump_safety_factor)/max_cm_pump_size,0)+NRD_pH_pumps,0)","v":0},"pumps","Includes one pump for redundancy"]
["Metering pump rating for caustic","pH_pump_rating",{"$f":"IF(pH_pumps=0,0,MAX(min_chem_flow,des_NaOH_flow*(1+pump_safety_factor)/(pH_pumps-NRD_pH_pumps)))","v":0},"gph","Includes safety factor"]
[]
["Piping Design"]
["Inlet and outlet pipe length","in_out_pipe_length",{"$f":"2*facil_length","v":340},"linear feet"]
["Process piping length","proc_pipe_length",{"$f":"2*facil_length","v":340},"linear feet"]
["Backwash piping length","back_pipe_length",{"$f":"IF(max_back_flow=0,0,2.5*facil_length)","v":425},"linear feet"]
["Bypass piping length","bp_pipe_length",{"$f":"IF(bp_pct>0,2.5*facil_length,0)","v":0},"linear feet"]
["Brine/Regeneration piping length","brine_pipe_length",{"$f":"IF(regen_type=2,0,facil_length)","v":0},"linear feet"]
["Acid piping length","acid_pipe_length",{"$f":"IF(total_HCl=0,0,facil_length)","v":0},"linear feet","With tetrachloroferrate regeneration only"]
["Caustic piping length","caustic_pipe_length",{"$f":"IF(NaOH_tot=0,0,facil_length)","v":0},"linear feet","With pH adjustment only"]
["Polymer addition pipe length","polymer_pipe_length",{"$f":"IF(polymer_day=0,0,facil_length)","v":0},"linear feet","With residuals polymer addition only"]
["Inlet and outlet pipe flow","in_out_pipe_flow",{"$f":"design_flow_rate+bp_flow_rate","v":52133.333333333336},"gpm"]
["Inlet piping diameter","in_out_pipe_diam",{"$f":"VLOOKUP(in_out_pipe_flow,pipe_size_table_cl,2)","v":36},"inches"]
["Process pipe diameter","proc_pipe_diam",{"$f":"VLOOKUP(flow_per_vessel,pipe_size_table_cl,2)","v":12},"inches"]
["Backwash pipe diameter","back_pipe_diam",{"$f":"IF(max_back_flow=0,0,VLOOKUP(max_back_flow,pipe_size_table_cl,2))","v":8},"inches"]
["Regeneration pipe diameter","brine_pipe_diam",{"$f":"IF(regen_type=2,0,VLOOKUP(regen_flow,pipe_size_table_cl,2))","v":0},"inches"]
["Bypass pipe diameter","bp_pipe_diam",{"$f":"IF(bp_pct>0,VLOOKUP(bp_flow_rate,pipe_size_table_cl,2),0)","v":0},"inches"]
["Acid pipe flow","acid_pipe_flow",{"$f":"MAX(HCl_fill_rate,HCl_to_rinse_gph/60)","v":0},"gpm"]
["Acid pipe diameter","acid_pipe_diam",{"$f":"IF(total_HCl>0,VLOOKUP(acid_pipe_flow,pipe_size_table_cl,2),0)","v":0},"inches"]
["Caustic pipe flow","caustic_pipe_flow",{"$f":"des_NaOH_flow*60","v":0},"gpm"]
["Caustic pipe diameter","caustic_pipe_diam",{"$f":"IF(des_NaOH_flow>0,VLOOKUP(caustic_pipe_flow,pipe_size_table_cl,2),0)","v":0},"inches"]
["Polymer pipe flow","polymer_pipe_flow",{"$f":"polymer_rate/60","v":0},"gpm"]
["Polymer pipe diameter","polymer_pipe_diam",{"$f":"IF(polymer_day=0,0,VLOOKUP(polymer_pipe_flow,pipe_size_table_cl,2))","v":0},"inches"]
[]
["Building Structure"]
["Backwash tank diameter","bt_diam",{"$f":"ROUNDUP(2*(MAX((2*back_tank_vol/7.48/PI())^(1/3),(4*back_tank_vol/7.48/PI()/(Building_height-ceiling_clearance))^(1/2))),0)/2","v":0},"feet"]
["Mixing tank diameter","mx_diam",{"$f":"ROUNDUP(2*(MAX((2*mix_tank_vol/7.48/PI())^(1/3),(4*mix_tank_vol/7.48/PI()/(Building_height-ceiling_clearance))^(1/2))),0)/2","v":0},"feet"]
["Salt saturator diameter","ss_diam",{"$f":"ROUNDUP(VLOOKUP(salt_box_size,saltbox_dim_table_cl,3),0)","v":8},"feet"]
["HCl tank diameter","at_diam",{"$f":"ROUNDUP(2*(MAX((2*HCl_tank_vol/7.48/PI())^(1/3),(4*HCl_tank_vol/7.48/PI()/(Building_height-ceiling_clearance))^(1/2))),0)/2","v":0},"feet"]
["NaOH tank diameter","NaOHtank_diam",{"$f":"ROUNDUP(2*(MAX((2*NaOH_tank_vol/7.48/PI())^(1/3),(4*NaOH_tank_vol/7.48/PI()/(Building_height-ceiling_clearance))^(1/2))),0)/2","v":0},"feet"]
["NaOH day tank diameter","NaOHdaytank_diam",{"$f":"ROUNDUP(2*(MAX((2*NaOH_day_tank_vol/7.48/PI())^(1/3),(4*NaOH_day_tank_vol/7.48/PI()/(Building_height-ceiling_clearance))^(1/2))),0)/2","v":0},"feet"]
["Polymer storage tank diameter","polymer_st_diam",{"$f":"ROUNDUP((2*(polymer_tank_vol/7.48)/PI())^(1/3),0)","v":0},"feet"]
["Residuals holding tank diameter","ht_diam",{"$f":"ROUNDUP(2*(MAX((2*htank_vol/7.48/PI())^(1/3),(4*htank_vol/7.48/PI()/(Building_height-ceiling_clearance))^(1/2))),0)/2","v":0},"feet"]
["Maximum access space per vessel or tank","max_space_vessels",{"$f":"IF(ss_cat2=1,max_space_vessels_pre,max_space_vessels_cust)","v":6},"feet"]
["Access space per vessel","space_vessels",{"$f":"IF(tank_geom=2,max_space_vessels,IF(comm_diam>max_space_vessels,max_space_vessels,comm_diam))","v":6},"feet"]
["Access space per backwash tank","space_bt",{"$f":"IF(bt_diam>max_space_vessels,max_space_vessels,bt_diam)","v":0},"feet"]
["Access space per regenerant mixing tank","space_st",{"$f":"IF(mx_diam>max_space_vessels,max_space_vessels,mx_diam)","v":0},"feet"]
["Access space per salt saturator","space_ss",{"$f":"IF(ss_diam>max_space_vessels,max_space_vessels,ss_diam)","v":6},"feet"]
["Access space per HCl tank","space_at",{"$f":"IF(at_diam>max_space_vessels,max_space_vessels,at_diam)","v":0},"feet"]
["Access space per NaOH tank","space_NaOHtank",{"$f":"IF(NaOHtank_diam>max_space_vessels,max_space_vessels,NaOHtank_diam)","v":0},"feet"]
["Access space per NaOH day tank","space_NaOHdaytank",{"$f":"IF(NaOHdaytank_diam>max_space_vessels,max_space_vessels,NaOHdaytank_diam)","v":0},"feet"]
["Access space per polymer holding tank","space_polymer_st",{"$f":"IF(polymer_st_diam>max_space_vessels,max_space_vessels,polymer_st_diam)","v":0},"feet"]
["Access space per residuals holding tank","space_ht",{"$f":"IF(ht_diam>max_space_vessels,max_space_vessels,ht_diam)","v":0},"feet"]
["Access space per pump","space_pumps",{"$f":"IF(ss_cat2=1,space_pumps_pre,space_pumps_cust)","v":4},"feet"]
["Footprint for vessels (large system assumptions)",null,{"$f":"IF(tank_geom=1,ROUNDUP(((comm_diam+2*space_vessels)^2+(final_num_tanks-1)*(comm_diam+2*space_vessels)*(comm_diam+space_vessels)),0),IF(tank_geom=2,ROUNDUP((comm_diam+2*space_vessels)*(comm_height_length+2*space_vessels)+(final_num_tanks-1)*(comm_height_length+2*space_vessels)*(comm_diam+space_vessels),0)))","v":22356},"square feet"]
["Footprint for vessels (skid mounted small system)",null,{"$f":"IF(tank_geom=1,ROUNDUP(((comm_diam+2*space_vessels)^2+(final_num_tanks-1)*(comm_diam+2*space_vessels)*(comm_diam+space_vessels/2)),0),IF(tank_geom=2,ROUNDUP((comm_diam+2*space_vessels)*(comm_height_length+2*space_vessels)+(final_num_tanks-1)*(comm_height_length+2*space_vessels)*(comm_diam+space_vessels/2),0)))","v":18354},"square feet","Space between skid mounted vessels is reduced, outside access space remains the same"]
["Footprints for vessels","vessel_fp",{"$f":"IF(ss_cat2=1,C71,C70)","v":22356},"square feet"]
["Footprint for backwash tank","back_tank_fp",{"$f":"IF(back_tanks=0,0,ROUNDUP((bt_diam+2*space_bt)^2+(back_tanks-1)*(bt_diam+2*space_bt)*(bt_diam+space_bt),0))","v":0},"square feet"]
["Booster pump footprint",null,{"$f":"IF(total_booster_pumps=0,0,ROUNDUP((VLOOKUP(pump_rating,pump_dim_table_cl,3)+space_pumps)*(VLOOKUP(pump_rating,pump_dim_table_cl,4)+2*space_pumps)+(total_booster_pumps-1)*(VLOOKUP(pump_rating,pump_dim_table_cl,3)+space_pumps)*(VLOOKUP(pump_rating,pump_dim_table_cl,4)+space_pumps),0))","v":905},"square feet"]
["Backwash pump footprint",null,{"$f":"IF(backwash_pumps=0,0,ROUNDUP((VLOOKUP(back_pump_rating,pump_dim_table_cl,3)+space_pumps)*(VLOOKUP(back_pump_rating,pump_dim_table_cl,4)+2*space_pumps)+(backwash_pumps-1)*(VLOOKUP(back_pump_rating,pump_dim_table_cl,3)+space_pumps)*(VLOOKUP(back_pump_rating,pump_dim_table_cl,4)+space_pumps),0))","v":152},"square feet"]
["Residuals pump footprint",null,{"$f":"IF(res_pumps=0,0,ROUNDUP((VLOOKUP(res_pump_rating,pump_dim_table_cl,3)+space_pumps)*(VLOOKUP(res_pump_rating,pump_dim_table_cl,4)+2*space_pumps)+(res_pumps-1)*(VLOOKUP(res_pump_rating,pump_dim_table_cl,3)+space_pumps)*(VLOOKUP(res_pump_rating,pump_dim_table_cl,4)+space_pumps),0))","v":0},"square feet"]
["Residual solids transfer equipment footprint",null,{"$f":"IF(res_transfer_method=1,ROUNDUP(IF(res_transfer_rate<40000,99.152*res_transfer_rate^0.0434,0.8761*res_transfer_rate^0.49),0),0)","v":0},"square feet","If slurry pumps are used"]
["Footprint for pumps","pump_fp",{"$f":"SUM(C74:C77)","v":1057},"square feet"]
["Footprint for regenerant pumps","regen_pump_fp",{"$f":"IF(regen_pumps=0,0,ROUNDUP((VLOOKUP(regen_pump_rating,pump_dim_table_cl,3)+space_pumps)*(VLOOKUP(regen_pump_rating,pump_dim_table_cl,4)+2*space_pumps)+(regen_pumps-1)*(VLOOKUP(regen_pump_rating,pump_dim_table_cl,3)+space_pumps)*(VLOOKUP(regen_pump_rating,pump_dim_table_cl,4)+space_pumps),0))","v":0},"square feet"]
["Footprint for regenerant mixing tanks","mix_tank_fp",{"$f":"IF(mix_tanks=0,0,ROUNDUP((mx_diam+2*space_st)^2+(mix_tanks-1)*(mx_diam+2*space_st)*(mx_diam+space_st),0))","v":0},"square feet"]
["Footprint for salt saturators","saltbox_fp",{"$f":"IF(num_salt_box=0,0,ROUNDUP((VLOOKUP(salt_box_size,saltbox_dim_table_cl,3)+2*space_ss)^2+(num_salt_box-1)*(VLOOKUP(salt_box_size,saltbox_dim_table_cl,3)+2*space_ss)*(VLOOKUP(salt_box_size,saltbox_dim_table_cl,3)+space_ss),0))","v":0},"square feet"]
["Footprint for chemical storage (salt or FeCl3)","store_fp",{"$f":"IF(regen_type=2,0,IF(regen_sol=1,IF(brine_method=1,ROUNDUP(salt_store/salt_density/storage_height,0),ROUNDUP((salt_store*add_salt_store/cstore_days)/salt_density/storage_height,0)),ROUNDUP(FeCl3_store/FeCl3_dens/storage_height,0)))+ROUNDUP(coag_store/coag_density/storage_height,0)","v":0},"square feet","Includes coagulant for holding tanks if used"]
["Footprint for HCl tanks","acid_tank_fp",{"$f":"IF(HCl_tanks=0,0,ROUNDUP((at_diam+2*space_at)^2+(HCl_tanks-1)*(at_diam+2*space_at)*(at_diam+space_at),0))","v":0},"square feet"]
["Footprint for NaOH storage tanks","NaOH_tank_fp",{"$f":"IF(NaOH_tanks=0,0,ROUNDUP((NaOHtank_diam+2*space_NaOHtank)^2+(NaOH_tanks-1)*(NaOHtank_diam+2*space_NaOHtank)*(NaOHtank_diam+space_NaOHtank),0))","v":0},"square feet"]
["Footprint for NaOH day tanks","NaOHday_tank_fp",{"$f":"IF(NaOH_tanks=0,0,ROUNDUP((NaOHdaytank_diam+2*space_NaOHdaytank)^2+(NaOH_day_tanks-1)*(NaOHdaytank_diam+2*space_NaOHdaytank)*(NaOHdaytank_diam+space_NaOHdaytank),0))","v":0},"square feet"]
["Polymer storage tank footprint","polymer_fp",{"$f":"IF(polymer_tanks=0,0,ROUNDUP((polymer_st_diam+2*space_polymer_st)^2+(polymer_tanks-1)*(polymer_st_diam+2*space_polymer_st)*(polymer_st_diam+space_polymer_st),0))","v":0},"square feet"]
["Residuals holding tank footprint","htank_fp",{"$f":"IF(OR(res_holding<>\"tanks\",htanks=0),0,ROUNDUP((ht_diam+2*space_ht)^2+(htanks-1)*(ht_diam+2*space_ht)*(ht_diam+space_ht),0))","v":0},"square feet"]
["Residuals holding basin footprint","hbasin_fp",{"$f":"IF(res_holding<>\"basins\",0,ROUNDUP(hbasins*hbasin_length*hbasin_width*2,0))","v":0},"square feet"]
["Cartridge filter footprint","cart_fp",{"$f":"IF(include_cart=0,0,(filter_len+2*space_other_equip)*(filter_wid+2*space_other_equip)+(num_filters-1)*(filter_len+2*space_other_equip)*(filter_wid+space_other_equip))","v":1967.9451388888888},"square feet"]
["Office space","office_fp",{"$f":"VLOOKUP(design_flow,labor_table_cl,3)*IF(ss_cat2=1,space_office_small,space_office)","v":780},"square feet"]
["Exact building footprint required","fp_required",{"$f":"SUM(C78:C90,back_tank_fp,vessel_fp)","v":26160.945138888888},"square feet"]
["Footprint of building 1","build1_fp",{"$f":"ROUNDUP(IF(fp_required<add_2nd_building,fp_required,vessel_fp),-1)","v":22360},"square feet","If total footprint is large, building 1 contains vessels only.  If total footprint is small, building 1 contains all equipment."]
["Footprint of building 2","build2_fp",{"$f":"ROUNDUP(IF(fp_required<add_2nd_building,0,SUM(back_tank_fp,C78:C90)),-1)","v":3810},"square feet","If total footprint is large, a second building is used for pumps, backwash, and chemical storage"]
["Actual total building footprint","total_fp",{"$f":"build1_fp+build2_fp","v":26170},"square feet"]
["Concrete Class A for vessel and pumps padding","concrete",{"$f":"ROUNDUP((fp_required-office_fp)*IF(ss_cat2=1,pad_thick_small,pad_thick)/27,0)","v":471},"cubic yards"]
["Facility dimension assumed square","facil_length",{"$f":"ROUNDUP(total_fp^0.5,-1)","v":170},"feet"]
["Additional footprint for evaporation pond","ep_fp",{"$f":"IF(ep_cells=0,0,ROUNDUP((ep_cell_side+2*non_fire_buffer)^2+(ep_cells-1)*(ep_cell_side+2*non_fire_buffer)*(ep_cell_side+non_fire_buffer),0))","v":0},"square feet"]
["Land needed","land_required",{"$f":"ROUNDUP(((build1_fp)^0.5+(2*non_fire_buffer))*((build1_fp)^0.5+(non_fire_buffer+fire_buffer))+IF(build2_fp=0,0,((build2_fp)^0.5+(2*non_fire_buffer))*((build2_fp)^0.5+(non_fire_buffer+fire_buffer)))+ep_fp+solids_pad_area,-2)/43560","v":0.9871441689623508},"acres"]
[]
["Land acquisition cost","land_cost",{"$f":"VLOOKUP(design_flow,land_cost_cl,3)","v":111427.57541372362},"/acre"]

{"sheet":"Instrumentation and Control","index":11,"n_rows":80,"n_cols":5,"rows_kept":80,"cut":false,"hidden":false,"merged":[]}
["Instrumentation and Control Calculations"]
[]
["Calculation","Range Name","Value","Units","Guidance"]
["From Inputs"]
["Component level","component_level",{"$f":"IF(component_level_I=\"high cost\",2,IF(component_level_I=\"mid cost\",1,\"\"))","v":""},"blank = low cost, 1 = mid cost, 2 = high cost"]
["Manual system controls","manual",{"$f":"IF(manual_I=\"manual\",1,IF(manual_I=\"semi-automated\",2,IF(manual_I=\"fully automated\",3,IF(component_level=\"\",1,IF(component_level=2,3,CHOOSE(ss_cat2,3,3,3))))))","v":3},"1 = fully manual system, 2 = semi-automated system, 3 = fully automated system.","Based on system size and component level (see cell comment), unless user overrides on input sheet"]
[]
["Valves and Instrumentation"]
["Size of valves for inlet and outlet lines","in_valve_size",{"$f":"in_out_pipe_diam","v":36},"inches"]
["Size of valves for vessel pipe line","tank_valve_size",{"$f":"proc_pipe_diam","v":12},"inches"]
["Size of valves for backwash line","back_valve_size",{"$f":"back_pipe_diam","v":8},"inches"]
["Size of valves for regenerant line","brine_valve_size",{"$f":"brine_pipe_diam","v":0},"inches"]
["Size of valves for acid line","acid_valve_size",{"$f":"acid_pipe_diam","v":0},"inches"]
["Size of valves for caustic line","caustic_valve_size",{"$f":"caustic_pipe_diam","v":0},"inches"]
["Size of valves for bypass line","bypass_valve_size",{"$f":"bp_pipe_diam","v":0},"inches"]
["Size of valves for polymer line","polymer_valve_size",{"$f":"polymer_pipe_diam","v":0},"inches"]
[]
["Number of MOVs for process line per vessel","proc_MOV_vessel",{"$f":"VLOOKUP(IF(Num_tanks=1,\"proc_mov_vessel_par\",\"proc_mov_vessel_ser\"),valve_table,manual+1,FALSE)","v":2},"valves/vessel","Depends on whether system is operated in parallel or series (lead/lag)"]
["Number of MOVs for process line","tot_proc_MOVs",{"$f":"final_num_tanks*proc_MOV_vessel+total_booster_pumps*VLOOKUP(\"proc_MOV_pump\",valve_table,manual+1,FALSE)+num_filters*VLOOKUP(\"proc_MOV_filter\",valve_table,manual+1,FALSE)","v":103},"valves"]
["Number of MOVs for backwash line","tot_back_MOVs",{"$f":"IF(back_pipe_length=0,0,final_num_tanks*VLOOKUP(\"back_MOV_vessel\",valve_table,manual+1,FALSE)+backwash_pumps*VLOOKUP(\"back_MOV_pump\",valve_table,manual+1,FALSE)+back_tanks*VLOOKUP(\"back_MOV_tank\",valve_table,manual+1,FALSE)+IF(regen_sol=2,mix_tanks,IF(brine_method=1,mix_tanks,num_salt_box))*VLOOKUP(\"back_MOV_brine\",valve_table,manual+1,FALSE)+VLOOKUP(\"back_MOV_add\",valve_table,manual+1,FALSE)+VLOOKUP(\"back_MOV_eductor\",valve_table,manual+1,FALSE)*eductors)","v":63},"valves"]
["Number of MOVs for regenerant line","tot_brine_MOVs",{"$f":"IF(brine_pipe_length=0,0,IF(regen_sol=2,final_num_tanks*VLOOKUP(\"brine_MOV_vessel\",valve_table,manual+1,FALSE)+mix_tanks*VLOOKUP(\"brine_MOV_tank\",valve_table,manual+1,FALSE)+regen_pumps*VLOOKUP(\"brine_MOV_pump\",valve_table,manual+1,FALSE),IF(brine_method=1,mix_tanks,num_salt_box)*VLOOKUP(\"brine_MOV_tank\",valve_table,manual+1,FALSE)+VLOOKUP(\"brine_MOV_vessel\",valve_table,manual+1,FALSE)*final_num_tanks))","v":0},"valves"]
["Number of MOVs for acid line","tot_acid_MOVs",{"$f":"IF(acid_pipe_length=0,0,HCl_tanks*VLOOKUP(\"acid_MOV_tank\",valve_table,manual+1,FALSE)+(mix_pumps+rinse_pumps)*VLOOKUP(\"acid_MOV_pump\",valve_table,manual+1,FALSE)+mix_tanks*VLOOKUP(\"acid_MOV_mixtank\",valve_table,manual+1,FALSE))","v":0},"valves","Applies only with tetrachlorferrate regeneration"]
["Number of MOVs for caustic line","tot_caustic_MOVs",{"$f":"IF(caustic_pipe_length=0,0,pH_pumps*VLOOKUP(\"caustic_MOV_pump\",valve_table,manual+1,FALSE)+VLOOKUP(\"chem_MOV_day\",valve_table,manual+1,FALSE)*NaOH_day_tanks)","v":0},"valves","Applies only with pH adjustment"]
["Number of MOVs for bypass line","tot_bp_MOVs",{"$f":"IF(bp_pipe_length=0,0,VLOOKUP(\"tot_bp_movs\",valve_table,manual+1,FALSE))","v":0},"valves"]
["Number of MOVs for polymer addition line","tot_polymer_MOVs",{"$f":"IF(polymer_day=0,0,(cm_pumps_polymer)*VLOOKUP(\"chem_MOV_pump\",valve_table,manual+1,FALSE))","v":0},"valves"]
["Total number of MOVs","tot_MOVs",{"$f":"tot_bp_MOVs+tot_caustic_MOVs+tot_acid_MOVs+tot_brine_MOVs+tot_back_MOVs+tot_proc_MOVs+tot_polymer_MOVs","v":166},"valves"]
[]
["Number of manual valves for process line per vessel","proc_man_vessel_cont",{"$f":"VLOOKUP(IF(Num_tanks=1,\"proc_man_vessel_par\",\"proc_man_vessel_ser\"),valve_table,manual+1,FALSE)","v":0},"valves/vessel","Depends on whether system is operated in parallel or series (lead/lag)"]
["Number of manual valves for process line","tot_proc_man",{"$f":"(proc_man_vessel_cont+proc_man_vessel)*final_num_tanks+total_booster_pumps*VLOOKUP(\"proc_man_pump\",valve_table,manual+1,FALSE)+num_filters*VLOOKUP(\"proc_man_filter\",valve_table,manual+1,FALSE)","v":30},"valves"]
["Number of manual valves for backwash line","tot_back_man",{"$f":"IF(back_pipe_length=0,0,final_num_tanks*VLOOKUP(\"back_man_vessel\",valve_table,manual+1,FALSE)+backwash_pumps*VLOOKUP(\"back_man_pump\",valve_table,manual+1,FALSE)+back_tanks*VLOOKUP(\"back_man_tank\",valve_table,manual+1,FALSE)+IF(regen_sol=2,mix_tanks,IF(brine_method=1,mix_tanks,num_salt_box)*VLOOKUP(\"back_man_brine\",valve_table,manual+1,FALSE)+VLOOKUP(\"back_man_add\",valve_table,manual+1,FALSE)+VLOOKUP(\"back_man_eductor\",valve_table,manual+1,FALSE)*eductors))","v":0},"valves"]
["Number of manual valves for regenerant line","tot_brine_man",{"$f":"IF(brine_pipe_length=0,0,IF(regen_sol=2,final_num_tanks*VLOOKUP(\"brine_man_vessel\",valve_table,manual+1,FALSE)+mix_tanks*VLOOKUP(\"brine_man_tank\",valve_table,manual+1,FALSE)+regen_pumps*VLOOKUP(\"brine_man_pump\",valve_table,manual+1,FALSE),IF(brine_method=1,mix_tanks,num_salt_box)*VLOOKUP(\"brine_man_tank\",valve_table,manual+1,FALSE)+VLOOKUP(\"brine_man_vessel\",valve_table,manual+1,FALSE)*final_num_tanks))","v":0},"valves"]
["Number of manual valves for acid line","tot_acid_man",{"$f":"IF(acid_pipe_length=0,0,HCl_tanks*VLOOKUP(\"acid_man_tank\",valve_table,manual+1,FALSE)+(mix_pumps+rinse_pumps)*VLOOKUP(\"acid_man_pump\",valve_table,manual+1,FALSE)+mix_tanks*VLOOKUP(\"acid_man_mixtank\",valve_table,manual+1,FALSE))","v":0},"valves","Applies only with tetrachlorferrate regeneration"]
["Number of manual valves for caustic line","tot_caustic_man",{"$f":"IF(caustic_pipe_length=0,0,pH_pumps*VLOOKUP(\"caustic_man_pump\",valve_table,manual+1,FALSE)+VLOOKUP(\"chem_man_day\",valve_table,manual+1,FALSE)*NaOH_day_tanks)","v":0},"valves","Applies only with pH adjustment"]
["Number of manual valves for bypass line","tot_bp_man",{"$f":"IF(bp_pipe_length=0,0,VLOOKUP(\"tot_bp_man\",valve_table,manual+1,FALSE))","v":0},"valves"]
["Number of manual valves for polymer addition line","tot_polymer_man",{"$f":"IF(polymer_day=0,0,(cm_pumps_polymer)*VLOOKUP(\"chem_man_pump\",valve_table,manual+1,FALSE))","v":0},"valves"]
[]
["Number of check valves backwash line","tot_back_chv",{"$f":"back_chv_pump*backwash_pumps","v":2},"valves"]
["Number of check valves regenerant line","tot_brine_chv",{"$f":"brine_chv_pump*regen_pumps","v":0},"valves"]
["Number of check valves acid line","tot_acid_chv",{"$f":"acid_chv_pump*(mix_pumps+rinse_pumps)","v":0},"valves"]
["Number of check valves caustic line","tot_caustic_chv",{"$f":"caustic_chv_pump*pH_pumps","v":0},"valves","Applies only with pH adjustment"]
["Number of check valves polymer line","tot_polymer_chv",{"$f":"polymer_chv_pump*cm_pumps_polymer","v":0},"valves"]
[]
["Size of flow meters for influent line","in_meter_size",{"$f":"in_out_pipe_diam","v":36},"inches"]
["Size of flow meters for process line","proc_meter_size",{"$f":"proc_pipe_diam","v":12},"inches"]
["Size of flow meters for backwash line","back_meter_size",{"$f":"back_pipe_diam","v":8},"inches"]
["Number of flow meters for process line","tot_fm_proc",{"$f":"fm_proc*final_num_tanks","v":0},"units"]
["Total flow meters for backwash line","tot_fm_back",{"$f":"IF(max_back_flow=0,0,fm_back)","v":1},"units"]
[]
["Total level switch/alarms","tot_level_switch",{"$f":"final_num_tanks*IF(ss_cat2=1,level_switch_small,level_switch)","v":0},"units"]
["Total high/low alarms for backwash tanks","tot_back_alarm",{"$f":"back_tanks*alarm_back","v":0},"units"]
["Total high/low alarms for mixing tanks","tot_brine_alarm",{"$f":"alarm_brine*mix_tanks","v":0},"units"]
["Total high/low alarms for HCl tanks","tot_acid_alarm",{"$f":"alarm_acid*HCl_tanks","v":0},"units"]
["Total high/low alarms for NaOH tanks","tot_caustic_alarm",{"$f":"alarm_caustic*(NaOH_tanks+NaOH_day_tanks)","v":0},"units"]
["pH meters","pH_controls",{"$f":"IF(pH_adj=\"yes\",pH_corr,pH_nocorr)","v":0},"units"]
["Total turbidity meters","tot_turb_meters",{"$f":"IF(ss_cat2=1,turb_tank_small*final_num_tanks+add_turb_small,turb_tank*final_num_tanks+add_turb)","v":1},"units"]
["Total conductivity meters","tot_cond_meters",{"$f":"cond_tank*final_num_tanks+add_cond","v":0},"units"]
["Total head loss sensors","tot_head_sens",{"$f":"IF(ss_cat2=1,head_tank_small,head_tank)*final_num_tanks+headloss_cart*num_filters","v":59},"units"]
["Sampling ports","ports",{"$f":"ports_tank*final_num_tanks+add_ports+IF(bp_pct>0,ports_bp,0)","v":33},"units"]
["Total drive controllers","tot_switches",{"$f":"IF(manual=2,0,S_booster_pump*total_booster_pumps+S_back_pump*backwash_pumps+S_res_pump*(res_pumps+cm_pumps_polymer)+S_eductor*eductors+S_mixer*(mixers+hmixers)+S_cm_pump*(rinse_pumps+mix_pumps+pH_pumps)+S_regen_pump*regen_pumps+S_chem_feed*(OUTPUT!L240*num_vol+OUTPUT!L241*num_grav)+IF(res_grav_feed_rate<>0,S_feeder*IF(res_holding=\"tanks\",htanks,IF(res_holding=\"basins\",hbasins,0)),0)+S_mixer*(dmixers+cmixers+hmixers))","v":9},"units"]
[]
["System Controls"]
["Flow meter lookup code - inlet/outlet","fm_lkp_io",{"$f":"IF(OUTPUT!L250=1,\"flow_op\",IF(OUTPUT!L251=1,\"flow_prop\",IF(OUTPUT!L252=1,\"flow_ven\",\"flow_mag\")))","v":"flow_op"},null,"These codes are used to look up SCADA requirements, which depend on the type of flow meter selected."]
["Flow meter lookup code - process","fm_lkp_proc",{"$f":"IF(OUTPUT!L255=1,\"flow_op\",IF(OUTPUT!L256=1,\"flow_prop\",IF(OUTPUT!L257=1,\"flow_ven\",\"flow_mag\")))","v":"flow_mag"}]
["Flow meter lookup code - backwash","fm_lkp_back",{"$f":"IF(OUTPUT!L260=1,\"flow_op\",IF(OUTPUT!L261=1,\"flow_prop\",IF(OUTPUT!L262=1,\"flow_ven\",\"flow_mag\")))","v":"flow_ven"}]
["Flow meter lookup code - residuals","fm_lkp_res",{"$f":"IF(OUTPUT!L265=1,\"flow_op\",IF(OUTPUT!L266=1,\"flow_prop\",IF(OUTPUT!L267=1,\"flow_ven\",\"flow_mag\")))","v":"flow_ven"}]
["Total discrete inputs","discrete_inputs",{"$f":"VLOOKUP(fm_lkp_io,port_table,2,FALSE)*tot_fm_in+VLOOKUP(fm_lkp_proc,port_table,2,FALSE)*tot_fm_proc+VLOOKUP(fm_lkp_back,port_table,2,FALSE)*tot_fm_back+VLOOKUP(fm_lkp_res,port_table,2,FALSE)*tot_fm_res+VLOOKUP(\"alarm\",port_table,2,FALSE)*(tot_level_switch+tot_back_alarm+tot_brine_alarm+tot_acid_alarm+tot_caustic_alarm+tot_res_alarm)+VLOOKUP(\"orp\",port_table,2,FALSE)*ORP_sensor+VLOOKUP(\"ph\",port_table,2,FALSE)*pH_controls+VLOOKUP(\"temp\",port_table,2,FALSE)*IF(ss_cat2=1,temp_meters_small,temp_meters)+VLOOKUP(\"cond\",port_table,2,FALSE)*tot_cond_meters+VLOOKUP(\"turb\",port_table,2,FALSE)*tot_turb_meters+VLOOKUP(\"head\",port_table,2,FALSE)*tot_head_sens+VLOOKUP(\"port\",port_table,2,FALSE)*ports+VLOOKUP(\"switch\",port_table,2,FALSE)*tot_switches+VLOOKUP(\"valve\",port_table,2,FALSE)*tot_MOVs","v":119},"units"]
["Total discrete outputs","discrete_outputs",{"$f":"IF(manual=2,0,VLOOKUP(fm_lkp_io,port_table,3,FALSE)*tot_fm_in+VLOOKUP(fm_lkp_proc,port_table,3,FALSE)*tot_fm_proc+VLOOKUP(fm_lkp_back,port_table,3,FALSE)*tot_fm_back+VLOOKUP(fm_lkp_res,port_table,3,FALSE)*tot_fm_res+VLOOKUP(\"alarm\",port_table,3,FALSE)*(tot_level_switch+tot_back_alarm+tot_brine_alarm+tot_acid_alarm+tot_caustic_alarm+tot_res_alarm)+VLOOKUP(\"orp\",port_table,3,FALSE)*ORP_sensor+VLOOKUP(\"ph\",port_table,3,FALSE)*pH_controls+VLOOKUP(\"temp\",port_table,3,FALSE)*IF(ss_cat2=1,temp_meters_small,temp_meters)+VLOOKUP(\"cond\",port_table,3,FALSE)*tot_cond_meters+VLOOKUP(\"turb\",port_table,3,FALSE)*tot_turb_meters+VLOOKUP(\"head\",port_table,3,FALSE)*tot_head_sens+VLOOKUP(\"port\",port_table,3,FALSE)*ports+VLOOKUP(\"switch\",port_table,3,FALSE)*tot_switches+VLOOKUP(\"valve\",port_table,3,FALSE)*tot_MOVs)","v":9},"units"]
["Total analog inputs","analog_inputs",{"$f":"VLOOKUP(fm_lkp_io,port_table,4,FALSE)*tot_fm_in+VLOOKUP(fm_lkp_proc,port_table,4,FALSE)*tot_fm_proc+VLOOKUP(fm_lkp_back,port_table,4,FALSE)*tot_fm_back+VLOOKUP(fm_lkp_res,port_table,4,FALSE)*tot_fm_res+VLOOKUP(\"alarm\",port_table,4,FALSE)*(tot_level_switch+tot_back_alarm+tot_brine_alarm+tot_acid_alarm+tot_caustic_alarm+tot_res_alarm)+VLOOKUP(\"orp\",port_table,4,FALSE)*ORP_sensor+VLOOKUP(\"ph\",port_table,4,FALSE)*pH_controls+VLOOKUP(\"temp\",port_table,4,FALSE)*IF(ss_cat2=1,temp_meters_small,temp_meters)+VLOOKUP(\"cond\",port_table,4,FALSE)*tot_cond_meters+VLOOKUP(\"turb\",port_table,4,FALSE)*tot_turb_meters+VLOOKUP(\"head\",port_table,4,FALSE)*tot_head_sens+VLOOKUP(\"port\",port_table,4,FALSE)*ports+VLOOKUP(\"switch\",port_table,4,FALSE)*tot_switches+VLOOKUP(\"valve\",port_table,4,FALSE)*tot_MOVs","v":174},"units"]
["Total analog outputs","analog_outputs",{"$f":"IF(manual=2,0,VLOOKUP(fm_lkp_io,port_table,5,FALSE)*tot_fm_in+VLOOKUP(fm_lkp_proc,port_table,5,FALSE)*tot_fm_proc+VLOOKUP(fm_lkp_back,port_table,5,FALSE)*tot_fm_back+VLOOKUP(fm_lkp_res,port_table,5,FALSE)*tot_fm_res+VLOOKUP(\"alarm\",port_table,5,FALSE)*(tot_level_switch+tot_back_alarm+tot_brine_alarm+tot_acid_alarm+tot_caustic_alarm+tot_res_alarm)+VLOOKUP(\"orp\",port_table,5,FALSE)*ORP_sensor+VLOOKUP(\"ph\",port_table,5,FALSE)*pH_controls+VLOOKUP(\"temp\",port_table,5,FALSE)*IF(ss_cat2=1,temp_meters_small,temp_meters)+VLOOKUP(\"cond\",port_table,5,FALSE)*tot_cond_meters+VLOOKUP(\"turb\",port_table,5,FALSE)*tot_turb_meters+VLOOKUP(\"head\",port_table,5,FALSE)*tot_head_sens+VLOOKUP(\"port\",port_table,5,FALSE)*ports+VLOOKUP(\"switch\",port_table,5,FALSE)*tot_switches+VLOOKUP(\"valve\",port_table,5,FALSE)*tot_MOVs)","v":169},"units"]
["Total I/O ports","total_ioports",{"$f":"discrete_inputs+discrete_outputs+analog_inputs+analog_outputs","v":471},"units"]
["I/O Discrete Output Modules","plc_discrete_output",{"$f":"ROUNDUP(discrete_outputs/32,0)","v":1},"units"]
["I/O Discrete Input Modules","plc_discrete_input",{"$f":"ROUNDUP(discrete_inputs/32,0)","v":4},"units"]
["I/O Combination Analog Modules","plc_combination_analog",{"$f":"ROUNDUP((analog_inputs + analog_outputs)/12,0)","v":29},"units"]
["Total number of PLC slots used","plc_slots",{"$f":"plc_cpu + plc_ethernet + plc_discrete_input + plc_discrete_output +  plc_combination_analog","v":38},"units"]
["Expansions required","plc_expansions",{"$f":"IF(plc_slots<=9,0,ROUNDUP((plc_slots-9)/8,0))","v":4},"units"]
["PLC Rack/Power Supplies","plc_rack",{"$f":"1+plc_expansions","v":5},"units"]
["Base Expansion Modules","plc_base_expansion",{"$f":"plc_expansions","v":4},"units"]
["Base Expansion Controller Modules","plc_base_expansion_controller",{"$f":"plc_expansions","v":4},"units"]
["Number of computer workstations","workstations",{"$f":"ROUNDUP(Operator_LOE/2080/shifts_day/workstation_ratio,0)","v":1},"units"]
["Number of printers","printers",{"$f":"ROUNDUP(workstations/printer_ratio,0)","v":1},"units"]

{"sheet":"Residuals Management","index":12,"n_rows":208,"n_cols":5,"rows_kept":208,"cut":false,"hidden":false,"merged":[]}
["Residuals Management Calculations"]
[]
["Calculation","Range Name","Value","Units","Guidance"]
["From Inputs"]
["Discharge option for spent regenerant/backwash","res_s2_opt",{"$f":"IF(res_s2_opt_I=\"\",\"\",IF(res_s2_opt_I=\"surface water\",1,IF(res_s2_opt_I=\"POTW\",2,IF(res_s2_opt_I=\"evaporation pond\",3,4))))","v":2},"<-- 1 for direct discharge to surface water, 2 for discharge to POTW, 3 for evaporation pond, 4 for hazardous waste disposal"]
["Holding tank for spent regenerant/backwash","res_s1_opt",{"$f":"IF(res_s1_opt_I=\"\",\"\",IF(res_s2_opt<>3,IF(OR(res_s1_opt_I=\"holding tank\",res_s2_opt=4),1,2),\"\"))","v":2},{"$f":"IF(res_s2_opt<>3,\"<-- 1 for holding tank, 2 for no holding tank (input ignored if continuous regeneration is required)\",\"\")","v":"<-- 1 for holding tank, 2 for no holding tank (input ignored if continuous regeneration is required)"}]
["Characteristics of spent resin","media_haz",{"$f":"IF(media_haz_I=\"hazardous\",2,IF(media_haz_I=\"radioactive\",3,IF(media_haz_I=\"radioactive hazardous\",4,1)))","v":1},"<-- 1 for non-hazardous, 2 for hazardous, 3 for radioactive, 4 for radioactive hazardous"]
[{"$f":"IF(res_s2_opt=3,\"Characteristics of evaporation pond solids\",\"Characteristics of holding tank solids\")","v":"Characteristics of holding tank solids"},"solids_haz",{"$f":"IF(solids_haz_I=\"hazardous\",2,IF(solids_haz_I=\"radioactive\",3,IF(solids_haz_I=\"radioactive hazardous\",4,1)))","v":1},"<-- 1 for non-hazardous, 2 for hazardous, 3 for radioactive, 4 for radioactive hazardous"]
[]
[]
["Spent Regenerant/Backwash"]
["Regenerant volume per vessel","regen_vol",{"$f":"IF(regen_type=2,0,IF(regen_sol=1,vol_brine,vol_FeCl4+HCl_in_rinse))","v":0},"gal","Regnerant only, not backwash/rinse water"]
["Single regeneration/replacement event volume","res_vol",{"$f":"(total_backwash+regen_vol/(regen_reuse+1))","v":12240},"gal","Regeneration/intial rinse for one vessel"]
["Single out-of-cycle backwash event volume","res_outcycle_vol",{"$f":"IF(add_backwash_freq=0,0,total_backwash)","v":0},"gal","Backwashing one vessel"]
["Time between regen/replace events","res_stagger_time",{"$f":"IF(regen_redun>1,\"NA\",regen_days*24*60/num_treat_lines)","v":58539.130434782608},"minutes","NA if continuous regeneration is required"]
["Time between out-of-cycle backwash events","res_outcycle_stagger_time",{"$f":"add_backwash_freq*24*60/final_num_tanks","v":0},"minutes","Zero indicates no out-of-cycle backwash"]
["Actual residuals discharge flow rate","res_flow_actual",{"$f":"IF(regen_redun>1,res_vol*regen_redun/regeneration_downtime,IF(AND(res_s1_opt=1,res_s2_opt<>3),res_vol/res_stagger_time,res_vol*regen_redun/regeneration_downtime))","v":370.90909090909093},"gpm","Accounts for flow equalization if holding tanks used"]
["Actual out-of-cycle backwash discharge flow rate","res_outcycle_flow_actual",{"$f":"IF(add_backwash_freq=0,0,IF(AND(res_s1_opt=1,res_s2_opt<>3),res_outcycle_vol/res_outcycle_stagger_time,total_backwash/backwash_time))","v":0},"gpm","Accounts for flow equalization if holding tanks used"]
["Design residuals discharge flow rate","res_flow",{"$f":"IF(regen_redun>1,res_flow_actual,IF(AND(res_s1_opt=1,res_s2_opt<>3),res_cap_factor*res_vol/res_stagger_time,res_flow_actual))","v":370.90909090909093},"gpm","Accounts for less than perfect staggering if holding tanks are used"]
["Design out-of-cycle residuals discharge flow rate","res_outcycle_flow",{"$f":"IF(add_backwash_freq=0,0,IF(AND(res_s1_opt=1,res_s2_opt<>3),res_cap_factor*res_outcycle_vol/res_outcycle_stagger_time,res_outcycle_flow_actual))","v":0},"gpm","Accounts for less than perfect staggering if holding tanks are used"]
["Annual residuals dischage","res_flow_annual",{"$f":"IF(regen_redun>1,res_flow*365*24*60,res_vol*final_num_tanks*(365/regen_days))+IF(add_backwash_freq=0,0,res_outcycle_vol*final_num_tanks*(365/add_backwash_freq))","v":253611.18881118877},"gal","Total including any out-of-cycle backwash"]
["Regenerant portion of annual residuals discharge","regen_flow_annual",{"$f":"IF(regen_redun>1,(regen_vol/(regen_reuse+1)*regen_redun/regeneration_downtime)*365*24*60,regen_vol/(regen_reuse+1)*num_treat_lines*(365/regen_days))","v":0},"gal"]
[]
["Evaporation Pond or Holding Tank Solids",null,null,null,"Does not currently account for contaminant contribution to solids"]
["TSS in residuals (influent TSS removal contribution)",null,{"$f":"(influent_TSS-effluent_TSS)*average_flow*1000000*365/res_flow_annual","v":81033.333333333343},"ppm"]
["TSS in residuals (media attrition contribution)",null,{"$f":"resin_loss_vol_annual*media_density*453590/(res_flow_annual*3.78)","v":0},"ppm"]
["TSS in residuals","TSS_residuals",{"$f":"SUM(C25:C26)","v":81033.333333333343},"ppm"]
["Evaporation pond TSS accumulation",null,{"$f":"IF(res_s2_opt=3,TSS_residuals*res_flow_annual*3.785/1000/453.59/dredging_freq,0)","v":0},"lbs"]
["Evaporation pond TDS (regenerant) accumulation",null,{"$f":"IF(res_s2_opt=3,IF(regen_sol=1,brine_conc*regen_flow_annual/dredging_freq,IF(regen_vol=0,0,(FeCl3_in_solution/regen_vol)*regen_flow_annual/dredging_freq)),0)","v":0},"lbs"]
["Total evaporation pond solids accumulation","ep_solids",{"$f":"C28+C29","v":0},"lbs","Conservative estimate assumes all TSS removed in regeneration, no regenerant loss during regeneration"]
["Holding tank annual TSS accumulation",null,{"$f":"IF(res_holding<>\"none\",TSS_residuals*IF(coag_res=1,coag_TSSrem,htank_TSSrem)*res_flow_annual*3.785/1000/453.59,0)","v":0},"lbs/year"]
["Holding tank annual coagulant accumulation",null,{"$f":"IF(AND(res_holding<>\"none\",coag_res=1),IF(coag_type<>1,coag_dose*coag_spf*8.34*res_flow_annual/10^6,0)+IF(coag_type<>2,polymer_dose*polymer_spf*8.34*res_flow_annual/10^6,0),0)","v":0},"lbs/year"]
["Holding tank annual solids accumulation","ht_solids",{"$f":"C32+C31","v":0},"lbs/year"]
["Holding tank cleaning frequency","ht_clean_freq",{"$f":"IF(res_holding=\"none\",0,ROUNDUP((ht_solids/ht_solids_density*7.48)/(IF(res_holding=\"tanks\",htanks*htank_vol,hbasins*hbasin_vol)*htank_clean_pct),0))","v":0},"times per year"]
["Residual solids quantity (total per event)","res_solids",{"$f":"IF(res_s2_opt=3,ep_solids,IF(OR(res_holding=\"none\",ht_solids=0),0,ht_solids/ht_clean_freq))/2000","v":0},"tons"]
["Residual solids disposal frequency","sol_disp_freq",{"$f":"IF(res_s2_opt=3,dredging_freq,IF(res_s1_opt=1,ht_clean_freq,0))","v":0},"times per year"]
[]
["Spent Media"]
["Replacement/disposal frequency","disp_freq",{"$f":"IF(regen_type=1,1/resin_life,365/regen_days)","v":0.69066227889757292},"times per year"]
["Spent media quantity (total per event)","spent_media",{"$f":"IF(regen_type=1,total_media-resin_loss_vol_annual*media_density,media_per_vessel*num_treat_lines)/2000","v":228.072},"tons","For regenerated systems this is reduced by one year's media loss, assuming disposal takes place before adding loss replacement for the year"]
["Spent resin quantity (average per year)","spent_media_yr",{"$f":"spent_media*disp_freq","v":157.52072727272724},"tons"]
[]
["Spent Cartridge Filters"]
["Replacement/disposal frequency","cart_disp_freq",{"$f":"12/cart_life","v":2.4},"times per year"]
["Disposal weight (total per event)","cart_disp_wt",{"$f":"active_filters*filter_elements*VLOOKUP(filter_size,cart_wt_table,3)/2000","v":6.48},"tons"]
[]
["Capital Items"]
["Holding tanks (for flow equalization)"]
["Maximum holding tank size","max_htank_size",{"$f":"MAX(VLOOKUP(10^6,st_bwt_cost_cl,1)-1,VLOOKUP(10^6,fg_bwt_cost_cl,1)-1,VLOOKUP(10^6,hdpe_bwt_cost_cl,1)-1)","v":282094},"gal","The largest size for which costs are available."]
["Number of holding tanks","htanks",{"$f":"IF(coag_res=1,0,IF(regen_redun>1,0,IF(AND(res_s1_opt=1,res_s2_opt<>3),ROUNDUP(MAX(res_flow*res_stagger_time,res_outcycle_flow*res_outcycle_stagger_time)/max_htank_size,0),0)))","v":0},"units","Use basins, instead of tanks, when cogulant is added"]
["Holding tank volume","htank_vol",{"$f":"IF(htanks=0,0,res_cap_factor*MAX(regen_redun*res_vol,res_outcycle_vol)/htanks)","v":0},"gal"]
[]
["Holding basins (for flow equalization)"]
["Holding basin redundancy factor","hbasin_redun",{"$f":"IF(coag_res=1,ROUNDUP(res_coag_settle_time/IF(res_outcycle_vol=0,res_stagger_time,MIN(res_stagger_time,res_outcycle_stagger_time)),0),1)","v":1},null,"To account for minumum coagulation time, when concrete basins are used, rather than tanks"]
["Number of holding basins","hbasins",{"$f":"IF(regen_redun>1,0,IF(AND(res_s1_opt=1,res_s2_opt<>3),hbasins_default*hbasin_redun,0))","v":0},"units","If concrete basins are used, rather than tanks"]
["Total residuals storage volume in cubic feet","total_hvol_ft",{"$f":"IF(hbasins=0,0,MAX(res_cap_factor*res_vol,res_cap_factor*res_outcycle_vol)*hbasin_redun/7.48)","v":0},"cubic feet","If concrete basins are used, rather than tanks"]
["Residuals storage volume per basin in cubic feet","hvol_ft",{"$f":"IF(hbasins=0,0,total_hvol_ft/hbasins)","v":0},"cubic feet","If concrete basins are used, rather than tanks"]
["Holiding basin operating depth","hbasin_op_depth",{"$f":"IF(hbasins=0,0,ROUNDUP(hvol_ft^(1/3)*holding_ratio,0))","v":0},"ft","If concrete basins are used, rather than tanks"]
["Holiding basin width","hbasin_width",{"$f":"IF(hbasins=0,0,ROUNDUP((hvol_ft/hbasin_op_depth)^0.5,0))","v":0},"ft","If concrete basins are used, rather than tanks"]
["Holiding basin length","hbasin_length",{"$f":"hbasin_width","v":0},"ft","If concrete basins are used, rather than tanks"]
["Holiding basin depth including freeboard","hbasin_depth",{"$f":"IF(hbasins=0,0,hbasin_op_depth+holding_freeboard)","v":0},"ft","If concrete basins are used, rather than tanks"]
["Holiding basin volume","hbasin_vol",{"$f":"ROUND(hbasin_width*hbasin_length*hbasin_depth*7.48,0)","v":0},"gal","If concrete basins are used, rather than tanks"]
["Concrete volume","hconc_vol",{"$f":"(2*(hbasin_width*hbasins+conc_thick*(hbasins+1))*hbasin_depth*conc_thick+(hbasins+1)*hbasin_length*hbasin_depth*conc_thick+(hbasin_length+2*conc_thick)*(hbasin_width*hbasins+conc_thick*(hbasins+1))*conc_thick)/27","v":7.407407407407407E-2},"cubic yards","If concrete basins are used, rather than tanks"]
["Excavation volume","hexcavation_vol",{"$f":"IF(hbasins=0,0,((hbasins*hbasin_width+(hbasins+1)*conc_thick+overexcavate)*(hbasin_length+2*conc_thick+overexcavate)*(hbasin_depth+conc_thick+overexcavate)+0.5*(3*(hbasin_depth+conc_thick+overexcavate)*(hbasin_depth+conc_thick+overexcavate)*(hbasin_length+2*conc_thick+overexcavate)))/27)","v":0},"cubic yards","If concrete basins are used, rather than tanks"]
["Backfill volume","hbackfill_vol",{"$f":"IF(hbasins=0,0,hexcavation_vol-(hbasins*hbasin_width+(hbasins+1)*conc_thick)*(hbasin_length+2*conc_thick)*(hbasin_depth+conc_thick)/27)","v":0},"cubic yards","If concrete basins are used, rather than tanks"]
["Railing length","hrailing",{"$f":"IF(hbasins=0,0,2*(hbasins*hbasin_width+2*conc_thick/2+(hbasins-1)*conc_thick)+2*(hbasin_length+2*conc_thick/2))","v":0},"lf","If concrete basins are used, rather than tanks"]
[]
["Residuals holding type selected","res_holding",{"$f":"IF(AND(hbasins<>0,coag_res=1),\"basins\",IF(OUTPUT!L72=1,\"basins\",IF(OR(OUTPUT!L73=1,OUTPUT!L74=1,OUTPUT!L75=1),\"tanks\",\"none\")))","v":"none"},"units","Basins when coagulant is added; otherwise based on priority lookups on the output sheet"]
[]
["Ferric Chloride Addition"]
["Maximum gravimetric feeder size","max_grav_size",{"$f":"VLOOKUP(10^6,grav_feed_cost_cl,1)-0.1","v":107.4},"lb/min","The largest size for which costs are available."]
["Gravimetric dry feeder rating","res_grav_feed_rate",{"$f":"IF(AND(res_holding<>\"none\",coag_res=1,coag_type<>1),coag_dose*8.34*MAX(res_vol/regeneration_downtime,res_outcycle_vol/backwash_time)/10^6/IF(res_holding=\"tanks\",htanks,hbasins),0)","v":0},"lbs/min"]
["Maximum volumentric feeder size","max_vol_size",{"$f":"VLOOKUP(10^6,vol_feed_cost_cl,1)-0.001","v":2.5089999999999999},"cfm","The largest size for which costs are available."]
["Volumetric dry feeder rating","res_vol_feed_rate",{"$f":"res_grav_feed_rate/coag_density","v":0},"cfm"]
["Mixers per tank","hmix_per_tank",{"$f":"IF(AND(res_holding<>\"none\",coag_res=1,coag_type<>1),ROUNDUP(IF(res_holding=\"tanks\",htank_vol,hbasin_vol)/1000*hmix_hp_per/hmix_hp_max,0),0)","v":0},"units"]
["Max holding tank mixer horsepower","hmix_hp_max",{"$f":"VLOOKUP(10^6,imp_mix_cost_cl,1)-0.1","v":20},"hp","The largest impeller mixer size available"]
["Number of mixers","hmixers",{"$f":"IF(AND(res_holding<>\"none\",coag_res=1,coag_type<>1),IF(res_holding=\"tanks\",htanks,hbasins)*hmix_per_tank,0)","v":0},"units"]
["Mixer size for holding tanks (if coagulant is used)","hmix_size",{"$f":"IF(AND(res_holding<>\"none\",coag_res=1,coag_type<>1),MAX(min_hmix_hp,IF(res_holding=\"tanks\",htank_vol,hbasin_vol)/1000*hmix_hp_per/hmix_per_tank),0)","v":0},"hp"]
["Ferric chloride in storage","coag_store",{"$f":"IF(AND(res_holding<>\"none\",coag_res=1,coag_type<>1),coag_dose*8.34*res_flow_annual/10^6/365*cstore_days,0)","v":0},"lbs"]
[]
["Polymer Addition"]
["Polymer needed per event","polymer_day",{"$f":"IF(AND(res_holding<>\"none\",coag_res=1,coag_type<>2),polymer_dose*8.34*MAX(res_vol,res_outcycle_vol)/10^6/polymer_density,0)","v":0},"gal"]
["Polymer storage in gallons","polymer_storage",{"$f":"IF(AND(res_holding<>\"none\",coag_res=1,coag_type<>2),polymer_dose*8.34*res_flow_annual/10^6/polymer_density/365*cstore_days,0)","v":0},"gal"]
["Polymer storage in pounds","polymer_storage_lbs",{"$f":"polymer_storage*polymer_density","v":0},"lbs"]
["Number of chemical storage tanks","polymer_tanks",{"$f":"ROUNDUP(polymer_storage/max_chem_tank_size,0)","v":0},"units"]
["Chemical storage tank size","polymer_tank_vol",{"$f":"IF(polymer_tanks>0,polymer_storage/polymer_tanks,0)","v":0},"gal"]
["Mixers per storage tank","polymer_cmix_per_tank",{"$f":"IF(polymer_tanks<>0,ROUNDUP(polymer_tank_vol/1000*cmix_hp_per/cmix_hp_max,0),0)","v":0},"units"]
["Number of storage tank mixers","polymer_cmixers",{"$f":"IF(AND(res_holding<>\"none\",coag_res=1,coag_type<>2),polymer_tanks*polymer_cmix_per_tank,0)","v":0},"units"]
["Mixer size for storage tanks","polymer_cmix_size",{"$f":"IF(polymer_tanks<>0,polymer_tank_vol/1000*cmix_hp_per/polymer_cmix_per_tank,0)","v":0},"hp"]
["Solution feed rate","polymer_rate",{"$f":"IF(polymer_day=0,0,polymer_dose*8.34*MAX(res_vol/regeneration_downtime,res_outcycle_vol/backwash_time)/10^6/polymer_density)","v":0},"gph"]
["Number of chemical metering pumps","cm_pumps_polymer",{"$f":"IF(polymer_day=0,0,ROUNDUP(polymer_rate/max_cm_pump_size,0)+NRD_cm_pump)","v":0},"units"]
["Chemical metering pump rating","cm_pump_rating_polymer",{"$f":"IF(polymer_day=0,0,MAX(min_chem_flow,polymer_rate*(1+pump_safety_factor)/(cm_pumps_polymer-NRD_cm_pump)))","v":0},"gph"]
[]
["Pumps"]
["Number of pumps","res_pumps",{"$f":"IF(res_holding<>\"none\",ROUNDUP(MAX(res_flow,res_outcycle_flow)*(1+pump_safety_factor)/max_pump_size,0)+NRD_res_pump,0)","v":0},"units"]
["Pump design rating","res_pump_rating",{"$f":"IF(res_holding<>\"none\",MAX(res_flow,res_outcycle_flow)*(1+pump_safety_factor)/(res_pumps-NRD_res_pump),0)","v":0},"gpm"]
[]
["Solids transfer for holding tanks"]
["Transfer rate required","res_transfer_rate",{"$f":"res_solids*2000/transfer_time","v":0},"lbs/hr"]
["Transfer rate in gallons","res_transfer_rate_gal",{"$f":"res_transfer_rate/(ht_solids_density/7.48*60)","v":0},"gpm"]
["Number of slurry pump systems","res_slurry_pumps",{"$f":"IF(res_transfer_method=1,1,0)","v":0},"units"]
["Number of eductors","res_eductors",{"$f":"IF(res_transfer_method<>2,0,ROUNDUP(res_transfer_rate_gal/max_eductor_size,0))","v":0},"units"]
["Effective transfer rate","res_eff_transfer_rate",{"$f":"IF(res_eductors=0,0,res_transfer_rate_gal/res_eductors)","v":0},"gpm"]
["Eductor size","res_eductor_size",{"$f":"IF(res_transfer_method=2,VLOOKUP(res_eff_transfer_rate,eductor_size_table_cl,2),\"NA\")","v":"NA"},"inches"]
[]
["Solids drying pad"]
["Area required","solids_pad_area",{"$f":"ROUNDUP(res_solids*2000/ht_solids_density/solids_storage_height,-1)","v":0},"square ft"]
["Concrete","solids_pad_concrete",{"$f":"ROUNDUP(solids_pad_area*IF(ss_cat2=1,pad_thick_small,pad_thick)/27,0)","v":0},"cubic yds"]
[]
["Evaporation Ponds"]
["Total open surface area required","ep_total_sa",{"$f":"IF(res_s2_opt=3,(res_flow_annual/7.48)*ep_safety_factor/((pan_evap*evap_ratio-precip)*0.0328),0)","v":0},"square feet"]
["Required depth for solids accumulation","ep_solids_depth",{"$f":"IF(res_s2_opt=3,ep_solids/ep_solids_density/ep_total_sa,0)","v":0},"feet"]
["Required depth for liquid accumulation","ep_water_depth",{"$f":"IF(res_s2_opt=3,(res_flow_annual/7.48)*winter_days/365/ep_total_sa,0)","v":0},"feet"]
["Total excavated depth","ep_depth",{"$f":"IF(res_s2_opt=3,ep_solids_depth+ep_water_depth+ep_freeboard,0)","v":0},"feet","Additional freeboard provided above grade by dike"]
["Number of cells","ep_cells",{"$f":"IF(res_s2_opt=3,IF(ROUNDUP(ep_total_sa/(max_ep_cell_area*43560),0)<min_ep_cells,min_ep_cells,ROUNDUP(ep_total_sa/(max_ep_cell_area*43560),0)),0)","v":0},"cells"]
["Cell side length","ep_cell_side",{"$f":"IF(res_s2_opt=3,SQRT(ep_total_sa/ep_cells),0)","v":0},"feet"]
["Total excavation volume","ep_excavation_vol",{"$f":"IF(res_s2_opt=3,ROUNDUP(((ep_cell_side+ep_overexcavate)^2*(ep_depth+ep_overexcavate)+0.5*(3*(ep_depth+ep_overexcavate)*(ep_cell_side+ep_overexcavate)*(ep_depth+ep_overexcavate)))*ep_cells/27,0),0)","v":0},"cubic yards"]
["Total backfill volume","ep_backfill_vol",{"$f":"IF(res_s2_opt=3,ROUNDUP(ep_excavation_vol-(ep_cell_side^2*ep_depth*ep_cells)/27,0),0)","v":0},"cubic yards"]
["Dike volume","dike_volume",{"$f":"IF(res_s2_opt=3,ep_cells*ep_cell_side*4*dike_xsection/27,0)","v":0},"cubic yards"]
["Liner area","liner_area",{"$f":"(ep_cell_side^2+ep_cell_side*(ep_depth+2)*4)*ep_cells","v":0},"square feet","Assumes liner extends 2 feet up dike side slope"]
[]
["Piping"]
["Pipe length","res_pipe_length",{"$f":"facil_length+add_res_pipe_length","v":210},"ft"]
["Pipe diameter","res_pipe_diam",{"$f":"MAX(min_res_pipe_size,VLOOKUP(MAX(res_flow,res_outcycle_flow),pipe_size_table_cl,2))","v":6},"inches"]
["Buried pipe length","buried_res_pipe_length",{"$f":"IF(res_s2_opt=4,0,add_res_pipe_length)","v":40},"ft"]
["Trench depth to top of pipe","res_trn_depth",{"$f":"MAX(frost,min_trench_depth)","v":38},"in. diam"]
["Thrust force","res_thrust_force",{"$f":"VLOOKUP(res_pipe_diam,thrust_block_table_cl,2)*2.2","v":6237.043283051893},"inches"]
["Bearing Area (L x H)","res_bearing_area",{"$f":"1.5*res_thrust_force/(soil_dens*(res_trn_depth/12+res_pipe_diam/12)*Coeff_Kp*Reduction)","v":18.775379196767016},"lbs"]
["L",null,{"$f":"res_bearing_area/C130","v":6.1278673609612362},"square ft"]
["H",null,{"$f":"(res_bearing_area/2)^0.5","v":3.0639336804806185},"ft"]
["F",null,{"$f":"MAX(0.5,res_pipe_diam/12)","v":0.5},"ft"]
["T",null,{"$f":"C129/2","v":3.0639336804806181},"ft"]
["Thrust block volume","res_block_vol",{"$f":"IF(OR(buried_res_pipe_length=0,res_pipe_diam=0),0,(C132+(buried_res_pipe_length/12)/2)*(C129+C131)/2*C130/27)","v":1.7789988557834608},"cy"]
["Trench cross-section area","res_trench_area",{"$f":"IF(res_pipe_diam=0,0,(res_pipe_diam/12+2)*(bedding_depth/12+res_pipe_diam/12+res_trn_depth/12)+(bedding_depth/12+res_pipe_diam/12+res_trn_depth/12)^2*TAN(trench_angle))","v":27.777777777777768},"cy"]
["Trench volume to discharge point",null,{"$f":"res_trench_area*buried_res_pipe_length/27","v":41.152263374485578},"square ft"]
["Trench volume total","res_trench_vol",{"$f":"IF(OR(buried_res_pipe_length=0,res_pipe_diam=0),0,C135+res_block_vol)","v":42.931262230269041},"cy"]
["Bedding cross sectional surface area",null,{"$f":"IF(res_pipe_diam=0,0,(res_pipe_diam/12+2)*(bedding_depth/12+res_pipe_diam/12*bedding_pct)+(bedding_depth/12+res_pipe_diam/12*bedding_pct)^2*TAN(trench_angle)-((res_pipe_diam/12/2)^2*ACOS((res_pipe_diam/12/2-bedding_pct*res_pipe_diam/12)/(res_pipe_diam/12/2))-(res_pipe_diam/12/2-res_pipe_diam/12*bedding_pct)*((2*res_pipe_diam/12/2*res_pipe_diam/12*bedding_pct-(res_pipe_diam/12*bedding_pct)^2)^0.5)))","v":1.9147384469184763},"square ft"]
["Bedding volume","res_pipe_bedding_vol",{"$f":"C137*buried_res_pipe_length/2/27","v":1.4183247754951678},"cy"]
[]
["Valves and instrumentation"]
["Residuals valve size","res_valve_size",{"$f":"res_pipe_diam","v":6},"inches"]
["Number of MOVs for residuals line","total_res_MOVs",{"$f":"VLOOKUP(\"res_MOV_pump\",valve_table,manual+1,FALSE)*res_pumps+VLOOKUP(\"res_MOV_tank\",valve_table,manual+1,FALSE)*IF(res_holding=\"tanks\",htanks,IF(res_holding=\"basins\",hbasins,0))+VLOOKUP(\"res_MOV_ep\",valve_table,manual+1,FALSE)*ep_cells","v":0},"valves"]
["Number of manual valves for residuals line","total_res_man",{"$f":"VLOOKUP(\"res_man_pump\",valve_table,manual+1,FALSE)*res_pumps+VLOOKUP(\"res_man_tank\",valve_table,manual+1,FALSE)*IF(res_holding=\"tanks\",htanks,IF(res_holding=\"basins\",hbasins,0))+VLOOKUP(\"res_man_ep\",valve_table,manual+1,FALSE)*ep_cells","v":0},"valves"]
["Number of check valves for residuals line","tot_res_chv",{"$f":"res_chv_pump*res_pumps+IF(res_pumps=0,res_chv_no_pump,0)","v":1},"valves"]
["Total high/low alarms","tot_res_alarm",{"$f":"IF(res_holding=\"tanks\",htanks,IF(res_holding=\"basins\",hbasins,0))*alarm_res","v":0},"units"]
["Residuals flow meter size","res_meter_size",{"$f":"res_pipe_diam","v":6},"inches"]
[]
["O&M Items"]
["Pumps"]
["Pump operating horsepower",null,{"$f":"IF(res_pumps=0,0,MAX(res_flow_actual,res_outcycle_flow_actual)*res_pump_psi/(res_pumps-NRD_res_pump)/booster_pump_efficiency/14.7*33.9*8.34/550/60)","v":0},"hp"]
["Energy per pump",null,{"$f":"C150*0.7457/1000*24*365","v":0},"MWh/yr"]
["Energy for all active pumps","res_pump_energy",{"$f":"C151*(res_pumps-NRD_res_pump)","v":0},"MWh/yr"]
["Residuals pump material cost","res_pump_mtl",{"$f":"OUTPUT!J212*booster_pump_maintenance","v":0},"/yr"]
[]
["Coagulant Use"]
["Annual ferric chloride use","coag_yr",{"$f":"IF(AND(res_holding<>\"none\",coag_res=1,coag_type<>1),coag_dose*8.34*res_flow_annual/10^6,0)","v":0},"lbs"]
["Annual polymer use","polymer_yr",{"$f":"IF(AND(res_holding<>\"none\",coag_res=1, coag_type<>2),polymer_dose*8.34*res_flow_annual/10^6,0)","v":0},"lbs"]
[]
["Ferric Chloride Purchasing"]
["Quantity required for large quantity purchase",null,{"$f":"VLOOKUP(\"Ferric Chloride - Large Qty\",chem_break_table_cl,2,FALSE)","v":29625},"lbs","#N/A indicates that price data do not depend on volume purchased."]
["Quantity required for mid quantity purchase",null,{"$f":"VLOOKUP(\"Ferric Chloride - Mid Qty\",chem_break_table_cl,2,FALSE)","v":2607},"lbs","#N/A indicates that price data do not depend on volume purchased."]
["Quantity required for small quantity purchase",null,{"$f":"VLOOKUP(\"Ferric Chloride - Small Qty\",chem_break_table_cl,2,FALSE)","v":0},"lbs","#N/A indicates that price data do not depend on volume purchased."]
["Purchase Type","FeCl3_purchase",{"$f":"IF(AND(ISNA(C160),ISNA(C161),ISNA(C162)),\"\",IF(FeCl3_store+coag_store>=C160,\" - Large Qty\",IF(FeCl3_store+coag_store>=C161,\" - Mid Qty\",\" - Small Qty\")))","v":" - Small Qty"},null,"Returns descriptive term based on volume of each purchase for use in determining pricing. Blank indicates that price data do not depend on volume purchased."]
[]
["Polymers Purchasing"]
["Quantity required for large quantity purchase",null,450,"lbs","#N/A indicates that price data do not depend on volume purchased."]
["Quantity required for mid quantity purchase",null,450,"lbs","#N/A indicates that price data do not depend on volume purchased."]
["Quantity required for small quantity purchase",null,0,"lbs","#N/A indicates that price data do not depend on volume purchased."]
["Purchase Type","polymer_purchase",{"$f":"IF(AND(ISNA(C166),ISNA(C167),ISNA(C168)),\"\",IF(polymer_storage_lbs>=C166,\" - Large Qty\",IF(polymer_storage_lbs>=C167,\" - Mid Qty\",\" - Small Qty\")))","v":" - Small Qty"},null,"Returns descriptive term based on volume of each purchase for use in determining pricing. Blank indicates that price data do not depend on volume purchased."]
[]
["POTW Discharge Fees"]
["TSS in discharged residuals","TSS_residuals_dis",{"$f":"IF(res_holding<>\"none\",TSS_residuals*(1-IF(coag_res=1,coag_TSSrem,htank_TSSrem)),TSS_residuals)","v":81033.333333333343},"ppm"]
["Total TSS in excess of POTW limit (if applicable)","ex_TSS_total",{"$f":"IF((TSS_residuals_dis-POTW_TSS_limit)*res_flow_annual*3.785/1000/453.59>0,(TSS_residuals_dis-POTW_TSS_limit)*res_flow_annual*3.785/1000/453.59,0)","v":170959.24516102078},"lbs/year"]
["Annual POTW base fee",null,{"$f":"IF(POTW_rate_type=1,POTW_base_cost_avg_cl,IF(POTW_base_fee=1,POTW_base_cost_typ_cl,0))*12","v":187.93106961883865},"$/year"]
["Annual POTW volume fee",null,{"$f":"IF(POTW_rate_type=1,POTW_vol_cost_avg_cl,IF(POTW_volume_fee=1,POTW_vol_cost_typ_cl,0))*res_flow_annual/1000","v":1120.6404345145572},"$/year"]
["Annual POTW TSS fee",null,{"$f":"IF(POTW_rate_type=1,POTW_TSS_cost_avg_cl,IF(POTW_TSS_fee=1,POTW_TSS_cost_typ_cl,0))*ex_TSS_total","v":41146.43074419543},"$/year"]
["Total annual POTW discharge fee","POTW_fee",{"$f":"SUM(C174:C176)","v":42455.002248328827},"$/year"]
[]
["Liquid Hazardous Waste Disposal"]
["Disposal",null,{"$f":"IF(res_s2_opt=4,lhaz_disposal_cost_cl*res_flow_annual,0)","v":0},"$/year"]
["Disposal frequency",null,{"$f":"365*24*60/res_stagger_time","v":8.9786096256684491},"times per year"]
["Out of cycle backwash disposal frequency",null,{"$f":"+IF(res_outcycle_stagger_time=0,0,365*24*60/res_outcycle_stagger_time)","v":0},"times per year"]
["Shipments per year",null,{"$f":"IF(res_vol>max_lhaz_ship,ROUNDUP(res_vol/max_lhaz_ship,0)*C181,C181)+IF(res_outcycle_vol>max_lhaz_ship,ROUNDUP(res_outcycle_vol/max_lhaz_ship,0)*C182,C182)","v":26.935828877005349}]
["Transportation",null,{"$f":"MAX(C183*lhaz_trans_min_cost_cl,res_flow_annual*haz_miles*lhaz_transportation_cost_cl)","v":131024.61282248099},"$/year"]
["Total annual liquid hazardous waste disposal fee","lhaz_fee",{"$f":"C180+C184","v":131024.61282248099},"$/year"]
[]
["Spent Media Disposal Fees"]
["Disposal",null,{"$f":"spent_media*disp_freq*CHOOSE(media_haz,IF(alt_media_disp=\"\",nonhaz_disposal_cost_cl,alt_media_disp),haz_disposal_cost_cl,rad_disposal_cost_cl,hazrad_disposal_cost_cl)","v":109898.18181818179},"$/year"]
["Shipments per year","disposal_shipments",{"$f":"CHOOSE(media_haz,disp_freq,IF(spent_media>max_haz_ship,ROUNDUP(spent_media/max_haz_ship,0)*disp_freq,disp_freq),IF(spent_media>max_rad_ship,ROUNDUP(spent_media/max_rad_ship,0)*disp_freq,disp_freq),IF(spent_media>max_hazrad_ship,ROUNDUP(spent_media/max_hazrad_ship,0)*disp_freq,disp_freq))","v":0.69066227889757292}]
["Transportation unit cost",null,{"$f":"CHOOSE(media_haz,nonhaz_transportation_cost_cl,haz_transportation_cost_cl,rad_transportation_cost_cl,hazrad_transportation_cost_cl)","v":0.52588469022017403},"$/ton-mile"]
["Transportation minimum charge per shipment",null,{"$f":"CHOOSE(media_haz,0,haz_trans_min_cost_cl,rad_trans_min_cost_cl,hazrad_trans_min_cost_cl)","v":0},"$/shipment"]
["Transportation mileage","disposal_miles",{"$f":"CHOOSE(media_haz,non_haz_miles,haz_miles,rad_miles,hazrad_miles)","v":10},"miles"]
["Transportation",null,{"$f":"IF(alt_media_disp<>\"\",0,MAX(spent_media*C189*C190*C192,C189*C191))","v":0},"$/year",{"$f":"IF(AND(media_haz=1,alt_media_disp<>\"\"),\"Included in disposal cost\",\"\")","v":"Included in disposal cost"}]
["Total annual spent media diposal fee","disposal_fee",{"$f":"C193+C188+CHOOSE(media_haz,0,0,rad_annual_fee_cl,hazrad_annual_fee_cl)","v":109898.18181818179},"$/year"]
[]
["Evaporation Pond/Holding Tank Solids Disposal Fees"]
["Disposal",null,{"$f":"res_solids*sol_disp_freq*CHOOSE(solids_haz,nonhaz_disposal_cost_cl,haz_disposal_cost_cl,rad_disposal_cost_cl,hazrad_disposal_cost_cl)","v":0},"$/year"]
["Shipments per year","sol_disposal_shipments",{"$f":"CHOOSE(solids_haz,sol_disp_freq,IF(res_solids>max_haz_ship,ROUNDUP(res_solids/max_haz_ship,0)*sol_disp_freq,sol_disp_freq),IF(res_solids>max_rad_ship,ROUNDUP(res_solids/max_rad_ship,0)*sol_disp_freq,sol_disp_freq),IF(res_solids>max_hazrad_ship,ROUNDUP(res_solids/max_hazrad_ship,0)*sol_disp_freq,sol_disp_freq))","v":0}]
["Transportation unit cost",null,{"$f":"CHOOSE(solids_haz,nonhaz_transportation_cost_cl,haz_transportation_cost_cl,rad_transportation_cost_cl,hazrad_transportation_cost_cl)","v":0.52588469022017403},"$/ton-mile"]
["Transportation minimum charge per shipment",null,{"$f":"CHOOSE(solids_haz,0,haz_trans_min_cost_cl,rad_trans_min_cost_cl,hazrad_trans_min_cost_cl)","v":0},"$/shipment"]
["Transportation mileage","sol_disposal_miles",{"$f":"CHOOSE(solids_haz,non_haz_miles,haz_miles,rad_miles,hazrad_miles)","v":10},"miles"]
["Transportation",null,{"$f":"MAX(C198*C200,res_solids*C198*C201*C199)","v":0},"$/year"]
["Total annual pond/tank solids diposal fee","sol_disposal_fee",{"$f":"IF(AND(solids_haz=1,solids_method=2),0,C202+C197+CHOOSE(solids_haz,0,0,rad_annual_fee_cl,hazrad_annual_fee_cl))","v":0},"$/year"]
[]
["Spent Cartridge Filter Disposal Fees"]
["Disposal",null,{"$f":"cart_disp_wt*cart_disp_freq*nonhaz_disposal_cost_cl","v":1083.2962009641262},"$/year"]
["Transportation",null,{"$f":"cart_disp_wt*cart_disp_freq*non_haz_miles*nonhaz_transportation_cost_cl","v":81.785587023041458},"$/year"]
["Total annual spent cartridge filter diposal fee","cart_disposal_fee",{"$f":"SUM(C206:C207)","v":1165.0817879871677},"$/year"]

{"sheet":"O&M","index":13,"n_rows":88,"n_cols":5,"rows_kept":88,"cut":false,"hidden":false,"merged":[]}
["Operation and Maintenance Calculations"]
[]
["Calculation","Range Name","Value","Units","Guidance"]
["Labor and Materials"]
["Include backwash/rinse pump maintenance?","include_back_maint",{"$f":"IF(regen_days<=7,1,IF(AND(add_backwash_freq<=7,NOT(ISBLANK(add_backwash_freq))),1,0))","v":0},"0 = exclude, 1 = include","Explicitly include labor and materials for maintenance if regeneration and/or backwash/rinse occurs weekly or more frequently"]
[]
["Maintenance materials"]
["Booster pump materials","pump_mtl",{"$f":"OUTPUT!J202*booster_pump_maintenance","v":5770.2786575601294},"/yr"]
["Backwash pump materials","back_pump_mtl",{"$f":"IF(backwash_pumps=0,0,IF(include_back_maint=0,0,OUTPUT!J203*booster_pump_maintenance))","v":0},"/yr"]
["Regenerant pumps","regen_pump_mtl",{"$f":"IF(regen_freq/60/24<=7,IF(ISNUMBER(OUTPUT!J201),OUTPUT!J201*booster_pump_maintenance,0),0)","v":0},"/yr"]
[]
["Chemicals and Resin"]
["Salt needed per year","salt_year",{"$f":"365*salt_store/cstore_days","v":0},"lbs"]
["HCl needed per year","HCl_year",{"$f":"365*total_HCl_lbs/cstore_days","v":0},"lbs"]
["FeCl3 needed per year","FeCl3_year",{"$f":"365*FeCl3_store/cstore_days","v":0},"lbs","Does not include holding tank coagulant (see Residuals Management for that value)"]
["NaOH needed per year","NaOH_year",{"$f":"365*NaOH_lbs/cstore_days","v":0},"lbs"]
[]
["Resin loss replacement","resin_loss_vol_annual",{"$f":"IF(OR(regen_type=1,add_backwash_freq<>0),media_volume*op_num_tanks*resin_loss_annual,0)","v":0},"cf","Relevant only for regenerated systems or throwaway systems with frequent backwash"]
["Complete bed replacement (averaged over resin life)","resin_yr",{"$f":"spent_media_yr*2000/media_density","v":7326.5454545454531},"cf",{"$f":"IF(regen_type=2,\"Total annual replacement\",\"Averaged over media life and reduced by one year's attrition loss to avoid double counting (no attrition replacement needed in the year you completely replace the bed)\")","v":"Total annual replacement"}]
[]
["Cartridge Filters"]
["Labor","cart_labor",{"$f":"active_filters*hrs_filter","v":324},"hrs/yr","For cartridge filter maintenance"]
["Replacement","pre_filter_replacement",{"$f":"active_filters*filter_elements*12/cart_life","v":1296},"filters/yr","For replacement of pretreatment cartridge filters only."]
[]
["General Labor"]
["Number of process instruments for operation","tot_inst",{"$f":"tot_fm_in+tot_fm_proc+tot_level_switch+tot_turb_meters+tot_head_sens+pH_controls+IF(ss_cat2=1,temp_meters_small,temp_meters)+ORP_sensor+tot_cond_meters","v":62}]
["Total number of instruments for maintenance","tot_inst_maint",{"$f":"tot_fm_in+tot_fm_proc+tot_level_switch+tot_turb_meters+tot_head_sens+pH_controls+IF(ss_cat2=1,temp_meters_small,temp_meters)+ORP_sensor+tot_cond_meters+tot_fm_back+tot_fm_res","v":64}]
["Number of pumps for operation","tot_pumps",{"$f":"booster_pumps+MAX(0,pH_pumps-NRD_pH_pumps)","v":7}]
["Total number of pumps for maintenance","tot_pumps_maint",{"$f":"booster_pumps+res_pumps+IF(regen_days<=7,regen_pumps,0)+IF(include_back_maint=1,backwash_pumps,0)","v":7}]
["Number of process valves","tot_valves",{"$f":"tot_proc_MOVs+tot_proc_man+tot_bp_MOVs+tot_bp_man","v":133},null,"Main process valves require frequent operation and preventative maintenance"]
["Number of chemical supplies","tot_chem",{"$f":"NaOH_tanks+IF(regen_sol=1,mix_tanks,HCl_tanks)+num_salt_box+polymer_tanks","v":0}]
["Regenerations per year","regen_yr",{"$f":"365/regen_days*final_num_tanks","v":20.719868366927187},null,"Accounts for initial rinse even in throwaway systems"]
["Additional out-of-cycle backwashes per year","backwash_yr",{"$f":"IF(add_backwash_freq<>0,365/add_backwash_freq*final_num_tanks,0)","v":0}]
["Quantity of resin handled per year","media_changes_cf",{"$f":"spent_media_yr*2000/media_density+resin_loss_vol_annual+resin_yr","v":14653.090909090906},"cf","Incorporates both removal and refill"]
[]
["Record system operating parameters (includes routine sampling)",null,{"$f":"IF(manual=1,tot_inst*uloe_inst*365/60,uloe_inst_auto*365/60)","v":30.416666666666668},"hr/yr","Instruments requiring daily observation"]
["Preventative maintenance and calibration of instruments",null,{"$f":"tot_inst_maint*uloe_inst_maint*12/60","v":128},"hr/yr","All instruments for preventative maintenance"]
["Verify/adjust pump operating parameters",null,{"$f":"IF(OR(manual=1,manual=2,),tot_pumps*uloe_pump*365/60,0)","v":0},"hr/yr","Pumps requiring daily observation/adjustment"]
["Preventative maintenance of pumps",null,{"$f":"tot_pumps_maint*uloe_pump_maint","v":211.75},"hr/yr","Large, frequently operated pumps require preventative maintenance"]
["Verify/adjust valve positions",null,{"$f":"IF(OR(manual=1,manual=2,),tot_valves*uloe_valve*52/60,0)","v":0},"hr/yr","Main process valves require frequent operation and preventative maintenance"]
["Preventative maintenance and inspection of valves",null,{"$f":"tot_valves*uloe_valve_maint/60","v":11.083333333333334},"hr/yr"]
["Visual inspection of facility",null,{"$f":"total_fp/100*uloe_fp*365/60","v":1592.0083333333334},"hr/yr"]
["Maintain/inspect chemical supply ",null,{"$f":"tot_chem*uloe_chem_maint*12/60","v":0},"hr/yr"]
["Managing regeneration/backwash",null,{"$f":"IF(OR(manual=1,manual=2),regen_yr*regeneration_downtime/60+backwash_yr*backwash_time/60,(regen_yr+backwash_yr)*uloe_autoregen/60)","v":3.4533113944878644},"hr/yr"]
["Managing resin changeouts",null,{"$f":"media_changes_cf*uloe_throwaway","v":217.08282828282825},"hr/yr"]
["Managing residual solids",null,{"$f":"IF(OR(res_s2_opt=3,res_transfer_method=3),res_solids*2000/ht_solids_density*sol_disp_freq*uloe_throwaway,sol_disp_freq*transfer_time)","v":0},"hr/yr"]
["Subtotal General Operator Labor","General_Oper_Labor",{"$f":"SUM(C36:C46)","v":2193.7944730106497},"hr/yr"]
[]
["Total Annual Operator LOE","Operator_LOE",{"$f":"General_Oper_Labor+cart_labor","v":2517.7944730106497},"hr/yr","Subtotal above + building + booster pumps + residuals pumps"]
["Annual Manager LOE","Manager_LOE",{"$f":"Operator_LOE*Manager_percent","v":251.77944730106498},"hr/yr","Based on general operator labor and percentages in critical design assumptions"]
["Annual Administrative LOE","Clerical_LOE",{"$f":"Operator_LOE*Clerical_percent","v":251.77944730106498},"hr/yr","Based on general operator labor and percentages in critical design assumptions"]
[]
["Building and HVAC Maintenance"]
["Cost excluding heating and cooling",null,{"$f":"IF(include_buildings=0,0,building_matl_rate_cl*total_fp)","v":151435.6693423051},"/yr","Labor and materials; includes routine in-house maintenance and major repairs"]
["Cost to maintain heating system, building 1",null,{"$f":"build1_need_heat*heating_matl_rate_cl*build1_fp","v":2967.1072392801434},"/yr"]
["Cost to maintain cooling system, building 1",null,{"$f":"build1_need_cool*cooling_matl_rate_cl*build1_fp","v":1644.6210716910771},"/yr"]
["Cost to maintain heating system, building 2",null,{"$f":"build2_need_heat*heating_matl_rate_cl*build2_fp","v":505.5759651904001},"/yr"]
["Cost to maintain cooling system, building 2",null,{"$f":"build2_need_cool*cooling_matl_rate_cl*build2_fp","v":280.23283913877475},"/yr"]
["Total annual building and HVAC maintenance","bldg_maint_cost",{"$f":"SUM(C54:C58)","v":156833.20645760547},null,"Includes labor and materials"]
[]
["Energy"]
["Booster & Backwash Pumps",null,null,null,"Other pumps and mechanical equipment used infrequently.  Therefore, these energy costs may be assumed covered by overall process and building energy costs."]
["Booster pump operating horsepower","pump_hp",{"$f":"IF(booster_pumps=0,0,(average_flow_rate/IF(bp_pct>0,bp_pct,1))*booster_pump_head/booster_pumps/booster_pump_efficiency/14.7*33.9*8.34/550/60)","v":72.343693494713918},"hp"]
["Energy per booster pump",null,{"$f":"pump_hp*0.7457/1000*24*365","v":472.57302401371163},"MWh/yr"]
["Energy for all active booster pumps","pump_energy",{"$f":"C64*booster_pumps","v":3308.0111680959812},"MWh/yr"]
[]
["Backwash Pumps"]
["Backwash pump operating horsepower (all pumps)","back_pump_hp",{"$f":"water_flush*backwash_pump_head/booster_pump_efficiency/14.7*33.9*8.34/550/60","v":11.651738181818182},"hp"]
["Backwash pumping time","back_pump_op_hours",{"$f":"(regen_yr+backwash_yr)*backwash_time/60","v":4.1439736733854371},"hours/yr"]
["Energy for all backwash pumps","back_pump_energy",{"$f":"back_pump_hp*0.7457/1000*back_pump_op_hours","v":3.6005748871994904E-2},"MWh/yr"]
[]
["Building Lighting"]
["Lighting power per sf, building 1","lighting_energy_1",{"$f":"IF(OR(build1_fp<500,component_level=\"\"),lighting_power_low,CHOOSE(component_level,lighting_power_mid,lighting_power_high))*24*365/1000","v":8.76},"kWh/sf/yr"]
["Lighting power per sf, building 2","lighting_energy_2",{"$f":"IF(OR(build2_fp<500,component_level=\"\"),lighting_power_low,CHOOSE(component_level,lighting_power_mid,lighting_power_high))*24*365/1000","v":8.76},"kWh/sf/yr"]
["Lighting","lighting",{"$f":"IF(include_buildings=0,0,MIN(1,Operator_LOE/(24*365))*(build1_fp*lighting_energy_1+build2_fp*lighting_energy_2)/1000)","v":65.890681358688695},"MWh/yr"]
[]
["HVAC"]
["Heating energy usage for:"]
["Electric resistance","heating",{"$f":"IF(build1_heat=A79,VLOOKUP(A79,build1_heat_options, 7,FALSE),0)+IF(build2_heat=A79,VLOOKUP(A79,build2_heat_options, 7,FALSE),0)","v":0},"MWh/yr"]
["Natural gas non-condensing furnace","heating_gas_non",0,"therms/yr"]
["Natural gas condensing furnace","heating_gas",33408.756986184664,"therms/yr"]
["Standard efficiency oil furnace","heating_diesel_non",0,"gal/yr"]
["Mid-efficiency oil furnace","heating_diesel",0,"gal/yr"]
["Heat pump","heating_hp",97.891658762288785,"MWh/yr"]
[]
["Cooling energy usage for:"]
["Air conditioner","cooling",{"$f":"IF(build1_cool=A87,VLOOKUP(A87,build1_cool_options, 7,FALSE),0)+IF(build2_cool=A87,VLOOKUP(A87,build2_cool_options, 7,FALSE),0)","v":89.093382381174834},"MWh/yr"]
["Heat pump","cooling_hp",{"$f":"IF(build1_cool=A88,VLOOKUP(A88,build1_cool_options, 7,FALSE),0)+IF(build2_cool=A88,VLOOKUP(A88,build2_cool_options, 7,FALSE),0)","v":376.85216578019077},"MWh/yr"]

{"sheet":"HVAC","index":14,"n_rows":135,"n_cols":12,"rows_kept":135,"cut":false,"hidden":false,"merged":[[80,1,80,4],[89,1,89,4]]}
["Building Heating, Ventilating, and Air Conditioning Calculations"]
[]
["Calculation","Range Name","Value","Units","Guidance"]
["General information",null,null,null,"ss_cat2 is used to select ventilation requirements and building type"]
["System size","ss_cat2",{"$f":"IF(design_flow<1,1,IF(design_flow<10,2,3))","v":3},"1 indicates small system, 2 indicates medium, 3 indicates large"]
["Building height","Building_height",{"$f":"IF(tank_geom=1,comm_height_length,comm_diam)+Top_bottom_Vessel_space","v":16},"ft"]
["Buiding 1 length and width","build1_side",{"$f":"build1_fp^0.5","v":149.53260514014994},"ft"]
["Building 2 length and width","build2_side",{"$f":"build2_fp^0.5","v":61.725197448043858},"ft"]
["Include HVAC?","include_HVAC",{"$f":"IF(include_HVAC_I=\"no\",0,IF(include_HVAC_I=\"yes\",1,2))","v":2}," 0 = always exclude, 1 = always include, 2 = use model default"]
[]
["Ventilation"]
["Building 1 weighted average air changes","air_changes_build1",{"$f":"IF(build2_fp=0,(air_changes_contactor*(vessel_fp+back_tank_fp+htank_fp)+air_changes_pump*(pump_fp+regen_pump_fp)+air_changes_chem_storage*(store_fp+mix_tank_fp+saltbox_fp+acid_tank_fp+NaOH_tank_fp+NaOHday_tank_fp+polymer_fp)+air_changes_office*office_fp)/build1_fp,air_changes_contactor)","v":3},"air changes/hr"]
["Building 2 weighted average air changes","air_changes_build2",{"$f":"IF(build2_fp=0,0,(air_changes_contactor*(back_tank_fp+htank_fp)+air_changes_pump*(pump_fp+regen_pump_fp)+air_changes_chem_storage*(store_fp+mix_tank_fp+saltbox_fp+acid_tank_fp+NaOH_tank_fp+NaOHday_tank_fp+polymer_fp)+air_changes_office*office_fp)/build2_fp)","v":5.9580052493438318},"air changes/hr"]
["Building 1 ventilation",null,{"$f":"CHOOSE(ss_cat2,fan_days_build1_small,fan_days_build1_medium,fan_days_build1_large)*24*0.746*fan_pressure_drop*build1_fp*Building_height*air_changes_build1/33000","v":26931.522327272727},"kWh/yr"]
["Building 2 ventilation",null,{"$f":"CHOOSE(ss_cat2,fan_days_build2_small,fan_days_build2_medium,fan_days_build2_large)*24*0.746*fan_pressure_drop*build2_fp*Building_height*air_changes_build2/33000","v":9113.6785454545443},"kWh/yr"]
["Total ventilation","ventilation",{"$f":"IF(include_HVAC=0,0,SUM(C14:C15)/1000)","v":36.045200872727271},"MWh/yr"]
[]
["Building 1 air exchange rate","build1_cfm",{"$f":"build1_fp*Building_height*air_changes_build1/60","v":17888},"cfm"]
["Building 2 air exchange rate","build2_cfm",{"$f":"build2_fp*Building_height*air_changes_build2/60","v":6053.333333333333},"cfm"]
[]
["Heating and Cooling"]
["Include heating for building 1","build1_need_heat",{"$f":"IF(include_HVAC=0,0,IF(include_HVAC=1,1,VLOOKUP(IF(component_level_I=\"\",\"low cost\",component_level_I),IF(build1_fp<500,heating_table_shed,heating_table),ss_cat2+2,FALSE)))","v":1},"1 for yes, 0 for no","Based on system size, building floorplan, and inputs"]
["Include cooling for building 1","build1_need_cool",{"$f":"IF(include_HVAC=0,0,IF(include_HVAC=1,1,VLOOKUP(IF(component_level_I=\"\",\"low cost\",component_level_I),IF(build1_fp<500,cooling_table_shed,cooling_table),ss_cat2+2,FALSE)))","v":1},"1 for yes, 0 for no"]
["Include heating for building 2","build2_need_heat",{"$f":"IF(build2_fp=0,0,IF(include_HVAC=0,0,IF(include_HVAC=1,1,VLOOKUP(IF(component_level_I=\"\",\"low cost\",component_level_I),IF(build2_fp<500,heating_table_shed,heating_table),ss_cat2+2,FALSE))))","v":1},"1 for yes, 0 for no"]
["Include cooling for building 2","build2_need_cool",{"$f":"IF(build2_fp=0,0,IF(include_HVAC=0,0,IF(include_HVAC=1,1,VLOOKUP(IF(component_level_I=\"\",\"low cost\",component_level_I),IF(build2_fp<500,cooling_table_shed,cooling_table),ss_cat2+2,FALSE))))","v":1},"1 for yes, 0 for no"]
[]
["Heating Requirements"]
["Building 1 side conductance heat loss",null,{"$f":"4*build1_side*Building_height*heat_DD*24/R_wall","v":86978837.477016598},"BTU/yr"]
["Buiding 1 ceiling conductance heat loss",null,{"$f":"build1_fp*heat_DD*24/R_ceiling","v":69523124.210526317},"BTU/yr"]
["Building 1 air exchange heat loss",null,{"$f":"build1_cfm*heat_viload","v":3017329952},"BTU/yr"]
["Building 1 total annual heat loss","build1_heat_loss_yr",{"$f":"SUM(C28:C30)","v":3173831913.6875429},"BTU/yr"]
["Building 1 heating requirement in thousand BTU/hr","build1_heat_mbh",{"$f":"build1_heat_loss_yr/365.25/24/1000","v":362.06159179643424},"MBH"]
["Building 1 number of heating zones","build1_heat_zones",{"$f":"ROUNDUP(build1_heat_mbh/max_heat_cl,0)","v":1}]
[]
["Building 2 side conductance heat loss",null,{"$f":"4*build2_side*Building_height*heat_DD*24/R_wall","v":35903781.065261677},"BTU/yr"]
["Buiding 2 ceiling conductance heat loss",null,{"$f":"build2_fp*heat_DD*24/R_ceiling","v":11846292.631578946},"BTU/yr"]
["Building 2 air exchange heat loss",null,{"$f":"build2_cfm*heat_viload","v":1021070213.3333333},"BTU/yr"]
["Building 2 total annual heat loss","build2_heat_loss_yr",{"$f":"SUM(C35:C37)","v":1068820287.0301739},"BTU/yr"]
["Building 2 heating requirement in thousand BTU/hr","build2_heat_mbh",{"$f":"build2_heat_loss_yr/365.25/24/1000","v":121.92793600618},"MBH"]
["Building 2 number of heating zones","build2_heat_zones",{"$f":"ROUNDUP(build2_heat_mbh/max_heat_cl,0)","v":1}]
[]
["Cooling Requirements"]
["Power lost: booster pumps","eloss_pumps",{"$f":"booster_pumps*pump_hp*(1-booster_pump_efficiency)*0.7457","v":94.406711418264294},"kW"]
["Waste heat: booster pumps","waste_heat_pumps",{"$f":"eloss_pumps*3415","v":322398.91949337255},"BTU/hr"]
["Power lost: backwash pumps","eloss_bw_pumps",{"$f":"back_pump_hp*(1-booster_pump_efficiency)*0.7457","v":2.1721752905454546},"kW"]
["Waste heat: backwash pumps","waste_heat_bw_pumps",{"$f":"eloss_bw_pumps*3415","v":7417.9786172127269},"BTU/hr"]
[]
["Building 1 side conductance cooling loss",null,{"$f":"4*build1_side*Building_height*cool_DD*24/R_wall","v":29982345.561344132},"BTU/yr"]
["Buiding 1 ceiling conductance cooling loss",null,{"$f":"build1_fp*cool_DD*24/R_ceiling","v":23965212.631578948},"BTU/yr"]
["Building 1 air exchange cooling loss",null,{"$f":"build1_cfm*cool_viload","v":926079648},"BTU/yr"]
["Building 1 total annual cooling loss","build1_cooling_loss_yr",{"$f":"SUM(C48:C50)","v":980027206.19292307},"BTU/yr"]
["Building 1 cooling loss per hour","build1_cooling_loss_hr",{"$f":"build1_cooling_loss_yr/365.25/24","v":111798.67741192369},"BTU/hr"]
[]
["Building 1 total cooling requirement","build1_cooling_req",{"$f":"build1_cooling_loss_hr+IF(fp_required<add_2nd_building,waste_heat_pumps+waste_heat_bw_pumps,0)","v":111798.67741192369},"BTU/hr"]
["Building 1 annual cooling requirement","build1_cooling_yr",{"$f":"IF(fp_required<add_2nd_building,(build1_cooling_loss_hr+waste_heat_pumps)*365.25*24+waste_heat_bw_pumps*back_pump_op_hours,build1_cooling_loss_hr*365.25*24)","v":980027206.19292319},"BTU/yr"]
["Building 1 total cooling requirement in tons","build1_cooling_tons",{"$f":"build1_cooling_req/12000","v":9.3165564509936409},"tons"]
["Building 1 number of cooling zones","build1_cool_zones",{"$f":"ROUNDUP(build1_cooling_tons/max_cool_cl,0)","v":1}]
[]
["Building 2 side conductance cooling loss",null,{"$f":"4*build2_side*Building_height*cool_DD*24/R_wall","v":12376338.91280704},"BTU/yr"]
["Buiding 2 ceiling conductance cooling loss",null,{"$f":"build2_fp*cool_DD*24/R_ceiling","v":4083517.8947368423},"BTU/yr"]
["Building 2 air exchange cooling loss",null,{"$f":"build2_cfm*cool_viload","v":313387120},"BTU/yr"]
["Building 2 total annual cooling loss","build2_cooling_loss_yr",{"$f":"SUM(C59:C61)","v":329846976.80754387},"BTU/yr"]
["Building 2 cooling loss per hour","build2_cooling_loss_hr",{"$f":"build2_cooling_loss_yr/365.25/24","v":37627.991878569919},"BTU/hr"]
[]
["Building 2 total cooling requirement","build2_cooling_req",{"$f":"build2_cooling_loss_hr+IF(fp_required<add_2nd_building,0,waste_heat_pumps+waste_heat_bw_pumps)","v":367444.88998915523},"BTU/hr"]
["Building 2 annual cooling requirement","build2_cooling_yr",{"$f":"IF(fp_required<add_2nd_building,0,(build1_cooling_loss_hr+waste_heat_pumps)*365.25*24+waste_heat_bw_pumps*back_pump_op_hours)","v":3806206874.3799267},"BTU/yr"]
["Building 2 total cooling requirement in tons","build2_cooling_tons",{"$f":"build2_cooling_req/12000","v":30.62040749909627},"tons"]
["Building 2 number of cooling zones","build2_cool_zones",{"$f":"ROUNDUP(build2_cooling_tons/max_cool_cl,0)","v":1}]
[]
["Heating Options"]
[]
["Building 1 number of HVAC zones","build1_zones",{"$f":"MAX(build1_heat_zones, build1_cool_zones)","v":1}]
["Building 2 number of HVAC zones","build2_zones",{"$f":"MAX(build2_heat_zones, build2_cool_zones)","v":1}]
[]
["Heat pump OK for building 1?","hp_ok_1",{"$f":"AND(build1_heat_mbh<=hp_max_heat_cl,build1_cooling_tons<=hp_max_cool_cl)","v":false},null,"For heat pumps, we check both heating and cooling capacities."]
["Heat pump OK for building 2?","hp_ok_2",{"$f":"AND(build2_heat_mbh<=hp_max_heat_cl,build2_cooling_tons<=hp_max_cool_cl)","v":true}]
[]
["Building 1","build1_heat_options"]
["Option","Size needed per zone (MBH)","Size selected (MBH)","Direct Cost Per Zone","Useful Life (yrs)","Annualized Capital Cost, All Zones","Energy/Yr",null,"Energy Unit Cost",null,"Annual Energy Cost","Total Annual Cost"]
["Electric resistance",{"$f":"build1_heat_mbh/build1_zones","v":362.06159179643424},{"$f":"IF(curve=1,B80,VLOOKUP(B80,hvac_elec_cost_cl,2))","v":362.06159179643424},{"$f":"IF(curve=1,hvac_elec_eq_1,VLOOKUP(B80,hvac_elec_cost_cl,3))","v":122814.3988587482},{"$f":"VLOOKUP(B80,hvac_elec_cost_cl,IF(ss_cat=\"large\",4,5))","v":25},{"$f":"IF(D80=\"contact vendor\",\"n/a\",-PMT(Discount_rate,E80,D80)*build1_zones)","v":10538.767088214308},{"$f":"build1_heat_loss_yr/3412000/resist_eff","v":949.1805373853216},"MWh/yr",{"$f":"energy_cost_cl","v":0.12121832061068702},"/kwh",{"$f":"I80*G80*1000","v":115058.07069819811},{"$f":"IF(OR(F80=\"n/a\",K80=\"n/a\"),\"n/a\",F80+K80)","v":125596.83778641242}]
["Heat pump","capital costs are in the cooling table",null,null,null,"n/a",{"$f":"IF(hp_ok_1,build1_heat_loss_yr/3412000/COP,\"n/a\")","v":"n/a"},"MWh/yr",{"$f":"energy_cost_cl","v":0.12121832061068702},"/kwh",{"$f":"IF(G81=\"n/a\",\"n/a\",I81*G81*1000)","v":"n/a"},"n/a"]
["Natural gas non-condensing furnace",{"$f":"build1_heat_mbh/build1_zones","v":362.06159179643424},{"$f":"IF(curve=1,B82,VLOOKUP(B82,hvac_gas_non_cost_cl,2))","v":362.06159179643424},{"$f":"IF(curve=1,hvac_gas_non_eq_1,VLOOKUP(B82,hvac_gas_non_cost_cl,3))","v":79981.616570299171},{"$f":"VLOOKUP(B82,hvac_gas_non_cost_cl,IF(ss_cat=\"large\",4,5))","v":25},{"$f":"IF(D82=\"contact vendor\",\"n/a\",-PMT(Discount_rate,E82,D82)*build1_zones)","v":6863.2638860423322},{"$f":"build1_heat_loss_yr/100000/gas_non_eff","v":39672.898921094289},"therms/yr",{"$f":"gas_cost_cl","v":0.79405665355998734},"/therm",{"$f":"I82*G82","v":31502.529354307764},38365.793240350096]
["Natural gas condensing furnace",{"$f":"build1_heat_mbh/build1_zones","v":362.06159179643424},{"$f":"IF(curve=1,B83,VLOOKUP(B83,hvac_gas_cost_cl,2))","v":362.06159179643424},{"$f":"IF(curve=1,hvac_gas_eq_1,VLOOKUP(B83,hvac_gas_cost_cl,3))","v":79981.616570299171},{"$f":"VLOOKUP(B83,hvac_gas_cost_cl,IF(ss_cat=\"large\",4,5))","v":25},{"$f":"IF(D83=\"contact vendor\",\"n/a\",-PMT(Discount_rate,E83,D83)*build1_zones)","v":6863.2638860423322},{"$f":"build1_heat_loss_yr/100000/gas_eff","v":33408.756986184664},"therms/yr",{"$f":"gas_cost_cl","v":0.79405665355998734},"/therm",{"$f":"I83*G83","v":26528.445772048643},33391.709658090971]
["Standard efficiency oil furnace",{"$f":"build1_heat_mbh/build1_zones","v":362.06159179643424},{"$f":"IF(curve=1,B84,VLOOKUP(B84,hvac_oil_std_cost_cl,2))","v":362.06159179643424},{"$f":"IF(curve=1,hvac_oil_std_eq_1,VLOOKUP(B84,hvac_oil_std_cost_cl,3))","v":84859.017061863167},{"$f":"VLOOKUP(B84,hvac_oil_std_cost_cl,IF(ss_cat=\"large\",4,5))","v":25},{"$f":"IF(D84=\"contact vendor\",\"n/a\",-PMT(Discount_rate,E84,D84)*build1_zones)","v":7281.7961449157674},{"$f":"build1_heat_loss_yr/diesel_heat_content/diesel_non_eff","v":29273.49117955675},"gal/yr",{"$f":"diesel_cost_cl","v":2.3528514873883046},"/gal",{"$f":"I84*G84","v":68876.177262868514},76157.973407784288]
["Mid-efficiency oil furnace",{"$f":"build1_heat_mbh/build1_zones","v":362.06159179643424},{"$f":"IF(curve=1,B85,VLOOKUP(B85,hvac_oil_mid_cost_cl,2))","v":362.06159179643424},{"$f":"IF(curve=1,hvac_oil_mid_eq_1,VLOOKUP(B85,hvac_oil_mid_cost_cl,3))","v":84859.017061863167},{"$f":"VLOOKUP(B85,hvac_oil_mid_cost_cl,IF(ss_cat=\"large\",4,5))","v":25},{"$f":"IF(D85=\"contact vendor\",\"n/a\",-PMT(Discount_rate,E85,D85)*build1_zones)","v":7281.7961449157674},{"$f":"build1_heat_loss_yr/diesel_heat_content/diesel_eff","v":26862.733082416784},"gal/yr",{"$f":"diesel_cost_cl","v":2.3528514873883046},"/gal",{"$f":"I85*G85","v":63204.021488279344},70485.817633195111]
[]
["Building 2","build2_heat_options"]
["Option","Size needed per zone (MBH)","Size selected (MBH)","Direct Cost Per Zone","Useful Life (yrs)","Annualized Capital Cost, All Zones","Energy/Yr",null,"Energy Unit Cost",null,"Annual Energy Cost","Total Annual Cost"]
["Electric resistance",{"$f":"build2_heat_mbh/build2_zones","v":121.92793600618},{"$f":"IF(curve=1,B89,VLOOKUP(B89,hvac_elec_cost_cl,2))","v":121.92793600618},{"$f":"IF(curve=1,hvac_elec_eq_2,VLOOKUP(B89,hvac_elec_cost_cl,3))","v":54145.776436687491},{"$f":"VLOOKUP(B89,hvac_elec_cost_cl,IF(ss_cat=\"large\",4,5))","v":25},{"$f":"IF(D89=\"contact vendor\",\"n/a\",-PMT(Discount_rate,E89,D89)*build2_zones)","v":4646.2770813466832},{"$f":"build2_heat_loss_yr/3412000/resist_eff","v":319.64623269318787},"MWh/yr",{"$f":"energy_cost_cl","v":0.12121832061068702},"/kwh",{"$f":"I89*G89*1000","v":38746.979516601117},{"$f":"IF(F89=\"n/a\",\"n/a\",F89+K89)","v":43393.256597947802}]
["Heat pump","capital costs are in the cooling table",null,null,null,"n/a",{"$f":"IF(hp_ok_2,build2_heat_loss_yr/3412000/COP,\"n/a\")","v":97.891658762288785},"MWh/yr",{"$f":"energy_cost_cl","v":0.12121832061068702},"/kwh",{"$f":"IF(G90=\"n/a\",\"n/a\",I90*G90*1000)","v":11866.262476959091},{"$f":"IF(OR(F90=\"n/a\",K90=\"n/a\"),\"n/a\",F90+K90)","v":"n/a"}]
["Natural gas non-condensing furnace",{"$f":"build2_heat_mbh/build2_zones","v":121.92793600618},{"$f":"IF(curve=1,B91,VLOOKUP(B91,hvac_gas_non_cost_cl,2))","v":121.92793600618},{"$f":"IF(curve=1,hvac_gas_non_eq_2,VLOOKUP(B91,hvac_gas_non_cost_cl,3))","v":34265.95562616321},{"$f":"VLOOKUP(B91,hvac_gas_non_cost_cl,IF(ss_cat=\"large\",4,5))","v":25},{"$f":"IF(D91=\"contact vendor\",\"n/a\",-PMT(Discount_rate,E91,D91)*build2_zones)","v":2940.379375341442},{"$f":"build2_heat_loss_yr/100000/gas_non_eff","v":13360.253587877172},"therms/yr",{"$f":"gas_cost_cl","v":0.79405665355998734},"/therm",{"$f":"I91*G91","v":10608.798254702562},{"$f":"IF(F91=\"n/a\",\"n/a\",F91+K91)","v":13549.177630044003}]
["Natural gas condensing furnace",{"$f":"build2_heat_mbh/build2_zones","v":121.92793600618},{"$f":"IF(curve=1,B92,VLOOKUP(B92,hvac_gas_cost_cl,2))","v":121.92793600618},{"$f":"IF(curve=1,hvac_gas_eq_2,VLOOKUP(B92,hvac_gas_cost_cl,3))","v":34265.95562616321},{"$f":"VLOOKUP(B92,hvac_gas_cost_cl,IF(ss_cat=\"large\",4,5))","v":25},{"$f":"IF(D92=\"contact vendor\",\"n/a\",-PMT(Discount_rate,E92,D92)*build2_zones)","v":2940.379375341442},{"$f":"build2_heat_loss_yr/100000/gas_eff","v":11250.739863475515},"therms/yr",{"$f":"gas_cost_cl","v":0.79405665355998734},"/therm",{"$f":"I92*G92","v":8933.7248460653173},{"$f":"IF(F92=\"n/a\",\"n/a\",F92+K92)","v":11874.10422140676}]
["Standard efficiency oil furnace",{"$f":"build2_heat_mbh/build2_zones","v":121.92793600618},{"$f":"IF(curve=1,B93,VLOOKUP(B93,hvac_oil_std_cost_cl,2))","v":121.92793600618},{"$f":"IF(curve=1,hvac_oil_std_eq_2,VLOOKUP(B93,hvac_oil_std_cost_cl,3))","v":37149.946991671277},{"$f":"VLOOKUP(B93,hvac_oil_std_cost_cl,IF(ss_cat=\"large\",4,5))","v":25},{"$f":"IF(D93=\"contact vendor\",\"n/a\",-PMT(Discount_rate,E93,D93)*build2_zones)","v":3187.8561660756232},{"$f":"build2_heat_loss_yr/diesel_heat_content/diesel_non_eff","v":9858.1469012190901},"gal/yr",{"$f":"diesel_cost_cl","v":2.3528514873883046},"/gal",{"$f":"I93*G93","v":23194.755599425742},{"$f":"IF(F93=\"n/a\",\"n/a\",F93+K93)","v":26382.611765501366}]
["Mid-efficiency oil furnace",{"$f":"build2_heat_mbh/build2_zones","v":121.92793600618},{"$f":"IF(curve=1,B94,VLOOKUP(B94,hvac_oil_mid_cost_cl,2))","v":121.92793600618},{"$f":"IF(curve=1,hvac_oil_mid_eq_2,VLOOKUP(B94,hvac_oil_mid_cost_cl,3))","v":37149.946991671277},{"$f":"VLOOKUP(B94,hvac_oil_mid_cost_cl,IF(ss_cat=\"large\",4,5))","v":25},{"$f":"IF(D94=\"contact vendor\",\"n/a\",-PMT(Discount_rate,E94,D94)*build2_zones)","v":3187.8561660756232},{"$f":"build2_heat_loss_yr/diesel_heat_content/diesel_eff","v":9046.2995093539903},"gal/yr",{"$f":"diesel_cost_cl","v":2.3528514873883046},"/gal",{"$f":"I94*G94","v":21284.599255943627},{"$f":"IF(F94=\"n/a\",\"n/a\",F94+K94)","v":24472.455422019251}]
[]
["Cooling Options"]
["Building 1","build1_cool_options"]
["Option","Size needed per zone (tons)","Size selected (tons)","Direct Cost Per Zone","Useful Life (yrs)","Annualized Capital Cost, All Zones","Energy/Yr",null,"Energy Unit Cost",null,"Annual Energy Cost","Total Annual Cost"]
["Air conditioner",{"$f":"build1_cooling_tons/build1_zones","v":9.3165564509936409},{"$f":"IF(curve=1,B99,VLOOKUP(B99,hvac_ac_cost_cl,2))","v":9.3165564509936409},{"$f":"IF(curve=1,hvac_ac_eq_1,VLOOKUP(B99,hvac_ac_cost_cl,3))","v":35689.537748661809},{"$f":"VLOOKUP(B99,hvac_ac_cost_cl,IF(ss_cat=\"large\",4,5))","v":25},{"$f":"IF(D99=\"contact vendor\",\"n/a\",-PMT(Discount_rate,E99,D99)*build1_zones)","v":3062.5376935791401},{"$f":"build1_cooling_yr/EER/10^6","v":89.093382381174834},"MWh/yr",{"$f":"energy_cost_cl","v":0.12121832061068702},"/kwh",{"$f":"I99*G99*1000","v":10799.750189771785},{"$f":"IF(F99=\"n/a\",\"n/a\",F99+K99)","v":13862.287883350924}]
["Heat pump",{"$f":"build1_cooling_tons/build1_zones","v":9.3165564509936409},{"$f":"IF(hp_ok_1,IF(curve=1,B100,VLOOKUP(B100,hvac_hp_cost_cl,2)),\"n/a\")","v":"n/a"},{"$f":"IF(C100=\"n/a\",\"n/a\",IF(curve=1,hvac_hp_eq_1,VLOOKUP(B100,hvac_hp_cost_cl,3)))","v":"n/a"},{"$f":"IF(C100=\"n/a\",\"n/a\",VLOOKUP(B100,hvac_hp_cost_cl,IF(ss_cat=\"large\",4,5)))","v":"n/a"},{"$f":"IF(OR(D100=\"contact vendor\",D100=\"n/a\"),\"n/a\",-PMT(Discount_rate,E100,D100)*build1_zones)","v":"n/a"},{"$f":"IF(C100=\"n/a\",\"n/a\",build1_cooling_yr/hp_EER/10^6)","v":"n/a"},"MWh/yr",{"$f":"energy_cost_cl","v":0.12121832061068702},"/kwh",{"$f":"IF(C100=\"n/a\",\"n/a\",I100*G100*1000)","v":"n/a"},{"$f":"IF(F100=\"n/a\",\"n/a\",F100+K100)","v":"n/a"}]
[]
["Building 2","build2_cool_options"]
["Option","Size needed per zone (tons)","Size selected (tons)","Direct Cost Per Zone","Useful Life (yrs)","Annualized Capital Cost, All Zones","Energy/Yr",null,"Energy Unit Cost",null,"Annual Energy Cost","Total Annual Cost"]
["Air conditioner",{"$f":"build2_cooling_tons/build2_zones","v":30.62040749909627},{"$f":"IF(curve=1,B104,VLOOKUP(B104,hvac_ac_cost_cl,2))","v":30.62040749909627},{"$f":"IF(curve=1,hvac_ac_eq_2,VLOOKUP(B104,hvac_ac_cost_cl,3))","v":143394.16141026179},{"$f":"VLOOKUP(B104,hvac_ac_cost_cl,IF(ss_cat=\"large\",4,5))","v":25},{"$f":"IF(D104=\"contact vendor\",\"n/a\",-PMT(Discount_rate,E104,D104)*build2_zones)","v":12304.727157038174},{"$f":"build2_cooling_yr/EER/10^6","v":346.0188067618115},"MWh/yr",{"$f":"energy_cost_cl","v":0.12121832061068702},"/kwh",{"$f":"I104*G104*1000","v":41943.818655380623},{"$f":"IF(F104=\"n/a\",\"n/a\",F104+K104)","v":54248.545812418801}]
["Heat pump",{"$f":"build2_cooling_tons/build2_zones","v":30.62040749909627},{"$f":"IF(hp_ok_2,IF(curve=1,B105,VLOOKUP(B105,hvac_hp_cost_cl,2)),\"n/a\")","v":30.62040749909627},{"$f":"IF(C105=\"n/a\",\"n/a\",IF(curve=1,hvac_hp_eq_2,VLOOKUP(B105,hvac_hp_cost_cl,3)))","v":43667.717290503613},{"$f":"IF(C105=\"n/a\",\"n/a\",VLOOKUP(B105,hvac_hp_cost_cl,IF(ss_cat=\"large\",4,5)))","v":25},{"$f":"IF(OR(D105=\"contact vendor\",D105=\"n/a\"),\"n/a\",-PMT(Discount_rate,E105,D105)*build2_zones)","v":3747.1494065439183},{"$f":"IF(C105=\"n/a\",\"n/a\",build2_cooling_yr/hp_EER/10^6)","v":376.85216578019077},"MWh/yr",{"$f":"energy_cost_cl","v":0.12121832061068702},"/kwh",{"$f":"IF(C105=\"n/a\",\"n/a\",I105*G105*1000)","v":45681.386654374939},{"$f":"IF(F105=\"n/a\",\"n/a\",F105+K105)","v":49428.536060918857}]
[]
[]
["Heating and Cooling Selection",null,null,null,"We will select the option with the lowest annual cost for each building."]
[]
["Building 1 Selection"]
["Heating option","Annual cost","Cooling option","Annual cost","Total annual cost"]
["Electric resistance",{"$f":"IF(build1_need_heat,VLOOKUP(A112,build1_heat_options,12,FALSE),0)","v":125596.83778641242},"Air conditioner",{"$f":"IF(build1_need_cool,VLOOKUP(C112,build1_cool_options,12,FALSE),0)","v":13862.287883350924},{"$f":"IF(OR(B112=\"n/a\",D112=\"n/a\"),\"n/a\",ROUND(B112+D112,0))","v":139459}]
["Natural gas non-condensing furnace",{"$f":"IF(build1_need_heat,VLOOKUP(A113,build1_heat_options,12,FALSE),0)","v":38365.793240350096},"Air conditioner",{"$f":"IF(build1_need_cool,VLOOKUP(C113,build1_cool_options,12,FALSE),0)","v":13862.287883350924},52228]
["Natural gas condensing furnace",{"$f":"IF(build1_need_heat,VLOOKUP(A114,build1_heat_options,12,FALSE),0)","v":33391.709658090971},"Air conditioner",{"$f":"IF(build1_need_cool,VLOOKUP(C114,build1_cool_options,12,FALSE),0)","v":13862.287883350924},47254]
["Standard efficiency oil furnace",{"$f":"IF(build1_need_heat,VLOOKUP(A115,build1_heat_options,12,FALSE),0)","v":76157.973407784288},"Air conditioner",{"$f":"IF(build1_need_cool,VLOOKUP(C115,build1_cool_options,12,FALSE),0)","v":13862.287883350924},90020]
["Mid-efficiency oil furnace",{"$f":"IF(build1_need_heat,VLOOKUP(A116,build1_heat_options,12,FALSE),0)","v":70485.817633195111},"Air conditioner",{"$f":"IF(build1_need_cool,VLOOKUP(C116,build1_cool_options,12,FALSE),0)","v":13862.287883350924},84348]
["Heat pump",{"$f":"IF(AND(build1_need_heat, build1_need_cool),K81,\"n/a\")","v":"n/a"},"Heat pump",{"$f":"IF(AND(build1_need_heat,build1_need_cool),VLOOKUP(C117,build1_cool_options,12,FALSE),0)","v":"n/a"},"n/a"]
[]
["Row selected","build1_row",{"$f":"MATCH(MIN(E112:E117),E112:E117,0)","v":3}]
["Building 1 heating selection","build1_heat",{"$f":"IF(build1_need_heat,INDEX(A112:A117,build1_row),\"n/a\")","v":"Natural gas condensing furnace"}]
["Building 1 cooling selection","build1_cool",{"$f":"IF(build1_need_cool,INDEX(C112:C117,build1_row),\"n/a\")","v":"Air conditioner"}]
[]
[]
["Building 2 Selection"]
["Heating option","Annual cost","Cooling option","Annual cost","Total annual cost"]
["Electric resistance",{"$f":"IF(build2_need_heat,VLOOKUP(A126,build2_heat_options,12,FALSE),0)","v":43393.256597947802},"Air conditioner",{"$f":"IF(build2_need_cool,VLOOKUP(C126,build2_cool_options,12,FALSE),0)","v":54248.545812418801},{"$f":"IF(OR(B126=\"n/a\",D126=\"n/a\"),\"n/a\",ROUND(B126+D126,0))","v":97642}]
["Natural gas non-condensing furnace",{"$f":"IF(build2_need_heat,VLOOKUP(A127,build2_heat_options,12,FALSE),0)","v":13549.177630044003},"Air conditioner",{"$f":"IF(build2_need_cool,VLOOKUP(C127,build2_cool_options,12,FALSE),0)","v":54248.545812418801},67798]
["Natural gas condensing furnace",{"$f":"IF(build2_need_heat,VLOOKUP(A128,build2_heat_options,12,FALSE),0)","v":11874.10422140676},"Air conditioner",{"$f":"IF(build2_need_cool,VLOOKUP(C128,build2_cool_options,12,FALSE),0)","v":54248.545812418801},66123]
["Standard efficiency oil furnace",{"$f":"IF(build2_need_heat,VLOOKUP(A129,build2_heat_options,12,FALSE),0)","v":26382.611765501366},"Air conditioner",{"$f":"IF(build2_need_cool,VLOOKUP(C129,build2_cool_options,12,FALSE),0)","v":54248.545812418801},80631]
["Mid-efficiency oil furnace",{"$f":"IF(build2_need_heat,VLOOKUP(A130,build2_heat_options,12,FALSE),0)","v":24472.455422019251},"Air conditioner",{"$f":"IF(build2_need_cool,VLOOKUP(C130,build2_cool_options,12,FALSE),0)","v":54248.545812418801},78721]
["Heat pump",{"$f":"IF(AND(build2_need_heat, build2_need_cool),K90,\"n/a\")","v":11866.262476959091},"Heat pump",{"$f":"IF(AND(build1_need_heat,build2_need_cool),VLOOKUP(C131,build2_cool_options,12,FALSE),0)","v":49428.536060918857},61295]
[]
["Row selected","build2_row",{"$f":"MATCH(MIN(E126:E131),E126:E131,0)","v":6}]
["Building 2 heating selection","build2_heat",{"$f":"IF(build2_need_heat,INDEX(A126:A131,build2_row),\"n/a\")","v":"Heat pump"}]
["Building 2 cooling selection","build2_cool",{"$f":"IF(build2_need_cool,INDEX(C126:C131,build2_row),\"n/a\")","v":"Heat pump"}]

{"sheet":"Indirect","index":15,"n_rows":92,"n_cols":5,"rows_kept":92,"cut":false,"hidden":false,"merged":[]}
["Indirect and Add-on Cost Calculations"]
[]
["Calculation","Range Name","Value","Units","Guidance"]
["Buildings and Land"]
["Include buildings?","include_buildings",{"$f":"IF(include_buildings_I=\"no\",0,1)","v":1},"1 = yes, 0 = no"]
["Include land?","include_land",{"$f":"IF(include_land_I=\"no\",0,1)","v":1},"1 = yes, 0 = no"]
[]
["Standby Power"]
["Booster pumps",null,{"$f":"pump_energy*design_flow/average_flow/365/24*1000","v":755.25369134611446},"kW"]
["Lighting",null,{"$f":"IF(include_buildings=0,0,(build1_fp*lighting_energy_1+build2_fp*lighting_energy_2)/365/24)","v":26.17},"kW"]
["Building 1 ventilation",null,{"$f":"IF(include_HVAC=0,0,0.746*fan_pressure_drop*build1_fp*Building_height*air_changes_build1/33000)","v":6.0656581818181827},"kW"]
["Building 2 ventilation",null,{"$f":"IF(include_HVAC=0,0,0.746*fan_pressure_drop*build2_fp*Building_height*air_changes_build2/33000)","v":2.0526303030303028},"kW"]
["Total base standby power requirement","std_base",{"$f":"SUM(C9:C12)","v":789.54197983096299},"kW"]
[]
["Electric heating for Building 1?","build1_elec_heat",{"$f":"IF(build1_need_heat=1,VLOOKUP(build1_heat,build1_heat_options,8,FALSE)=\"MWh/yr\",FALSE)","v":false}]
["Power to heat Building 1","build1_elec_heat_power",{"$f":"IF(build1_elec_heat,VLOOKUP(build1_heat,build1_heat_options,7,FALSE),0)*365.25*24/1000","v":0},"kW"]
["Electric heating for Building 2?","build2_elec_heat",{"$f":"IF(build2_need_heat,(VLOOKUP(build2_heat,build2_heat_options,8,FALSE)=\"MWh/yr\"),FALSE)","v":true}]
["Power to heat Building 2","build2_elec_heat_power",{"$f":"IF(build2_elec_heat,VLOOKUP(build2_heat,build2_heat_options,7,FALSE),0)*365.25*24/1000","v":858.11828071022364},"kW"]
["Standby power for heating","std_heat",{"$f":"build1_elec_heat_power+build2_elec_heat_power","v":858.11828071022364},"kW"]
[]
["Electric cooling for Building 1?","build1_elec_cool",{"$f":"IF(build1_need_cool,(VLOOKUP(build1_cool,build1_cool_options,8,FALSE)=\"MWh/yr\"),FALSE)","v":true}]
["Power to cool Building 1","build1_elec_cool_power",{"$f":"IF(build1_elec_cool,VLOOKUP(build1_cool,build1_cool_options,7,FALSE),0)*365.25*24/1000","v":780.99258995337857},"kW"]
["Electric cooling for Building 2?","build2_elec_cool",{"$f":"IF(build2_need_cool,(VLOOKUP(build2_cool,build2_cool_options,8,FALSE)=\"MWh/yr\"),FALSE)","v":true}]
["Power to cool Building 2","build2_elec_cool_power",{"$f":"IF(build2_elec_cool,VLOOKUP(build2_cool,build2_cool_options,7,FALSE),0)*365.25*24/1000","v":3303.4860852291517},"kW"]
["Standby power for cooling","std_cool",{"$f":"build1_elec_cool_power+build2_elec_cool_power","v":4084.4786751825304},"kW"]
[]
["Total standby power requirements","std_power",{"$f":"ROUNDUP(2*MAX(min_standby,(IF(AND(need_heat=1,need_cool=1),MAX(std_heat,std_cool),need_heat*std_heat+need_cool*std_cool)+std_base)*(1+std_safety_factor)),0)/2","v":790},"kW"]
["Total standby power cost","std_power_cost",{"$f":"VLOOKUP(std_power,std_gen_cost_cl,3)*std_power","v":166453.74669187146}]
[]
["Geotechnical & Sitework"]
["Total technology footprint","tech_fp",{"$f":"total_fp+ep_fp+solids_pad_area","v":26170},"square feet"]
["Maximum basin excavation depth","max_excav_depth",{"$f":"IF(res_holding=\"basins\",hbasin_depth,0)","v":0},"feet"]
["Borehole depth","bore_depth",{"$f":"IF(max_excav_depth=0,bore_depth_nobasin,IF(max_excav_depth>deep_bore_need,bore_depth_max,bore_depth_min))","v":10},"feet"]
["Number of test pits","num_pits",{"$f":"IF(OR(max_excav_depth>0,tech_fp>bore_need),0,ROUNDUP(tech_fp/hole_per_sf,0))","v":0}]
["Number of boreholes","num_holes",{"$f":"IF(AND(max_excav_depth=0,tech_fp<bore_need),0,IF(ROUNDUP(tech_fp/hole_per_sf,0)<min_holes,min_holes,ROUNDUP(tech_fp/hole_per_sf,0)))","v":27}]
[]
["Costs"]
["Borings, initial field stake out & determination of elevations",null,{"$f":"IF(num_pits>0,1,ROUNDUP(num_holes/hole_per_job,0))*VLOOKUP(0,stake_out_cost_cl,3)","v":2867.8485388080021}]
["Borings, drawings showing boring details",null,{"$f":"ROUNDUP(num_holes/hole_per_job,0)*VLOOKUP(0,bore_draw_cost_cl,3)","v":955.94951293600081}]
["Borings, report and recommendations from P.E.",null,{"$f":"IF(num_pits>0,1,ROUNDUP(num_holes/hole_per_job,0))*VLOOKUP(0,bore_report_cost_cl,3)","v":2181.8141824656959}]
["Borings, mobilization and demobilization, minimum",null,{"$f":"IF(num_pits>0,0,1)*VLOOKUP(0,bore_mob_cost_cl,3)","v":753.51314549073004}]
["Borings, drill rig and crew with truck mounted auger",null,{"$f":"ROUNDUP(bore_depth*num_holes/hole_per_day,0)*VLOOKUP(0,bore_rig_cost_cl,3)","v":15042.146747669423}]
["Borings, cased borings in earth, w/samples, 2.5\" dia",null,{"$f":"num_holes*bore_depth*VLOOKUP(0,bore_cost_cl,3)","v":21863.127684089239}]
["Test pits",null,{"$f":"pit_width*pit_length*pit_depth/27*num_pits*VLOOKUP(0,pit_cost_cl,3)","v":0}]
["Total geotechnical cost","geotech_cost",{"$f":"SUM(C38:C44)","v":43664.399811459094}]
[]
["Total sitework cost","sitework_cost",{"$f":"(tech_fp-ep_fp)*sitework_sf_cl","v":335378.61538461538}]
[]
["Yard Piping"]
["Actual yard piping diameter","yard_pipe_diam",{"$f":"SUMPRODUCT(OUTPUT!G104:G108,OUTPUT!L104:L108)","v":36},"in. diam","Based on output sheet selection for inlet and outlet pipe"]
["Trench depth to top of pipe","trench_depth",{"$f":"MAX(frost,min_trench_depth)","v":38},"inches"]
["Thrust force","thrust_force",{"$f":"VLOOKUP(yard_pipe_diam,thrust_block_table_cl,2)*2.2","v":274490.91871853283},"lbs"]
["Bearing Area (L x H)","bearing_area",{"$f":"1.5*thrust_force/(soil_dens*(trench_depth/12+yard_pipe_diam/12)*Coeff_Kp*Reduction)","v":491.31372517357545},"square ft"]
["L",null,{"$f":"bearing_area/C55","v":31.346889005883039},"ft"]
["H",null,{"$f":"(bearing_area/2)^0.5","v":15.673444502941519},"ft"]
["F",null,{"$f":"MAX(0.5,yard_pipe_diam/12)","v":3},"ft","Pipe diameter with a minimum of 6 inches"]
["T",null,{"$f":"C54/2","v":15.673444502941519},"ft"]
["Thrust block volume","block_vol",{"$f":"(C57+(yard_pipe_diam/12)/2)*(C54+C56)/2*C55/27","v":171.20463112639743},"cy"]
["Trench Cross-section Area","trench_area",{"$f":"(yard_pipe_diam/12+2)*(bedding_depth/12+yard_pipe_diam/12+trench_depth/12)+(bedding_depth/12+yard_pipe_diam/12+trench_depth/12)^2*TAN(trench_angle)","v":77.777777777777757},"square ft"]
["Trench Volume Source Water",null,{"$f":"trench_area*yard_in/27","v":0},"cy"]
["Trench Volume Inlet & Outlet",null,{"$f":"((2*non_fire_buffer)+2*(build1_fp^0.5)/4)*trench_area/27","v":272.98934896729406},"cy"]
["Trench Volume Between Buildings",null,{"$f":"IF(build2_fp=0,0,((2*non_fire_buffer)+2*(build2_fp^0.5)/4)*trench_area/27)","v":146.51777410212074},"cy"]
["Trench Volume to Distribution Network",null,{"$f":"trench_area*yard_out/27","v":0},"cy"]
["Trench Volume total","trench_vol",{"$f":"SUM(C60:C63)+block_vol","v":590.7117541958122},"cy"]
["Equivalent pipe length","yard_pipe_length",{"$f":"yard_in+yard_out+2*((2*non_fire_buffer)+2*(build1_fp^0.5)/4+IF(build2_fp=0,0,((2*non_fire_buffer)+2*(build2_fp^0.5)/4))+2*(trench_depth+yard_pipe_diam)/12)","v":315.92446925486047},"lf"]
["Bedding cross sectional surface area",null,{"$f":"(yard_pipe_diam/12+2)*(bedding_depth/12+yard_pipe_diam/12*bedding_pct)+(bedding_depth/12+yard_pipe_diam/12*bedding_pct)^2*TAN(trench_angle)-((yard_pipe_diam/12/2)^2*ACOS((yard_pipe_diam/12/2-bedding_pct*yard_pipe_diam/12)/(yard_pipe_diam/12/2))-(yard_pipe_diam/12/2-yard_pipe_diam/12*bedding_pct)*((2*yard_pipe_diam/12/2*yard_pipe_diam/12*bedding_pct-(yard_pipe_diam/12*bedding_pct)^2)^0.5))","v":6.4305840890651487},"square ft"]
["Bedding volume","bedding_vol",{"$f":"C66*yard_pipe_length/2/27","v":37.621830839567728},"cy"]
[]
["Costs"]
["Bedding cost",null,{"$f":"VLOOKUP(0,bedding_cost_cl,3)*bedding_vol","v":2107.1007401987058}]
["Excavation cost",null,{"$f":"trench_vol*VLOOKUP(0,excavate_cost_cl,3)","v":18356.09943434599}]
["Backfill cost",null,{"$f":"trench_vol*VLOOKUP(0,backfill_cost_cl,3)","v":8509.9470846634686}]
["Thrust block cost",null,{"$f":"block_vol*VLOOKUP(0,conc_basin_cost_cl,3)","v":102939.37260080394}]
["Pipe cost",null,{"$f":"yard_pipe_length*SUMPRODUCT(OUTPUT!I104:I108,OUTPUT!L104:L108)","v":48615.119988410297},null,"Based on output sheet selection for inlet and outlet pipe"]
["Total yard piping cost","yard_cost",{"$f":"SUM(C70:C74)","v":180527.6398484224}]
[]
["Permits"]
["Building #1 value",null,{"$f":"SUMPRODUCT(OUTPUT!K309:K321,OUTPUT!L309:L321)","v":90},null,"Determined using Use? Column of output sheet"]
["Building #2 value",null,{"$f":"SUMPRODUCT(OUTPUT!K323:K335,OUTPUT!L323:L335)","v":65},null,"Determined using Use? Column of output sheet"]
["Building permit cost",null,{"$f":"BPCost_UBC97(C78)+BPCost_UBC97(C79)","v":47},null,"Uses custom function to apply formulae developed in SAIC Permit Report 2004"]
["NPDES permit cost",null,{"$f":"IF(res_s2_opt=1,VLOOKUP(res_flow_annual/365,NPDES_permit_cost_cl,2),0)","v":0},null,"Included only if direct discharge to surface water is the management option chosen on the input sheet"]
["Storm water permit cost",null,{"$f":"VLOOKUP(land_required,SW_permit_cost_cl,2)","v":0},null,"Applies to systems requiring 1 acre of land or greater"]
["Risk management plan",null,{"$f":"IF(AND(HCl_pct>HCl_strength_RMP,total_HCl_lbs>HCl_quant_RMP),RMP_cost_cl,0)","v":0},null,"Triggered if high strength HCl stored in large quantities"]
["NEPA compliance",null,{"$f":"IF(include_NEPA=2,0,IF(OR(component_level=2,include_NEPA=1),VLOOKUP(land_required,NEPA_cost_cl,2),0))","v":0},null,"Included only for high cost estimates, unless assumption \"include_NEPA\" is changed on CDA sheet"]
["Total permit cost","permit_cost",{"$f":"SUM(C80:C84)","v":47}]
[]
["Construction Management and General Contractor Job Overhead"]
["Builder's risk insurance percentage",null,{"$f":"br_ins_pct*direct_cost","v":50307.349904305833}]
["Performance bond cost",null,{"$f":"include_bond*(VLOOKUP(direct_cost,performance_bond_table_cl,3)+VLOOKUP(direct_cost,performance_bond_table_cl,4)*(direct_cost-VLOOKUP(direct_cost,performance_bond_table_cl,5)))","v":108527.67630171619},null,"Bracket determined from direct capital cost"]
["Construction management percentage",null,{"$f":"VLOOKUP(direct_cost,construction_mgt_table_cl,3)","v":3.2000000000000001E-2},null,"Looked up from direct capital cost"]
["Construction management fee",null,{"$f":"IF(ss_cat2=1,include_cm_pre,include_cm)*C90*direct_cost","v":473480.94027581962}]
["Total construction management/job overhead cost","cm_cost",{"$f":"SUM(C88:C89,C91)","v":632315.96648184163}]

{"sheet":"Standard Inputs","index":16,"n_rows":51,"n_cols":32,"rows_kept":51,"cut":false,"hidden":false,"merged":[[5,0,5,1],[6,30,6,31],[5,19,5,28],[5,2,5,5],[5,6,5,7],[5,8,5,13],[5,14,5,18]]}
["Standard Designs"]
["Default inputs represent typical options used to generate national average compliance costs."]
[]
[]
[]
["Design Indices",null,"System Size",null,null,null,"Regen",null,"System Configuration and Vessel Design",null,null,null,null,null,"Residuals",null,null,null,null,"Optional"]
["Resin #","Design #","Design flow (mgd)","Design Flow Units",{"$f":"IF(COUNTIF(F9:F48,\"=1\")>0,\"Average flow (mgd)\",\"\")","v":""},"Average flow units","Regen or throwaway","# bed volumes","Number of Vessels in Series","EBCT","Bed depth","Vessel geometry","Height","Diameter","Brine delivery","Holding tank for spent regenerant","Discharge option for spent regenerant","Characteristics of spent resin","Characteristics of evaporation pond or holding tank solids","# booster pumps","# redundant vessels","Treated water corrosion control","Backwash pumping","Backwash storage","System Automation","Component level","Include buildings?","Include HVAC?","Include land?",null,"Internal Use"]
[null,null,"design_flow_I","df_units","average_flow_I","af_units","throwaway_I","BV_regen","num_tanks_I","EBCT_I","bed_depth","tank_geom_I","comm_height_length","comm_diam","brine_method_I","res_s1_opt_I","res_s2_opt_I","media_haz_I","solids_haz_I","lines_pump_I","NRD_I","pH_adj","no_backwash_I","no_back_tank_I","manual_I","component_level_I","include_buildings_I","include_HVAC_I","include_land_I"]
[1,1,0.03,"MGD",7.0000000000000001E-3,"MGD","regeneration",1000,2,12,3.5,"upright",6,2.5,"brine mixing tanks","no holding tank","POTW","non-hazardous",null,null,null,null,null,null,"fully automated",null,null,null,null,null,{"$f":"AND(C9:AC9=inp_used,A9=inp_used_usersel)","v":false},{"$f":"AND(C9:F9=inp_used_minimal,A9=inp_used_usersel)","v":false}]
[1,2,0.124,"MGD",3.5000000000000003E-2,"MGD","regeneration",1000,2,12,4.4000000000000004,"upright",7.5,4.5,"brine mixing tanks","no holding tank","POTW","non-hazardous",null,null,null,null,null,null,"fully automated",null,null,null,null,null,{"$f":"AND(C10:AC10=inp_used,A10=inp_used_usersel)","v":false},{"$f":"AND(C10:F10=inp_used_minimal,A10=inp_used_usersel)","v":false}]
[1,3,0.30499999999999999,"MGD",9.4E-2,"MGD","regeneration",1000,2,12,4.5,"upright",7.5,7,"brine mixing tanks","no holding tank","POTW","non-hazardous",null,null,null,null,null,null,"fully automated",null,null,null,null,null,{"$f":"AND(C11:AC11=inp_used,A11=inp_used_usersel)","v":false},{"$f":"AND(C11:F11=inp_used_minimal,A11=inp_used_usersel)","v":false}]
[1,4,0.74,"MGD",0.251,"MGD","regeneration",1000,2,12,4.4000000000000004,"upright",7.5,5.5,"brine mixing tanks","holding tank","POTW","non-hazardous","non-hazardous",null,null,null,null,null,"fully automated",null,null,null,null,null,{"$f":"AND(C12:AC12=inp_used,A12=inp_used_usersel)","v":false},{"$f":"AND(C12:F12=inp_used_minimal,A12=inp_used_usersel)","v":false}]
[1,5,2.1520000000000001,"MGD",0.81899999999999995,"MGD","regeneration",1000,2,12,4.7,"upright",8,10.5,"brine mixing tanks","holding tank","POTW","non-hazardous","non-hazardous",null,null,null,null,null,"fully automated",null,null,null,null,null,{"$f":"AND(C13:AC13=inp_used,A13=inp_used_usersel)","v":false},{"$f":"AND(C13:F13=inp_used_minimal,A13=inp_used_usersel)","v":false}]
[1,6,7.3650000000000002,"MGD",3.2,"MGD","regeneration",1000,2,12,4.5,"horizontal",22,10.5,"brine mixing tanks","holding tank","POTW","non-hazardous","non-hazardous",null,null,null,null,null,"fully automated",null,null,null,null,null,{"$f":"AND(C14:AC14=inp_used,A14=inp_used_usersel)","v":false},{"$f":"AND(C14:F14=inp_used_minimal,A14=inp_used_usersel)","v":false}]
[1,7,22.614000000000001,"MGD",11.066000000000001,"MGD","regeneration",1000,2,12,4.5999999999999996,"horizontal",22,10.5,"brine mixing tanks","holding tank","POTW","non-hazardous","non-hazardous",null,null,null,null,null,"fully automated",null,null,null,null,null,{"$f":"AND(C15:AC15=inp_used,A15=inp_used_usersel)","v":false},{"$f":"AND(C15:F15=inp_used_minimal,A15=inp_used_usersel)","v":false}]
[1,8,75.072000000000003,"MGD",37.536000000000001,"MGD","regeneration",1000,2,12,4.5999999999999996,"horizontal",31,10.5,"brine mixing tanks","holding tank","POTW","non-hazardous","non-hazardous",null,null,null,null,null,"fully automated",null,null,null,null,null,{"$f":"AND(C16:AC16=inp_used,A16=inp_used_usersel)","v":false},{"$f":"AND(C16:F16=inp_used_minimal,A16=inp_used_usersel)","v":false}]
[2,1,0.03,"MGD",7.0000000000000001E-3,"MGD","regeneration",2000,2,12,3.5,"upright",6,2.5,"brine mixing tanks","no holding tank","POTW","non-hazardous",null,null,null,null,null,null,"fully automated",null,null,null,null,null,{"$f":"AND(C17:AC17=inp_used,A17=inp_used_usersel)","v":false},{"$f":"AND(C17:F17=inp_used_minimal,A17=inp_used_usersel)","v":false}]
[2,2,0.124,"MGD",3.5000000000000003E-2,"MGD","regeneration",2000,2,12,4.4000000000000004,"upright",7.5,4.5,"brine mixing tanks","no holding tank","POTW","non-hazardous",null,null,null,null,null,null,"fully automated",null,null,null,null,null,{"$f":"AND(C18:AC18=inp_used,A18=inp_used_usersel)","v":false},{"$f":"AND(C18:F18=inp_used_minimal,A18=inp_used_usersel)","v":false}]
[2,3,0.30499999999999999,"MGD",9.4E-2,"MGD","regeneration",2000,2,12,4.5,"upright",7.5,7,"brine mixing tanks","no holding tank","POTW","non-hazardous",null,null,null,null,null,null,"fully automated",null,null,null,null,null,{"$f":"AND(C19:AC19=inp_used,A19=inp_used_usersel)","v":false},{"$f":"AND(C19:F19=inp_used_minimal,A19=inp_used_usersel)","v":false}]
[2,4,0.74,"MGD",0.251,"MGD","regeneration",2000,2,12,4.4000000000000004,"upright",7.5,11,"brine mixing tanks","no holding tank","POTW","non-hazardous",null,null,null,null,null,null,"fully automated",null,null,null,null,null,{"$f":"AND(C20:AC20=inp_used,A20=inp_used_usersel)","v":false},{"$f":"AND(C20:F20=inp_used_minimal,A20=inp_used_usersel)","v":false}]
[2,5,2.1520000000000001,"MGD",0.81899999999999995,"MGD","regeneration",2000,2,12,4.7,"upright",8,10.5,"brine mixing tanks","holding tank","POTW","non-hazardous","non-hazardous",null,null,null,null,null,"fully automated",null,null,null,null,null,{"$f":"AND(C21:AC21=inp_used,A21=inp_used_usersel)","v":false},{"$f":"AND(C21:F21=inp_used_minimal,A21=inp_used_usersel)","v":false}]
[2,6,7.3650000000000002,"MGD",3.2,"MGD","regeneration",2000,2,12,4.7,"horizontal",21,10.5,"brine mixing tanks","holding tank","POTW","non-hazardous","non-hazardous",null,null,null,null,null,"fully automated",null,null,null,null,null,{"$f":"AND(C22:AC22=inp_used,A22=inp_used_usersel)","v":false},{"$f":"AND(C22:F22=inp_used_minimal,A22=inp_used_usersel)","v":false}]
[2,7,22.614000000000001,"MGD",11.066000000000001,"MGD","regeneration",2000,2,12,4.7,"horizontal",32,10.5,"brine mixing tanks","holding tank","POTW","non-hazardous","non-hazardous",null,null,null,null,null,"fully automated",null,null,null,null,null,{"$f":"AND(C23:AC23=inp_used,A23=inp_used_usersel)","v":false},{"$f":"AND(C23:F23=inp_used_minimal,A23=inp_used_usersel)","v":false}]
[2,8,75.072000000000003,"MGD",37.536000000000001,"MGD","regeneration",2000,2,12,4.5999999999999996,"horizontal",31,10.5,"brine mixing tanks","holding tank","POTW","non-hazardous","non-hazardous",null,null,null,null,null,"fully automated",null,null,null,null,null,{"$f":"AND(C24:AC24=inp_used,A24=inp_used_usersel)","v":false},{"$f":"AND(C24:F24=inp_used_minimal,A24=inp_used_usersel)","v":false}]
[3,1,0.03,"MGD",7.0000000000000001E-3,"MGD","throwaway",22000,2,3,2.4,"upright",4.5,1.5,null,"no holding tank","POTW","non-hazardous",null,null,null,null,null,null,"fully automated",null,null,null,null,null,{"$f":"AND(C25:AC25=inp_used,A25=inp_used_usersel)","v":false},{"$f":"AND(C25:F25=inp_used_minimal,A25=inp_used_usersel)","v":false}]
[3,2,0.124,"MGD",3.5000000000000003E-2,"MGD","throwaway",22000,2,3,2.4,"upright",4.5,3.5,null,"no holding tank","POTW","non-hazardous",null,null,null,null,null,null,"fully automated",null,null,null,null,null,{"$f":"AND(C26:AC26=inp_used,A26=inp_used_usersel)","v":false},{"$f":"AND(C26:F26=inp_used_minimal,A26=inp_used_usersel)","v":false}]
[3,3,0.30499999999999999,"MGD",9.4E-2,"MGD","throwaway",22000,2,3,2.4,"upright",4.5,5,null,"no holding tank","POTW","non-hazardous",null,null,null,null,null,null,"fully automated",null,null,null,null,null,{"$f":"AND(C27:AC27=inp_used,A27=inp_used_usersel)","v":false},{"$f":"AND(C27:F27=inp_used_minimal,A27=inp_used_usersel)","v":false}]
[3,4,0.74,"MGD",0.251,"MGD","throwaway",22000,2,3,2.4,"upright",6,7.5,null,"no holding tank","POTW","non-hazardous",null,null,null,null,null,null,"fully automated",null,null,null,null,null,{"$f":"AND(C28:AC28=inp_used,A28=inp_used_usersel)","v":false},{"$f":"AND(C28:F28=inp_used_minimal,A28=inp_used_usersel)","v":false}]
[3,5,2.1520000000000001,"MGD",0.81899999999999995,"MGD","throwaway",22000,2,3,2.4,"upright",6,9,null,"no holding tank","POTW","non-hazardous",null,null,null,null,null,null,"fully automated",null,null,null,null,null,{"$f":"AND(C29:AC29=inp_used,A29=inp_used_usersel)","v":false},{"$f":"AND(C29:F29=inp_used_minimal,A29=inp_used_usersel)","v":false}]
[3,6,7.3650000000000002,"MGD",3.2,"MGD","throwaway",22000,2,3,2.4,"upright",6,13.5,null,"no holding tank","POTW","non-hazardous",null,null,null,null,null,null,"fully automated",null,null,null,null,null,{"$f":"AND(C30:AC30=inp_used,A30=inp_used_usersel)","v":false},{"$f":"AND(C30:F30=inp_used_minimal,A30=inp_used_usersel)","v":false}]
[3,7,22.614000000000001,"MGD",11.066000000000001,"MGD","throwaway",22000,2,3,2.4,"horizontal",33,10,null,"no holding tank","POTW","non-hazardous",null,null,null,null,null,null,"fully automated",null,null,null,null,null,{"$f":"AND(C31:AC31=inp_used,A31=inp_used_usersel)","v":false},{"$f":"AND(C31:F31=inp_used_minimal,A31=inp_used_usersel)","v":false}]
[3,8,75.072000000000003,"MGD",37.536000000000001,"MGD","throwaway",22000,2,3,2.4,"horizontal",34,10,null,"no holding tank","POTW","non-hazardous",null,null,null,null,null,null,"fully automated",null,null,null,null,null,{"$f":"AND(C32:AC32=inp_used,A32=inp_used_usersel)","v":false},{"$f":"AND(C32:F32=inp_used_minimal,A32=inp_used_usersel)","v":false}]
[4,1,0.03,"MGD",7.0000000000000001E-3,"MGD","throwaway",250000,2,3,2.4,"upright",4.5,1.5,null,"no holding tank","POTW","non-hazardous",null,null,null,null,null,null,"fully automated",null,null,null,null,null,{"$f":"AND(C33:AC33=inp_used,A33=inp_used_usersel)","v":false},{"$f":"AND(C33:F33=inp_used_minimal,A33=inp_used_usersel)","v":false}]
[4,2,0.124,"MGD",3.5000000000000003E-2,"MGD","throwaway",250000,2,3,2.4,"upright",4.5,3.5,null,"no holding tank","POTW","non-hazardous",null,null,null,null,null,null,"fully automated",null,null,null,null,null,{"$f":"AND(C34:AC34=inp_used,A34=inp_used_usersel)","v":false},{"$f":"AND(C34:F34=inp_used_minimal,A34=inp_used_usersel)","v":false}]
[4,3,0.30499999999999999,"MGD",9.4E-2,"MGD","throwaway",250000,2,3,2.4,"upright",4.5,5,null,"no holding tank","POTW","non-hazardous",null,null,null,null,null,null,"fully automated",null,null,null,null,null,{"$f":"AND(C35:AC35=inp_used,A35=inp_used_usersel)","v":false},{"$f":"AND(C35:F35=inp_used_minimal,A35=inp_used_usersel)","v":false}]
[4,4,0.74,"MGD",0.251,"MGD","throwaway",250000,2,3,2.4,"upright",6,7.5,null,"no holding tank","POTW","non-hazardous",null,null,null,null,null,null,"fully automated",null,null,null,null,null,{"$f":"AND(C36:AC36=inp_used,A36=inp_used_usersel)","v":false},{"$f":"AND(C36:F36=inp_used_minimal,A36=inp_used_usersel)","v":false}]
[4,5,2.1520000000000001,"MGD",0.81899999999999995,"MGD","throwaway",250000,2,3,2.4,"upright",6,9,null,"no holding tank","POTW","non-hazardous",null,null,null,null,null,null,"fully automated",null,null,null,null,null,{"$f":"AND(C37:AC37=inp_used,A37=inp_used_usersel)","v":false},{"$f":"AND(C37:F37=inp_used_minimal,A37=inp_used_usersel)","v":false}]
[4,6,7.3650000000000002,"MGD",3.2,"MGD","throwaway",250000,2,3,2.4,"upright",6,13.5,null,"no holding tank","POTW","non-hazardous",null,null,null,null,null,null,"fully automated",null,null,null,null,null,{"$f":"AND(C38:AC38=inp_used,A38=inp_used_usersel)","v":false},{"$f":"AND(C38:F38=inp_used_minimal,A38=inp_used_usersel)","v":false}]
[4,7,22.614000000000001,"MGD",11.066000000000001,"MGD","throwaway",250000,2,3,2.4,"horizontal",33,10,null,"no holding tank","POTW","non-hazardous",null,null,null,null,null,null,"fully automated",null,null,null,null,null,{"$f":"AND(C39:AC39=inp_used,A39=inp_used_usersel)","v":false},{"$f":"AND(C39:F39=inp_used_minimal,A39=inp_used_usersel)","v":false}]
[4,8,75.072000000000003,"MGD",37.536000000000001,"MGD","throwaway",250000,2,3,2.4,"horizontal",34,10,null,"no holding tank","POTW","non-hazardous",null,null,null,null,null,null,"fully automated",null,null,null,null,null,{"$f":"AND(C40:AC40=inp_used,A40=inp_used_usersel)","v":true},{"$f":"AND(C40:F40=inp_used_minimal,A40=inp_used_usersel)","v":true}]
[5,1,0.03,"MGD",7.0000000000000001E-3,"MGD",null,null,null,null,null,null,null,null,null,null,null,null,null,null,null,null,null,null,null,null,null,null,null,null,{"$f":"AND(C41:AC41=inp_used,A41=inp_used_usersel)","v":false},{"$f":"AND(C41:F41=inp_used_minimal,A41=inp_used_usersel)","v":false}]
[5,2,0.124,"MGD",3.5000000000000003E-2,"MGD",null,null,null,null,null,null,null,null,null,null,null,null,null,null,null,null,null,null,null,null,null,null,null,null,{"$f":"AND(C42:AC42=inp_used,A42=inp_used_usersel)","v":false},{"$f":"AND(C42:F42=inp_used_minimal,A42=inp_used_usersel)","v":false}]
[5,3,0.30499999999999999,"MGD",9.4E-2,"MGD",null,null,null,null,null,null,null,null,null,null,null,null,null,null,null,null,null,null,null,null,null,null,null,null,{"$f":"AND(C43:AC43=inp_used,A43=inp_used_usersel)","v":false},{"$f":"AND(C43:F43=inp_used_minimal,A43=inp_used_usersel)","v":false}]
[5,4,0.74,"MGD",0.251,"MGD",null,null,null,null,null,null,null,null,null,null,null,null,null,null,null,null,null,null,null,null,null,null,null,null,{"$f":"AND(C44:AC44=inp_used,A44=inp_used_usersel)","v":false},{"$f":"AND(C44:F44=inp_used_minimal,A44=inp_used_usersel)","v":false}]
[5,5,2.1520000000000001,"MGD",0.81899999999999995,"MGD",null,null,null,null,null,null,null,null,null,null,null,null,null,null,null,null,null,null,null,null,null,null,null,null,{"$f":"AND(C45:AC45=inp_used,A45=inp_used_usersel)","v":false},{"$f":"AND(C45:F45=inp_used_minimal,A45=inp_used_usersel)","v":false}]
[5,6,7.3650000000000002,"MGD",3.2,"MGD",null,null,null,null,null,null,null,null,null,null,null,null,null,null,null,null,null,null,null,null,null,null,null,null,{"$f":"AND(C46:AC46=inp_used,A46=inp_used_usersel)","v":false},{"$f":"AND(C46:F46=inp_used_minimal,A46=inp_used_usersel)","v":false}]
[5,7,22.614000000000001,"MGD",11.066000000000001,"MGD",null,null,null,null,null,null,null,null,null,null,null,null,null,null,null,null,null,null,null,null,null,null,null,null,{"$f":"AND(C47:AC47=inp_used,A47=inp_used_usersel)","v":false},{"$f":"AND(C47:F47=inp_used_minimal,A47=inp_used_usersel)","v":false}]
[5,8,75.072000000000003,"MGD",37.536000000000001,"MGD",null,null,null,null,null,null,null,null,null,null,null,null,null,null,null,null,null,null,null,null,null,null,null,null,{"$f":"AND(C48:AC48=inp_used,A48=inp_used_usersel)","v":false},{"$f":"AND(C48:F48=inp_used_minimal,A48=inp_used_usersel)","v":false}]
[]
[{"$f":"IF(LEN(resin_type)=0,\"\",resin_type)","v":4},"in use",{"$f":"IF(LEN(design_flow_I)=0,\"\",design_flow_I)","v":75.072000000000003},{"$f":"IF(LEN(df_units)=0,\"\",df_units)","v":"MGD"},{"$f":"IF(LEN(average_flow_I)=0,\"\",average_flow_I)","v":37.536000000000001},{"$f":"IF(LEN(af_units)=0,\"\",af_units)","v":"MGD"},{"$f":"IF(LEN(throwaway_I)=0,\"\",throwaway_I)","v":"throwaway"},{"$f":"IF(LEN(BV_regen)=0,\"\",BV_regen)","v":250000},{"$f":"IF(LEN(num_tanks_I)=0,\"\",num_tanks_I)","v":2},{"$f":"IF(LEN(EBCT_I)=0,\"\",EBCT_I)","v":3},{"$f":"IF(LEN(bed_depth)=0,\"\",bed_depth)","v":2.4},{"$f":"IF(LEN(tank_geom_I)=0,\"\",tank_geom_I)","v":"horizontal"},{"$f":"IF(LEN(comm_height_length)=0,\"\",comm_height_length)","v":34},{"$f":"IF(LEN(comm_diam)=0,\"\",comm_diam)","v":10},{"$f":"IF(LEN(brine_method_I)=0,\"\",brine_method_I)","v":""},{"$f":"IF(LEN(res_s1_opt_I)=0,\"\",res_s1_opt_I)","v":"no holding tank"},{"$f":"IF(LEN(res_s2_opt_I)=0,\"\",res_s2_opt_I)","v":"POTW"},{"$f":"IF(LEN(media_haz_I)=0,\"\",media_haz_I)","v":"non-hazardous"},{"$f":"IF(LEN(solids_haz_I)=0,\"\",solids_haz_I)","v":""},{"$f":"IF(LEN(lines_pump_I)=0,\"\",lines_pump_I)","v":""},{"$f":"IF(LEN(NRD_I)=0,\"\",NRD_I)","v":""},{"$f":"IF(LEN(pH_adj)=0,\"\",pH_adj)","v":""},{"$f":"IF(LEN(no_backwash_I)=0,\"\",no_backwash_I)","v":""},{"$f":"IF(LEN(no_back_tank_I)=0,\"\",no_back_tank_I)","v":""},{"$f":"IF(LEN(manual_I)=0,\"\",manual_I)","v":"fully automated"},{"$f":"IF(LEN(component_level_I)=0,\"\",component_level_I)","v":""},{"$f":"IF(LEN(include_buildings_I)=0,\"\",include_buildings_I)","v":""},{"$f":"IF(LEN(include_HVAC_I)=0,\"\",include_HVAC_I)","v":""},{"$f":"IF(LEN(include_land_I)=0,\"\",include_land_I)","v":""},"<--current inputs"]
[null,null,75.072000000000003,"MGD",37.536000000000001,"MGD","throwaway",250000,2,3,2.4,"horizontal",34,10,null,"no holding tank","POTW","non-hazardous",null,null,null,null,null,null,"fully automated",null,null,null,null,"<--inputs used at last \"Generate Results\"",{"$f":"AND(C51:AC51=inp_used)","v":true}]

{"sheet":"AutoSize","index":17,"n_rows":124,"n_cols":6,"rows_kept":124,"cut":false,"hidden":false,"merged":[[0,0,0,6]]}
["This sheet is used internally by the Auto Size macro to iteratively select the lowest capital cost design meeting engineering constraints.  This sheet is used only if the Auto Size button is clicked.  Advanced users may adjust the automated sizing procedure following the guidance below."]
["Bold blue cells are copied to the input sheet"]
["Bold gold cells are inputs to the sizing procedure"]
[]
["Input Parameters"]
["design flow rate",null,{"$f":"design_flow_rate","v":52133.333333333336},"gpm"]
["vessels per line",null,{"$f":"Num_tanks","v":2}]
["EBCT per line",null,{"$f":"EBCT","v":3},"min"]
["EBCT per vessel",null,{"$f":"EBCT_tank","v":1.5},"min"]
["Total Vessel Media Volume","comp_vol_required_stg1",{"$f":"design_flow_rate*EBCT_tank/7.48","v":10454.545454545454},"ft^3","volume of media in first-stage vessels"]
["Round surface area?","comp_round_sa",0,null,"<--Enter 1 to design for rounding on vessel design sheet, 0 otherwise"]
["minimum surface area","comp_sa_min",{"$f":"design_flow_rate/load_max","v":4344.4444444444443},"ft^2","to reach maximum loading rate"]
["maximum surface area","comp_sa_max",{"$f":"design_flow_rate/load_min","v":52133.333333333336},"ft^2","to reach minimum loading rate"]
["required dry volume","comp_vol_required",{"$f":"design_flow_rate*EBCT/7.481","v":20906.295949739339},"ft^3","volume of media in all vessels"]
[]
["Vertical design search"]
["max media volume, vertical vessel","comp_vert_max_media",{"$f":"(comp_max_vert_diam/2-Vessel_thickness)*(comp_max_vert_diam/2-Vessel_thickness)*PI()*comp_max_vert_bed_depth","v":923.62824015539911},"ft^3","based on guidance and CDAs for max dimensions"]
["max surface area, vertical vessel","comp_vert_max_sa",{"$f":"(max_diam/2-Vessel_thickness)*(max_diam/2-Vessel_thickness)*PI()","v":153.93804002589985},"ft^2","based on max_diam CDA"]
["target bed depth","comp_target_bed_depth_vert",{"$f":"IF(design_flow<=1,VLOOKUP(\"target_bed_depth_under\",resin_table,resin_type+1,FALSE),VLOOKUP(\"target_bed_depth_over\",resin_table,resin_type+1,FALSE))","v":4.5999999999999996},"ft","based on target_load CDA"]
["total vessel surface area","comp_sa_required_vert",{"$f":"comp_vol_required_stg1/comp_target_bed_depth_vert","v":2272.727272727273},"ft^2","based upon  media volume and bed depth"]
["min number of lines, vertical vessels:",null,null,null,"below this number of lines, we are constrained to horizontal vessels"]
["based on surface area from max load",null,{"$f":"comp_sa_min/comp_vert_max_sa","v":28.22203299271251}]
["based on surface area from bed depth",null,{"$f":"comp_sa_required_vert/comp_vert_max_sa","v":14.763909377726844}]
["based on media volume",null,{"$f":"comp_vol_required_stg1/comp_vert_max_media","v":11.318997189590577}]
["min number of lines","comp_vert_min_number",{"$f":"MAX(C22:C24)","v":28.22203299271251},null,"strictest of the above minima"]
[]
["Horizontal design search"]
["max total vessel volume","comp_max_vol",{"$f":"MAX(comp_pv_max_sizes)","v":27101},"gal","max pressure vessel volume in cl.xls"]
["vessel diameter at max volume",null,{"$f":"comp_max_horiz_diam","v":14},"ft"]
["vessel length at max volume","comp_max_vol_length",{"$f":"ROUND(comp_max_vol/7.48/(PI()*comp_max_horiz_diam*comp_max_horiz_diam/4),0)","v":24},"ft","rounded to reflect the length we will actually use on the input sheet"]
["max vessel surface area","comp_max_horiz_sa",{"$f":"IF(comp_round_sa=1,ROUNDUP((comp_max_horiz_diam-2*Vessel_thickness)*comp_max_vol_length,0),(comp_max_horiz_diam-2*Vessel_thickness)*comp_max_vol_length)","v":336},"ft^2","rounded only if the vessel design sheet is rounding"]
["target bed depth","comp_target_bed_depth_horiz",{"$f":"VLOOKUP(\"target_bed_depth_horiz\",resin_table,resin_type+1,FALSE)","v":4.3},"ft","based on target_load CDA"]
["total vessel surface area","comp_sa_required_horiz",{"$f":"comp_vol_required_stg1/comp_target_bed_depth_horiz","v":2431.289640591966},"ft^2","based upon  media volume and bed depth"]
["Void space required for max-sized horizontal vessels:"]
["For freeboard",null,{"$f":"comp_max_vol_length*(comp_max_horiz_diam*comp_max_horiz_diam/2*ASIN(SQRT(free_board/comp_max_horiz_diam))-(comp_max_horiz_diam/2-free_board)*SQRT((comp_max_horiz_diam-free_board)*free_board))","v":41.875530099772533},"ft^3","volume of a horizontal slice of a cylinder"]
["For underdrain",null,{"$f":"comp_max_vol_length*(comp_max_horiz_diam*comp_max_horiz_diam/2*ASIN(SQRT(horiz_underdrain/comp_max_horiz_diam))-(comp_max_horiz_diam/2-horiz_underdrain)*SQRT((comp_max_horiz_diam-horiz_underdrain)*horiz_underdrain))","v":212.75213463857958},"ft^3"]
["Total","comp_horiz_void_required",{"$f":"SUM(C35:C36)","v":254.62766473835211},"ft^3","total of the two void volumes above"]
["max media volume","comp_horiz_max_media",{"$f":"(comp_max_vol/7.481-comp_horiz_void_required)/(1+bed_expansion)","v":2245.3442445388218},"ft^3","remaining volume in a max-size pressure vessel, minus bed expansion"]
["min number of lines, horizontal vessels:"]
["based on surface area from max load",null,{"$f":"comp_sa_min/comp_max_horiz_sa","v":12.92989417989418}]
["based on surface area from bed depth",null,{"$f":"comp_sa_required_horiz/comp_max_horiz_sa","v":7.2359810731903753}]
["based on media volume",null,{"$f":"comp_vol_required_stg1/comp_horiz_max_media","v":4.6560991616199789}]
["min number of lines, horizontal vessels","comp_horiz_min_number",{"$f":"MAX(C40:C42)","v":12.92989417989418},null,"strictest of the above minima"]
[]
[]
["extra number to test for min cost","comp_nlines_extra_search",3,null,"we will search the number of lines until we find a minumum cost, then go this much farther to make sure we aren't in a local minimum"]
["target number of lines","comp_in_nlines",28,null,"the autosize_opt macro uses this number as a search parameter"]
[]
["Inputs"]
["for all vessels"]
["vessel geometry","comp_tank_geom",{"$f":"IF(comp_in_nlines>=comp_vert_min_number,\"upright\",\"horizontal\")","v":"horizontal"},null,"we switch to horizontal vessels when the desired number of max-size vertical vessels can't handle the design flow"]
[]
["dimensions for vertical vessels"]
["target diameter","comp_vert_diam",{"$f":"2*(SQRT(comp_sa_required_vert/comp_in_nlines/PI())+Vessel_thickness)","v":10.165990637615593},"ft",{"$f":"IF(C54<comp_min_vert_diam,comp_min_vert_diam,IF(C54>comp_max_vert_diam,comp_max_vert_diam,ROUNDUP(2*C54,0)/2))","v":14.5},"actual diameter"]
["available surface area, one vessel",null,{"$f":"(comp_vert_diam-2*Vessel_thickness)*(comp_vert_diam-2*Vessel_thickness)*PI()/4","v":165.1299638543135},"ft^2"]
["available surface area, all vessels",null,{"$f":"comp_in_nlines*C55","v":4623.6389879207782},"ft^2"]
["bed depth","comp_vert_bed_depth",{"$f":"comp_vol_required/Num_tanks/IF(comp_round_sa=1,ROUND(C55,0)*comp_in_nlines,C56)","v":2.2608053963941472},"ft",{"$f":"IF(comp_min_vert_bed_depth<=comp_max_vert_bed_depth,IF(C57<comp_min_vert_bed_depth, comp_min_vert_bed_depth, IF(C57>comp_max_vert_bed_depth, comp_max_vert_bed_depth, ROUNDUP(C57,1))),-1)","v":2.4},"actual bed depth"]
["target height","comp_vert_height",{"$f":"(1+bed_expansion)*comp_vert_bed_depth+free_board","v":4.0999999999999996},"ft",{"$f":"IF(comp_min_vert_height>comp_max_vert_height,-1,IF(C58>comp_max_vert_height,comp_max_vert_height,IF(C58<comp_min_vert_height,comp_min_vert_height,ROUNDUP(2*C58,0)/2)))","v":6},"actual height"]
[]
["dimensions for horizontal vessels"]
["assumed void volume per length","comp_horiz_void_area",{"$f":"comp_horiz_void_required/comp_max_vol_length","v":10.609486030764671},"ft^2"]
["target bed depth after expansion","comp_horiz_expanded_bd",{"$f":"comp_target_bed_depth_horiz*(1+bed_expansion)","v":6.4499999999999993},"ft"]
["target diameter","comp_horiz_diam",{"$f":"(comp_horiz_expanded_bd+SQRT(comp_horiz_expanded_bd*comp_horiz_expanded_bd+PI()*comp_horiz_void_area))/(PI()/2)","v":9.6170300762786987},"ft",{"$f":"IF(comp_min_horiz_diam<=comp_max_horiz_diam,IF(C63<comp_min_horiz_diam,comp_min_horiz_diam,IF(C63>comp_max_horiz_diam,comp_max_horiz_diam,ROUNDUP(2*C63,0)/2)),-1)","v":10},"actual diameter"]
["old target diameter",null,{"$f":"SQRT(comp_sa_required_horiz/comp_in_nlines/length_diam_ratio)","v":5.8934462881504057},"ft"]
["target length","comp_horiz_length",{"$f":"comp_sa_required_horiz/(comp_horiz_diam-2*Vessel_thickness)/comp_in_nlines","v":8.6831772878284497},"ft",{"$f":"IF(comp_min_horiz_length<=comp_max_horiz_length,IF(C65<comp_min_horiz_length,comp_min_horiz_length,IF(C65>comp_max_horiz_length,comp_max_horiz_length,ROUNDUP(C65,0))),-1)","v":20},"actual length"]
["available surface area, all vessels",null,{"$f":"comp_in_nlines*(comp_horiz_diam-2*Vessel_thickness)*comp_horiz_length","v":5600},"ft^2"]
["bed depth","comp_horiz_bed_depth",{"$f":"comp_vol_required/Num_tanks/IF(comp_round_sa=1,ROUND(C66,0),C66)","v":1.8666335669410123},"ft",{"$f":"IF(comp_min_horiz_bed_depth<=comp_max_horiz_bed_depth,IF(C67<comp_min_horiz_bed_depth, comp_min_horiz_bed_depth, IF(C67>comp_max_horiz_bed_depth, comp_max_horiz_bed_depth, ROUNDUP(C67,1))),-1)","v":2.4},"actual bed depth"]
[]
["for all vessels"]
["bed depth for chosen geometry","comp_bed_depth",{"$f":"IF(comp_tank_geom=\"upright\",comp_vert_bed_depth,IF(comp_tank_geom=\"horizontal\",comp_horiz_bed_depth,-1))","v":2.4},"ft"]
[]
["Constraints"]
[" - vessel surface area"]
["min","comp_min_sa_vessel",{"$f":"comp_sa_min/comp_in_nlines","v":155.15873015873015},"ft^2","based on max load, design flow, and target number of lines"]
["max","comp_max_sa_vessel",{"$f":"comp_sa_max/comp_in_nlines","v":1861.9047619047619},"ft^2","based on mIN load, design flow, and target number of lines"]
[]
[" - vertical vessel height"]
["min","comp_min_vert_height",{"$f":"VLOOKUP(comp_vert_diam,vessel_size_table_cl,2)","v":6},"ft","from reasonable-dimensions table"]
["max",null,{"$f":"VLOOKUP(comp_vert_diam,vessel_size_table_cl,3)","v":24},"ft","from reasonable-dimensions table"]
["max",null,{"$f":"max_height","v":14},"ft","from max_height CDA"]
["max","comp_max_vert_height",{"$f":"MIN(C79:C80)","v":14},"ft","strictest of the above two maxima"]
[]
[" - vertical vessel diameter"]
["min",null,{"$f":"2*(SQRT(comp_vol_required/Num_tanks/PI()/comp_max_vert_bed_depth/comp_in_nlines)+Vessel_thickness)","v":8.9006959895642392},"ft","min diam to avoid bed depth becoming too deep, given required volume"]
["min",null,{"$f":"2*(SQRT(comp_min_sa_vessel/PI())+Vessel_thickness)","v":14.055398640699863},"ft","from min surface area"]
["min",null,{"$f":"min_diam","v":1.5},"ft","from reasonable-dimensions table"]
["min","comp_min_vert_diam",{"$f":"ROUNDUP(2*MAX(C84:C86),0)/2","v":14.5},"ft","strictest minimum of the above, rounded"]
["max",null,{"$f":"max_diam","v":14},"ft","max_diam CDA"]
["max",null,{"$f":"2*(SQRT(comp_max_sa_vessel/PI())+Vessel_thickness)","v":48.689329132653391},"ft","from max surface area"]
["max",null,{"$f":"max_diam","v":14},"ft","from reasonable-dimensions table"]
["max","comp_max_vert_diam",{"$f":"MAX(0.5,ROUNDDOWN(2*MIN(C88:C90),0)/2)","v":14},"ft","strictest maximum of the above, rounded"]
[]
[" - vertical bed depth"]
["min",null,{"$f":"IF(comp_round_sa=1,comp_vol_required/Num_tanks/C56,0)","v":0},"ft","ensures that bed depth is sufficient to pass diameter check on vessel design sheet"]
["min",null,{"$f":"min_bed_depth","v":2.4},"ft","from guidance on input sheet"]
["min","comp_min_vert_bed_depth",{"$f":"ROUNDUP(MAX(C94:C95),1)","v":2.4},"ft","strictest minimum of the above, rounded"]
["max",null,{"$f":"(max_height-free_board)/(1+bed_expansion)","v":9},"ft","max bed depth for max_height, given freeboard and bed expansion"]
["max",null,{"$f":"max_bed_depth","v":6},"ft","from guidance on input sheet"]
["max","comp_max_vert_bed_depth",{"$f":"ROUNDDOWN(MIN(C97:C98),1)","v":6},"ft","strictest max of the above, rounded"]
[]
[" -horizontal vessel diameter"]
["min","comp_min_horiz_diam",8,"ft","from guidance provided by Bob Dvorin, 5/16/05"]
["max",null,{"$f":"max_height","v":14},"ft","from max_height CDA"]
["max",null,{"$f":"max_diam","v":14},"ft","from max_diam CDA"]
["max","comp_max_horiz_diam",{"$f":"ROUNDDOWN(MIN(C103:C104),1)","v":14},"ft","strictest maximum of the above"]
[]
[" - horizontal vessel length"]
["min",null,{"$f":"comp_min_sa_vessel/(comp_horiz_diam-2*Vessel_thickness)","v":15.515873015873016},"ft","from max load and actual diameter"]
["min",null,20,"ft","Value needs review"]
["min","comp_min_horiz_length",{"$f":"ROUNDUP(MAX(C108:C109),0)","v":20},"ft","strictest min of the above, rounded"]
["max",null,{"$f":"max_length","v":53},"ft","max_length CDA"]
["max",null,{"$f":"comp_max_vol/(comp_horiz_diam*comp_horiz_diam*PI()/4)/7.48","v":46.131102809983474},"ft","max volume combined with actual diameter"]
["max","comp_max_horiz_length",{"$f":"ROUNDDOWN(MIN(C111:C112),0)","v":46},"ft","strictest max of the above, rounded"]
[]
[" - horizontal bed depth"]
["min",null,{"$f":"IF(comp_round_sa=1,comp_vol_required/Num_tanks/C66,0)","v":0},"ft","ensures that bed depth is sufficient for required volume of medium"]
["min",null,{"$f":"min_bed_depth","v":2.4},"ft","from media constraint table"]
["min","comp_min_horiz_bed_depth",{"$f":"ROUNDUP(MAX(C116:C117),1)","v":2.4},"ft","strictest min of the above, rounded"]
["max",null,{"$f":"(MIN(max_height,max_diam)-free_board)/(1+bed_expansion)","v":9},"ft","max bed depth for max_height or max_diam, given freeboard and bed expansion"]
["max",null,{"$f":"max_bed_depth","v":6},"ft","from media constraint table"]
["max","comp_max_horiz_bed_depth",{"$f":"ROUNDDOWN(MIN(C119:C120),1)","v":6},"ft","strictest max of the above, rounded"]
[]
["Results"]
["Success?","comp_out_success",true,null,"set by the autosize algorithm; TRUE if it finds a valid size, FALSE otherwise"]

{"sheet":"Cost Equations","index":18,"n_rows":266,"n_cols":17,"rows_kept":266,"cut":false,"hidden":false,"merged":[]}
["Cost Equations"]
["This sheet is used internally to calculate component costs using the cost equations method; see model documentation for more details on the development of cost equations"]
[]
["Component",null,"Result","Variable",null,2,3,4,5,6,7,8,9,10,11,16,17]
["Pressure Vessels","Equation Name","Result","Variable","Equation Lookup Name",2,3,4,5,6,7,8,9,10,11,16,17]
["Stainless Steel","ss_pv_eq",{"$f":"IF(OR(D6>P6,D6<Q6),\"contact vendor\",F6*D6^G6+H6*LN(D6)+I6+J6*EXP(K6*D6)+L6*D6^3+M6*D6^2+N6*D6+O6)","v":278631.6185616781},{"$f":"comm_vol_gal","v":19974.246091523906},"ss_pv_eq",{"$f":"VLOOKUP($E6,eq_table_cl,F$5,FALSE)","v":0},0,0,0,0,0,0,-6.6983999999999994E-5,14.522866852,15272.942541242999,27101,0]
["Carbon Steel - Stainless Internals","cs_pv_eq",{"$f":"IF(OR(D7>P7,D7<Q7),\"contact vendor\",F7*D7^G7+H7*LN(D7)+I7+J7*EXP(K7*D7)+L7*D7^3+M7*D7^2+N7*D7+O7)","v":191016.79735363959},{"$f":"comm_vol_gal","v":19974.246091523906},"cs_pv_eq",0,0,0,0,0,0,0,-5.0831999999999997E-5,9.8575955700000009,14399.226375742999,27101,0]
["Carbon Steel - Plastic Internals","csp_pv_eq",{"$f":"IF(OR(D8>P8,D8<Q8),\"contact vendor\",F8*D8^G8+H8*LN(D8)+I8+J8*EXP(K8*D8)+L8*D8^3+M8*D8^2+N8*D8+O8)","v":108788.34939962468},{"$f":"comm_vol_gal","v":19974.246091523906},"csp_pv_eq",0,0,0,0,0,0,4.0000000000000002E-9,-1.38219E-4,6.1268369070000004,9678.1653989080005,27101,0]
["Fiberglass","fg_pv_eq",{"$f":"IF(OR(D9>P9,D9<Q9),\"contact vendor\",F9*D9^G9+H9*LN(D9)+I9+J9*EXP(K9*D9)+L9*D9^3+M9*D9^2+N9*D9+O9)","v":"contact vendor"},{"$f":"comm_vol_gal","v":19974.246091523906},"fg_pv_eq",0,0,0,0,0,0,-3.4580000000000002E-6,4.462751E-3,16.993719766000002,1007.233463829,901,0]
["Anion Resin"]
["Gel Type"]
["Polystyrene Strong Base","no equation"]
["Polystyrene Weak Base","no equation"]
["Polyacrylic Strong Base","no equation"]
["Polyacrylic Weak Base","no equation"]
["Macroporous"]
["Polystyrene Strong Base","no equation"]
["Polystyrene Weak Base","no equation"]
["Polyacrylic Strong Base","no equation"]
["Polyacrylic Weak Base","no equation"]
["Cartridge Filters"]
["Cartridge Filters","cart_eq",{"$f":"IF(OR(D22>P22,D22<Q22),\"contact vendor\",F22*D22^G22+H22*LN(D22)+I22+J22*EXP(K22*D22)+L22*D22^3+M22*D22^2+N22*D22+O22)","v":57601.73992708818},{"$f":"filter_size","v":2.7804444444444445},"cart_eq",{"$f":"VLOOKUP($E22,eq_table_cl,F$5,FALSE)","v":23052.637051139001},0.89552410100000002,0,0,0,0,0,0,0,0,2.8809999999999998,0]
["Tanks"]
["Backwash Tanks"]
["Steel","st_bwt_eq",{"$f":"IF(OR(D25>P25,D25<Q25),\"contact vendor\",F25*D25^G25+H25*LN(D25)+I25+J25*EXP(K25*D25)+L25*D25^3+M25*D25^2+N25*D25+O25)","v":{"$error":"#NUM!"}},{"$f":"back_tank_vol","v":0},"st_bwt_eq",{"$f":"VLOOKUP($E25,eq_table_cl,F$5,FALSE)","v":340.81529969399998},0.52157091300000002,0,0,0,0,0,0,0,0,282095,0]
["Fiberglass","fg_bwt_eq",{"$f":"IF(OR(D26>P26,D26<Q26),\"contact vendor\",F26*D26^G26+H26*LN(D26)+I26+J26*EXP(K26*D26)+L26*D26^3+M26*D26^2+N26*D26+O26)","v":{"$error":"#NUM!"}},{"$f":"back_tank_vol","v":0},"fg_bwt_eq",0,0,0,0,0,0,0,-9.0589999999999992E-6,1.617507891,5391.7204035880004,50001,0]
["Plastic/HDPE","hdpe_bwt_eq",{"$f":"IF(OR(D27>P27,D27<Q27),\"contact vendor\",F27*D27^G27+H27*LN(D27)+I27+J27*EXP(K27*D27)+L27*D27^3+M27*D27^2+N27*D27+O27)","v":{"$error":"#NUM!"}},{"$f":"back_tank_vol","v":0},"hdpe_bwt_eq",0,0,0,0,0,0,0,-7.1860000000000003E-6,1.039757461,1210.6270696910001,15001,0]
["Regenerant Tanks"]
["Plastic/XLPE","pl_cst_eq",{"$f":"IF(OR(D29>P29,D29<Q29),\"contact vendor\",F29*D29^G29+H29*LN(D29)+I29+J29*EXP(K29*D29)+L29*D29^3+M29*D29^2+N29*D29+O29)","v":{"$error":"#NUM!"}},{"$f":"mix_tank_vol","v":0},"pl_cst_eq",{"$f":"VLOOKUP($E29,eq_table_cl,F$5,FALSE)","v":0},0,0,0,0,0,0,2.9169000000000001E-5,1.572614629,790.64854799700004,6601,0]
["Fiberglass","fg_cst_eq",{"$f":"IF(OR(D30>P30,D30<Q30),\"contact vendor\",F30*D30^G30+H30*LN(D30)+I30+J30*EXP(K30*D30)+L30*D30^3+M30*D30^2+N30*D30+O30)","v":{"$error":"#NUM!"}},{"$f":"mix_tank_vol","v":0},"fg_cst_eq",0,0,0,0,0,0,0,-2.3530999999999999E-5,1.774526442,4677.3740770209997,30001,0]
["Stainless Steel","ss_cst_eq",{"$f":"IF(OR(D31>P31,D31<Q31),\"contact vendor\",F31*D31^G31+H31*LN(D31)+I31+J31*EXP(K31*D31)+L31*D31^3+M31*D31^2+N31*D31+O31)","v":{"$error":"#NUM!"}},{"$f":"mix_tank_vol","v":0},"ss_cst_eq",0,0,0,0,0,0,0,-7.7020000000000001E-6,2.7162509039999998,4402.7309929370003,30001,0]
["Acid Storage Tanks"]
["Plastic/XLPE","pl_at_eq",{"$f":"IF(OR(D33>P33,D33<Q33),\"contact vendor\",F33*D33^G33+H33*LN(D33)+I33+J33*EXP(K33*D33)+L33*D33^3+M33*D33^2+N33*D33+O33)","v":{"$error":"#NUM!"}},{"$f":"HCl_tank_vol","v":0},"pl_cst_eq",{"$f":"VLOOKUP($E33,eq_table_cl,F$5,FALSE)","v":0},0,0,0,0,0,0,2.9169000000000001E-5,1.572614629,790.64854799700004,6601,0]
["Fiberglass","fg_at_eq",{"$f":"IF(OR(D34>P34,D34<Q34),\"contact vendor\",F34*D34^G34+H34*LN(D34)+I34+J34*EXP(K34*D34)+L34*D34^3+M34*D34^2+N34*D34+O34)","v":{"$error":"#NUM!"}},{"$f":"HCl_tank_vol","v":0},"fg_cst_eq",0,0,0,0,0,0,0,-2.3530999999999999E-5,1.774526442,4677.3740770209997,30001,0]
["Caustic Storage Tanks"]
["Plastic/XLPE","pl_ct_eq",{"$f":"IF(OR(D36>P36,D36<Q36),\"contact vendor\",F36*D36^G36+H36*LN(D36)+I36+J36*EXP(K36*D36)+L36*D36^3+M36*D36^2+N36*D36+O36)","v":{"$error":"#NUM!"}},{"$f":"NaOH_tank_vol","v":0},"pl_cst_eq",{"$f":"VLOOKUP($E36,eq_table_cl,F$5,FALSE)","v":0},0,0,0,0,0,0,2.9169000000000001E-5,1.572614629,790.64854799700004,6601,0]
["Fiberglass","fg_ct_eq",{"$f":"IF(OR(D37>P37,D37<Q37),\"contact vendor\",F37*D37^G37+H37*LN(D37)+I37+J37*EXP(K37*D37)+L37*D37^3+M37*D37^2+N37*D37+O37)","v":{"$error":"#NUM!"}},{"$f":"NaOH_tank_vol","v":0},"fg_cst_eq",0,0,0,0,0,0,0,-2.3530999999999999E-5,1.774526442,4677.3740770209997,30001,0]
["Stainless Steel","ss_ct_eq",{"$f":"IF(OR(D38>P38,D38<Q38),\"contact vendor\",F38*D38^G38+H38*LN(D38)+I38+J38*EXP(K38*D38)+L38*D38^3+M38*D38^2+N38*D38+O38)","v":{"$error":"#NUM!"}},{"$f":"NaOH_tank_vol","v":0},"ss_cst_eq",0,0,0,0,0,0,0,-7.7020000000000001E-6,2.7162509039999998,4402.7309929370003,30001,0]
["Heat Tracing","ct_heat_eq",{"$f":"IF(OR(D39>P39,D39<Q39),\"contact vendor\",F39*D39^G39+H39*LN(D39)+I39+J39*EXP(K39*D39)+L39*D39^3+M39*D39^2+N39*D39+O39)","v":{"$error":"#NUM!"}},{"$f":"NaOH_tank_vol","v":0},"cst_heat_eq",0,0,0,0,0,0,1.0000000000000001E-9,-2.4671000000000001E-5,0.26333174300000001,1444.6155199699999,30001,0]
["Insulation","ct_insul_eq",{"$f":"IF(OR(D40>P40,D40<Q40),\"contact vendor\",F40*D40^G40+H40*LN(D40)+I40+J40*EXP(K40*D40)+L40*D40^3+M40*D40^2+N40*D40+O40)","v":{"$error":"#NUM!"}},{"$f":"NaOH_tank_vol","v":0},"cst_insul_eq",16.480455510999999,0.64952204300000005,0,0,0,0,0,0,0,0,30001,0]
["Caustic Day Tanks"]
["Plastic/XLPE","pl_day_eq",{"$f":"IF(OR(D42>P42,D42<Q42),\"contact vendor\",F42*D42^G42+H42*LN(D42)+I42+J42*EXP(K42*D42)+L42*D42^3+M42*D42^2+N42*D42+O42)","v":{"$error":"#NUM!"}},{"$f":"NaOH_day_tank_vol","v":0},"pl_cst_eq",{"$f":"VLOOKUP($E42,eq_table_cl,F$5,FALSE)","v":0},0,0,0,0,0,0,2.9169000000000001E-5,1.572614629,790.64854799700004,6601,0]
["Fiberglass","fg_day_eq",{"$f":"IF(OR(D43>P43,D43<Q43),\"contact vendor\",F43*D43^G43+H43*LN(D43)+I43+J43*EXP(K43*D43)+L43*D43^3+M43*D43^2+N43*D43+O43)","v":{"$error":"#NUM!"}},{"$f":"NaOH_day_tank_vol","v":0},"fg_cst_eq",0,0,0,0,0,0,0,-2.3530999999999999E-5,1.774526442,4677.3740770209997,30001,0]
["Stainless Steel","ss_day_eq",{"$f":"IF(OR(D44>P44,D44<Q44),\"contact vendor\",F44*D44^G44+H44*LN(D44)+I44+J44*EXP(K44*D44)+L44*D44^3+M44*D44^2+N44*D44+O44)","v":{"$error":"#NUM!"}},{"$f":"NaOH_day_tank_vol","v":0},"ss_cst_eq",0,0,0,0,0,0,0,-7.7020000000000001E-6,2.7162509039999998,4402.7309929370003,30001,0]
["Heat Tracing","day_heat_eq",{"$f":"IF(OR(D45>P45,D45<Q45),\"contact vendor\",F45*D45^G45+H45*LN(D45)+I45+J45*EXP(K45*D45)+L45*D45^3+M45*D45^2+N45*D45+O45)","v":{"$error":"#NUM!"}},{"$f":"NaOH_day_tank_vol","v":0},"cst_heat_eq",0,0,0,0,0,0,1.0000000000000001E-9,-2.4671000000000001E-5,0.26333174300000001,1444.6155199699999,30001,0]
["Insulation","day_insul_eq",{"$f":"IF(OR(D46>P46,D46<Q46),\"contact vendor\",F46*D46^G46+H46*LN(D46)+I46+J46*EXP(K46*D46)+L46*D46^3+M46*D46^2+N46*D46+O46)","v":{"$error":"#NUM!"}},{"$f":"NaOH_day_tank_vol","v":0},"cst_insul_eq",16.480455510999999,0.64952204300000005,0,0,0,0,0,0,0,0,30001,0]
["Storage Tank Mixers"]
["Portable","no equation",{"$f":"IF(OR(D48>P48,D48<Q48),\"contact vendor\",F48*D48^G48+H48*LN(D48)+I48+J48*EXP(K48*D48)+L48*D48^3+M48*D48^2+N48*D48+O48)","v":{"$error":"#NUM!"}}]
["Mounted","cmount_mix_eq",{"$f":"IF(OR(D49>P49,D49<Q49),\"contact vendor\",F49*D49^G49+H49*LN(D49)+I49+J49*EXP(K49*D49)+L49*D49^3+M49*D49^2+N49*D49+O49)","v":{"$error":"#NUM!"}},{"$f":"cmix_size","v":0},"mount_mix_eq",{"$f":"VLOOKUP($E49,eq_table_cl,F$5,FALSE)","v":0},0,0,0,0,0,0,-107.78403992600001,1233.9520801589999,1645.8680859240001,4.0999999999999996,0]
["Impeller Mixers","cimp_mix_eq",{"$f":"IF(OR(D50>P50,D50<Q50),\"contact vendor\",F50*D50^G50+H50*LN(D50)+I50+J50*EXP(K50*D50)+L50*D50^3+M50*D50^2+N50*D50+O50)","v":{"$error":"#NUM!"}},{"$f":"cmix_size","v":0},"imp_mix_eq",4383.3876341309997,0.62611698800000004,0,0,0,0,0,0,0,0,110,0]
["Day Tank Mixers"]
["Portable","no equation",{"$f":"IF(OR(D52>P52,D52<Q52),\"contact vendor\",F52*D52^G52+H52*LN(D52)+I52+J52*EXP(K52*D52)+L52*D52^3+M52*D52^2+N52*D52+O52)","v":{"$error":"#NUM!"}}]
["Mounted","dmount_mix_eq",{"$f":"IF(OR(D53>P53,D53<Q53),\"contact vendor\",F53*D53^G53+H53*LN(D53)+I53+J53*EXP(K53*D53)+L53*D53^3+M53*D53^2+N53*D53+O53)","v":{"$error":"#NUM!"}},{"$f":"dmix_size","v":0},"mount_mix_eq",{"$f":"VLOOKUP($E53,eq_table_cl,F$5,FALSE)","v":0},0,0,0,0,0,0,-107.78403992600001,1233.9520801589999,1645.8680859240001,4.0999999999999996,0]
["Impeller Mixers","dimp_mix_eq",{"$f":"IF(OR(D54>P54,D54<Q54),\"contact vendor\",F54*D54^G54+H54*LN(D54)+I54+J54*EXP(K54*D54)+L54*D54^3+M54*D54^2+N54*D54+O54)","v":{"$error":"#NUM!"}},{"$f":"dmix_size","v":0},"imp_mix_eq",4383.3876341309997,0.62611698800000004,0,0,0,0,0,0,0,0,110,0]
["Residuals Holding Tanks"]
["Steel Tanks","st_ht_eq",{"$f":"IF(OR(D56>P56,D56<Q56),\"contact vendor\",F56*D56^G56+H56*LN(D56)+I56+J56*EXP(K56*D56)+L56*D56^3+M56*D56^2+N56*D56+O56)","v":{"$error":"#NUM!"}},{"$f":"htank_vol","v":0},"st_bwt_eq",{"$f":"VLOOKUP($E56,eq_table_cl,F$5,FALSE)","v":340.81529969399998},0.52157091300000002,0,0,0,0,0,0,0,0,282095,0]
["Fiberglass Tanks","fg_ht_eq",{"$f":"IF(OR(D57>P57,D57<Q57),\"contact vendor\",F57*D57^G57+H57*LN(D57)+I57+J57*EXP(K57*D57)+L57*D57^3+M57*D57^2+N57*D57+O57)","v":{"$error":"#NUM!"}},{"$f":"htank_vol","v":0},"fg_bwt_eq",0,0,0,0,0,0,0,-9.0589999999999992E-6,1.617507891,5391.7204035880004,50001,0]
["Plastic/HDPE Tanks","hdpe_ht_eq",{"$f":"IF(OR(D58>P58,D58<Q58),\"contact vendor\",F58*D58^G58+H58*LN(D58)+I58+J58*EXP(K58*D58)+L58*D58^3+M58*D58^2+N58*D58+O58)","v":{"$error":"#NUM!"}},{"$f":"htank_vol","v":0},"hdpe_bwt_eq",0,0,0,0,0,0,0,-7.1860000000000003E-6,1.039757461,1210.6270696910001,15001,0]
["Polymer Storage Tanks"]
["Plastic/XLPE","pl_polymer_st_eq",{"$f":"IF(OR(D60>P60,D60<Q60),\"contact vendor\",F60*D60^G60+H60*LN(D60)+I60+J60*EXP(K60*D60)+L60*D60^3+M60*D60^2+N60*D60+O60)","v":{"$error":"#NUM!"}},{"$f":"polymer_tank_vol","v":0},"pl_cst_eq",{"$f":"VLOOKUP($E60,eq_table_cl,F$5,FALSE)","v":0},0,0,0,0,0,0,2.9169000000000001E-5,1.572614629,790.64854799700004,6601,0]
["Fiberglass","fg_polymer_st_eq",{"$f":"IF(OR(D61>P61,D61<Q61),\"contact vendor\",F61*D61^G61+H61*LN(D61)+I61+J61*EXP(K61*D61)+L61*D61^3+M61*D61^2+N61*D61+O61)","v":{"$error":"#NUM!"}},{"$f":"polymer_tank_vol","v":0},"fg_cst_eq",0,0,0,0,0,0,0,-2.3530999999999999E-5,1.774526442,4677.3740770209997,30001,0]
["Stainless Steel","ss_polymer_st_eq",{"$f":"IF(OR(D62>P62,D62<Q62),\"contact vendor\",F62*D62^G62+H62*LN(D62)+I62+J62*EXP(K62*D62)+L62*D62^3+M62*D62^2+N62*D62+O62)","v":{"$error":"#NUM!"}},{"$f":"polymer_tank_vol","v":0},"ss_cst_eq",0,0,0,0,0,0,0,-7.7020000000000001E-6,2.7162509039999998,4402.7309929370003,30001,0]
["Piping"]
["Backwash Piping"]
["CPVC","cpvc_pipe_eq_back",{"$f":"IF(OR(D65>P65,D65<Q65),\"contact vendor\",F65*D65^G65+H65*LN(D65)+I65+J65*EXP(K65*D65)+L65*D65^3+M65*D65^2+N65*D65+O65)","v":68.204526205999997},{"$f":"back_pipe_diam","v":8},"cpvc_pipe_eq",{"$f":"VLOOKUP($E65,eq_table_cl,F$5,FALSE)","v":0},0,0,0,0,0,1.0356694E-2,0.56514584199999995,3.222257634,0.95450391800000001,18.100000000000001,0]
["PVC","pvc_pipe_eq_back",{"$f":"IF(OR(D66>P66,D66<Q66),\"contact vendor\",F66*D66^G66+H66*LN(D66)+I66+J66*EXP(K66*D66)+L66*D66^3+M66*D66^2+N66*D66+O66)","v":11.336130997000001},{"$f":"back_pipe_diam","v":8},"pvc_pipe_eq",0,0,0,0,0,0,0,0.110356803,0.235228044,2.3914712530000002,48.1,0]
["Stainless Steel","ss_pipe_eq_back",{"$f":"IF(OR(D67>P67,D67<Q67),\"contact vendor\",F67*D67^G67+H67*LN(D67)+I67+J67*EXP(K67*D67)+L67*D67^3+M67*D67^2+N67*D67+O67)","v":183.860928145},{"$f":"back_pipe_diam","v":8},"ss_pipe_eq",0,0,0,0,0,0,4.5974516999999999E-2,-2.1581476180000001,37.689363942,-3.0714885430000001,48.1,0]
["Steel","st_pipe_eq_back",{"$f":"IF(OR(D68>P68,D68<Q68),\"contact vendor\",F68*D68^G68+H68*LN(D68)+I68+J68*EXP(K68*D68)+L68*D68^3+M68*D68^2+N68*D68+O68)","v":126.69854464000002},{"$f":"back_pipe_diam","v":8},"st_pipe_eq",0,0,0,0,0,0,6.630642E-3,-0.63889849600000004,21.167729973,-5.1486801040000003,48.1,1]
["Regenerant Piping"]
["CPVC","cpvc_pipe_eq_brine",{"$f":"IF(OR(D70>P70,D70<Q70),\"contact vendor\",F70*D70^G70+H70*LN(D70)+I70+J70*EXP(K70*D70)+L70*D70^3+M70*D70^2+N70*D70+O70)","v":{"$error":"#NUM!"}},{"$f":"brine_pipe_diam","v":0},"cpvc_pipe_eq",{"$f":"VLOOKUP($E70,eq_table_cl,F$5,FALSE)","v":0},0,0,0,0,0,1.0356694E-2,0.56514584199999995,3.222257634,0.95450391800000001,18.100000000000001,0]
["PVC","pvc_pipe_eq_brine",{"$f":"IF(OR(D71>P71,D71<Q71),\"contact vendor\",F71*D71^G71+H71*LN(D71)+I71+J71*EXP(K71*D71)+L71*D71^3+M71*D71^2+N71*D71+O71)","v":{"$error":"#NUM!"}},{"$f":"brine_pipe_diam","v":0},"pvc_pipe_eq",0,0,0,0,0,0,0,0.110356803,0.235228044,2.3914712530000002,48.1,0]
["Stainless Steel","ss_pipe_eq_brine",{"$f":"IF(OR(D72>P72,D72<Q72),\"contact vendor\",F72*D72^G72+H72*LN(D72)+I72+J72*EXP(K72*D72)+L72*D72^3+M72*D72^2+N72*D72+O72)","v":{"$error":"#NUM!"}},{"$f":"brine_pipe_diam","v":0},"ss_pipe_eq",0,0,0,0,0,0,4.5974516999999999E-2,-2.1581476180000001,37.689363942,-3.0714885430000001,48.1,0]
["Process Piping"]
["Ductile Iron","di_pipe_eq_proc",{"$f":"IF(OR(D74>P74,D74<Q74),\"contact vendor\",F74*D74^G74+H74*LN(D74)+I74+J74*EXP(K74*D74)+L74*D74^3+M74*D74^2+N74*D74+O74)","v":80.531410089000005},{"$f":"proc_pipe_diam","v":12},"di_pipe_eq",{"$f":"VLOOKUP($E74,eq_table_cl,F$5,FALSE)","v":0},0,0,0,0,0,0,0.100985408,4.4966242760000004,12.030020025000001,48.1,4]
["CPVC","cpvc_pipe_eq_proc",{"$f":"IF(OR(D75>P75,D75<Q75),\"contact vendor\",F75*D75^G75+H75*LN(D75)+I75+J75*EXP(K75*D75)+L75*D75^3+M75*D75^2+N75*D75+O75)","v":138.898964006},{"$f":"proc_pipe_diam","v":12},"cpvc_pipe_eq",0,0,0,0,0,0,1.0356694E-2,0.56514584199999995,3.222257634,0.95450391800000001,18.100000000000001,0]
["PVC","pvc_pipe_eq_proc",{"$f":"IF(OR(D76>P76,D76<Q76),\"contact vendor\",F76*D76^G76+H76*LN(D76)+I76+J76*EXP(K76*D76)+L76*D76^3+M76*D76^2+N76*D76+O76)","v":21.105587412999999},{"$f":"proc_pipe_diam","v":12},"pvc_pipe_eq",0,0,0,0,0,0,0,0.110356803,0.235228044,2.3914712530000002,48.1,0]
["Stainless Steel","ss_pipe_eq_proc",{"$f":"IF(OR(D77>P77,D77<Q77),\"contact vendor\",F77*D77^G77+H77*LN(D77)+I77+J77*EXP(K77*D77)+L77*D77^3+M77*D77^2+N77*D77+O77)","v":217.87158714499998},{"$f":"proc_pipe_diam","v":12},"ss_pipe_eq",0,0,0,0,0,0,4.5974516999999999E-2,-2.1581476180000001,37.689363942,-3.0714885430000001,48.1,0]
["Steel","st_pipe_eq_proc",{"$f":"IF(OR(D78>P78,D78<Q78),\"contact vendor\",F78*D78^G78+H78*LN(D78)+I78+J78*EXP(K78*D78)+L78*D78^3+M78*D78^2+N78*D78+O78)","v":168.32044552399998},{"$f":"proc_pipe_diam","v":12},"st_pipe_eq",0,0,0,0,0,0,6.630642E-3,-0.63889849600000004,21.167729973,-5.1486801040000003,48.1,1]
["Bypass Piping"]
["CPVC","cpvc_pipe_eq_bp",{"$f":"IF(OR(D80>P80,D80<Q80),\"contact vendor\",F80*D80^G80+H80*LN(D80)+I80+J80*EXP(K80*D80)+L80*D80^3+M80*D80^2+N80*D80+O80)","v":{"$error":"#NUM!"}},{"$f":"bp_pipe_diam","v":0},"cpvc_pipe_eq",{"$f":"VLOOKUP($E80,eq_table_cl,F$5,FALSE)","v":0},0,0,0,0,0,1.0356694E-2,0.56514584199999995,3.222257634,0.95450391800000001,18.100000000000001,0]
["PVC","pvc_pipe_eq_bp",{"$f":"IF(OR(D81>P81,D81<Q81),\"contact vendor\",F81*D81^G81+H81*LN(D81)+I81+J81*EXP(K81*D81)+L81*D81^3+M81*D81^2+N81*D81+O81)","v":{"$error":"#NUM!"}},{"$f":"bp_pipe_diam","v":0},"pvc_pipe_eq",0,0,0,0,0,0,0,0.110356803,0.235228044,2.3914712530000002,48.1,0]
["Stainless Steel","ss_pipe_eq_bp",{"$f":"IF(OR(D82>P82,D82<Q82),\"contact vendor\",F82*D82^G82+H82*LN(D82)+I82+J82*EXP(K82*D82)+L82*D82^3+M82*D82^2+N82*D82+O82)","v":{"$error":"#NUM!"}},{"$f":"bp_pipe_diam","v":0},"ss_pipe_eq",0,0,0,0,0,0,4.5974516999999999E-2,-2.1581476180000001,37.689363942,-3.0714885430000001,48.1,0]
["Steel","st_pipe_eq_bp",{"$f":"IF(OR(D83>P83,D83<Q83),\"contact vendor\",F83*D83^G83+H83*LN(D83)+I83+J83*EXP(K83*D83)+L83*D83^3+M83*D83^2+N83*D83+O83)","v":"contact vendor"},{"$f":"bp_pipe_diam","v":0},"st_pipe_eq",0,0,0,0,0,0,6.630642E-3,-0.63889849600000004,21.167729973,-5.1486801040000003,48.1,1]
["Inlet and Outlet Piping"]
["Ductile Iron","di_pipe_eq_in_out",{"$f":"IF(OR(D85>P85,D85<Q85),\"contact vendor\",F85*D85^G85+H85*LN(D85)+I85+J85*EXP(K85*D85)+L85*D85^3+M85*D85^2+N85*D85+O85)","v":304.785582729},{"$f":"in_out_pipe_diam","v":36},"di_pipe_eq",{"$f":"VLOOKUP($E85,eq_table_cl,F$5,FALSE)","v":0},0,0,0,0,0,0,0.100985408,4.4966242760000004,12.030020025000001,48.1,4]
["CPVC","cpvc_pipe_eq_in_out",{"$f":"IF(OR(D86>P86,D86<Q86),\"contact vendor\",F86*D86^G86+H86*LN(D86)+I86+J86*EXP(K86*D86)+L86*D86^3+M86*D86^2+N86*D86+O86)","v":"contact vendor"},{"$f":"in_out_pipe_diam","v":36},"cpvc_pipe_eq",0,0,0,0,0,0,1.0356694E-2,0.56514584199999995,3.222257634,0.95450391800000001,18.100000000000001,0]
["PVC","pvc_pipe_eq_in_out",{"$f":"IF(OR(D87>P87,D87<Q87),\"contact vendor\",F87*D87^G87+H87*LN(D87)+I87+J87*EXP(K87*D87)+L87*D87^3+M87*D87^2+N87*D87+O87)","v":153.88209752499998},{"$f":"in_out_pipe_diam","v":36},"pvc_pipe_eq",0,0,0,0,0,0,0,0.110356803,0.235228044,2.3914712530000002,48.1,0]
["Stainless Steel","ss_pipe_eq_in_out",{"$f":"IF(OR(D88>P88,D88<Q88),\"contact vendor\",F88*D88^G88+H88*LN(D88)+I88+J88*EXP(K88*D88)+L88*D88^3+M88*D88^2+N88*D88+O88)","v":701.77336559299988},{"$f":"in_out_pipe_diam","v":36},"ss_pipe_eq",0,0,0,0,0,0,4.5974516999999999E-2,-2.1581476180000001,37.689363942,-3.0714885430000001,48.1,0]
["Steel","st_pipe_eq_in_out",{"$f":"IF(OR(D89>P89,D89<Q89),\"contact vendor\",F89*D89^G89+H89*LN(D89)+I89+J89*EXP(K89*D89)+L89*D89^3+M89*D89^2+N89*D89+O89)","v":238.23638125999997},{"$f":"in_out_pipe_diam","v":36},"st_pipe_eq",0,0,0,0,0,0,6.630642E-3,-0.63889849600000004,21.167729973,-5.1486801040000003,48.1,1]
["Acid Piping"]
["CPVC","cpvc_pipe_eq_acid",{"$f":"IF(OR(D91>P91,D91<Q91),\"contact vendor\",F91*D91^G91+H91*LN(D91)+I91+J91*EXP(K91*D91)+L91*D91^3+M91*D91^2+N91*D91+O91)","v":{"$error":"#NUM!"}},{"$f":"acid_pipe_diam","v":0},"cpvc_pipe_eq",{"$f":"VLOOKUP($E91,eq_table_cl,F$5,FALSE)","v":0},0,0,0,0,0,1.0356694E-2,0.56514584199999995,3.222257634,0.95450391800000001,18.100000000000001,0]
["PVC","pvc_pipe_eq_acid",{"$f":"IF(OR(D92>P92,D92<Q92),\"contact vendor\",F92*D92^G92+H92*LN(D92)+I92+J92*EXP(K92*D92)+L92*D92^3+M92*D92^2+N92*D92+O92)","v":{"$error":"#NUM!"}},{"$f":"acid_pipe_diam","v":0},"pvc_pipe_eq",0,0,0,0,0,0,0,0.110356803,0.235228044,2.3914712530000002,48.1,0]
["Stainless Steel","ss_pipe_eq_acid",{"$f":"IF(OR(D93>P93,D93<Q93),\"contact vendor\",F93*D93^G93+H93*LN(D93)+I93+J93*EXP(K93*D93)+L93*D93^3+M93*D93^2+N93*D93+O93)","v":{"$error":"#NUM!"}},{"$f":"acid_pipe_diam","v":0},"ss_pipe_eq",0,0,0,0,0,0,4.5974516999999999E-2,-2.1581476180000001,37.689363942,-3.0714885430000001,48.1,0]
["Caustic Piping"]
["CPVC","cpvc_pipe_eq_caustic",{"$f":"IF(OR(D95>P95,D95<Q95),\"contact vendor\",F95*D95^G95+H95*LN(D95)+I95+J95*EXP(K95*D95)+L95*D95^3+M95*D95^2+N95*D95+O95)","v":{"$error":"#NUM!"}},{"$f":"caustic_pipe_diam","v":0},"cpvc_pipe_eq",{"$f":"VLOOKUP($E95,eq_table_cl,F$5,FALSE)","v":0},0,0,0,0,0,1.0356694E-2,0.56514584199999995,3.222257634,0.95450391800000001,18.100000000000001,0]
["PVC","pvc_pipe_eq_caustic",{"$f":"IF(OR(D96>P96,D96<Q96),\"contact vendor\",F96*D96^G96+H96*LN(D96)+I96+J96*EXP(K96*D96)+L96*D96^3+M96*D96^2+N96*D96+O96)","v":{"$error":"#NUM!"}},{"$f":"caustic_pipe_diam","v":0},"pvc_pipe_eq",0,0,0,0,0,0,0,0.110356803,0.235228044,2.3914712530000002,48.1,0]
["Stainless Steel","ss_pipe_eq_caustic",{"$f":"IF(OR(D97>P97,D97<Q97),\"contact vendor\",F97*D97^G97+H97*LN(D97)+I97+J97*EXP(K97*D97)+L97*D97^3+M97*D97^2+N97*D97+O97)","v":{"$error":"#NUM!"}},{"$f":"caustic_pipe_diam","v":0},"ss_pipe_eq",0,0,0,0,0,0,4.5974516999999999E-2,-2.1581476180000001,37.689363942,-3.0714885430000001,48.1,0]
["Residuals Piping"]
["CPVC","cpvc_pipe_eq_res",{"$f":"IF(OR(D99>P99,D99<Q99),\"contact vendor\",F99*D99^G99+H99*LN(D99)+I99+J99*EXP(K99*D99)+L99*D99^3+M99*D99^2+N99*D99+O99)","v":42.870345938},{"$f":"res_pipe_diam","v":6},"cpvc_pipe_eq",{"$f":"VLOOKUP($E99,eq_table_cl,F$5,FALSE)","v":0},0,0,0,0,0,1.0356694E-2,0.56514584199999995,3.222257634,0.95450391800000001,18.100000000000001,0]
["PVC","pvc_pipe_eq_res",{"$f":"IF(OR(D100>P100,D100<Q100),\"contact vendor\",F100*D100^G100+H100*LN(D100)+I100+J100*EXP(K100*D100)+L100*D100^3+M100*D100^2+N100*D100+O100)","v":7.7756844249999997},{"$f":"res_pipe_diam","v":6},"pvc_pipe_eq",0,0,0,0,0,0,0,0.110356803,0.235228044,2.3914712530000002,48.1,0]
["Stainless Steel","ss_pipe_eq_res",{"$f":"IF(OR(D101>P101,D101<Q101),\"contact vendor\",F101*D101^G101+H101*LN(D101)+I101+J101*EXP(K101*D101)+L101*D101^3+M101*D101^2+N101*D101+O101)","v":155.30187653300001},{"$f":"res_pipe_diam","v":6},"ss_pipe_eq",0,0,0,0,0,0,4.5974516999999999E-2,-2.1581476180000001,37.689363942,-3.0714885430000001,48.1,0]
["Steel","st_pipe_eq_res",{"$f":"IF(OR(D102>P102,D102<Q102),\"contact vendor\",F102*D102^G102+H102*LN(D102)+I102+J102*EXP(K102*D102)+L102*D102^3+M102*D102^2+N102*D102+O102)","v":100.28957255},{"$f":"res_pipe_diam","v":6},"st_pipe_eq",0,0,0,0,0,0,6.630642E-3,-0.63889849600000004,21.167729973,-5.1486801040000003,48.1,1]
["Polymer Piping"]
["CPVC","cpvc_pipe_eq_polymer",{"$f":"IF(OR(D104>P104,D104<Q104),\"contact vendor\",F104*D104^G104+H104*LN(D104)+I104+J104*EXP(K104*D104)+L104*D104^3+M104*D104^2+N104*D104+O104)","v":{"$error":"#NUM!"}},{"$f":"polymer_pipe_diam","v":0},"cpvc_pipe_eq",{"$f":"VLOOKUP($E104,eq_table_cl,F$5,FALSE)","v":0},0,0,0,0,0,1.0356694E-2,0.56514584199999995,3.222257634,0.95450391800000001,18.100000000000001,0]
["PVC","pvc_pipe_eq_polymer",{"$f":"IF(OR(D105>P105,D105<Q105),\"contact vendor\",F105*D105^G105+H105*LN(D105)+I105+J105*EXP(K105*D105)+L105*D105^3+M105*D105^2+N105*D105+O105)","v":{"$error":"#NUM!"}},{"$f":"polymer_pipe_diam","v":0},"pvc_pipe_eq",0,0,0,0,0,0,0,0.110356803,0.235228044,2.3914712530000002,48.1,0]
["Stainless Steel","ss_pipe_eq_polymer",{"$f":"IF(OR(D106>P106,D106<Q106),\"contact vendor\",F106*D106^G106+H106*LN(D106)+I106+J106*EXP(K106*D106)+L106*D106^3+M106*D106^2+N106*D106+O106)","v":{"$error":"#NUM!"}},{"$f":"polymer_pipe_diam","v":0},"ss_pipe_eq",0,0,0,0,0,0,4.5974516999999999E-2,-2.1581476180000001,37.689363942,-3.0714885430000001,48.1,0]
["Steel","st_pipe_eq_polymer",{"$f":"IF(OR(D107>P107,D107<Q107),\"contact vendor\",F107*D107^G107+H107*LN(D107)+I107+J107*EXP(K107*D107)+L107*D107^3+M107*D107^2+N107*D107+O107)","v":"contact vendor"},{"$f":"polymer_pipe_diam","v":0},"st_pipe_eq",0,0,0,0,0,0,6.630642E-3,-0.63889849600000004,21.167729973,-5.1486801040000003,48.1,1]
["Valves and Fittings"]
["Motor/Air Operated (on/off)"]
["Polypropylene/PVC - Process","pp_mov_eq_tank",{"$f":"IF(OR(D110>P110,D110<Q110),\"contact vendor\",F110*D110^G110+H110*LN(D110)+I110+J110*EXP(K110*D110)+L110*D110^3+M110*D110^2+N110*D110+O110)","v":5719.9902432564077},{"$f":"tank_valve_size","v":12},{"$f":"IF(D110>12,\"pp_mov_eq_large\",\"pp_mov_eq_small\")","v":"pp_mov_eq_small"},{"$f":"VLOOKUP($E110,eq_table_cl,F$5,FALSE)","v":0},0,0,0,445.65232098299998,0.21268194000000001,0,0,0,0,12,0]
["Stainless Steel - Process","ss_mov_eq_tank",15992.464987597999,{"$f":"tank_valve_size","v":12},"ss_mov_eq",0,0,0,0,0,0,0,76.908725779999997,393.08666071099998,200.56854674600001,48.1,0]
["Cast Iron - Process","ci_mov_eq_tank",5924.7761618470004,{"$f":"tank_valve_size","v":12},"ci_mov_eq",0,0,0,0,0,0,-6.5106489000000003E-2,28.845623929999999,71.319704893999997,1027.6738701910001,48.1,1]
["Polypropylene/PVC - Backwash","pp_mov_eq_back",2443.0306534666761,{"$f":"back_valve_size","v":8},{"$f":"IF(D113>12,\"pp_mov_eq_large\",\"pp_mov_eq_small\")","v":"pp_mov_eq_small"},0,0,0,0,445.65232098299998,0.21268194000000001,0,0,0,0,12,0]
["Stainless Steel - Backwash","ss_mov_eq_back",8267.4202823539999,{"$f":"back_valve_size","v":8},"ss_mov_eq",0,0,0,0,0,0,0,76.908725779999997,393.08666071099998,200.56854674600001,48.1,0]
["Cast Iron - Backwash","ci_mov_eq_back",3411.016918495,{"$f":"back_valve_size","v":8},"ci_mov_eq",0,0,0,0,0,0,-6.5106489000000003E-2,28.845623929999999,71.319704893999997,1027.6738701910001,48.1,1]
["Polypropylene/PVC - Brine","pp_mov_eq_brine",{"$error":"#NUM!"},{"$f":"brine_valve_size","v":0},{"$f":"IF(D116>12,\"pp_mov_eq_large\",\"pp_mov_eq_small\")","v":"pp_mov_eq_small"},0,0,0,0,445.65232098299998,0.21268194000000001,0,0,0,0,12,0]
["Stainless Steel - Brine","ss_mov_eq_brine",{"$error":"#NUM!"},{"$f":"brine_valve_size","v":0},"ss_mov_eq",0,0,0,0,0,0,0,76.908725779999997,393.08666071099998,200.56854674600001,48.1,0]
["Polypropylene/PVC - Bypass","pp_mov_eq_bp",{"$error":"#NUM!"},{"$f":"bypass_valve_size","v":0},{"$f":"IF(D118>12,\"pp_mov_eq_large\",\"pp_mov_eq_small\")","v":"pp_mov_eq_small"},0,0,0,0,445.65232098299998,0.21268194000000001,0,0,0,0,12,0]
["Stainless Steel - Bypass","ss_mov_eq_bp",{"$error":"#NUM!"},{"$f":"bypass_valve_size","v":0},"ss_mov_eq",0,0,0,0,0,0,0,76.908725779999997,393.08666071099998,200.56854674600001,48.1,0]
["Cast Iron - Bypass","ci_mov_eq_bp","contact vendor",{"$f":"bypass_valve_size","v":0},"ci_mov_eq",{"$f":"VLOOKUP($E120,eq_table_cl,F$5,FALSE)","v":0},0,0,0,0,0,-6.5106489000000003E-2,28.845623929999999,71.319704893999997,1027.6738701910001,48.1,1]
["Polypropylene/PVC - acid","pp_mov_eq_acid",{"$error":"#NUM!"},{"$f":"acid_valve_size","v":0},{"$f":"IF(D121>12,\"pp_mov_eq_large\",\"pp_mov_eq_small\")","v":"pp_mov_eq_small"},0,0,0,0,445.65232098299998,0.21268194000000001,0,0,0,0,12,0]
["Stainless Steel - acid","ss_mov_eq_acid",{"$error":"#NUM!"},{"$f":"acid_valve_size","v":0},"ss_mov_eq",0,0,0,0,0,0,0,76.908725779999997,393.08666071099998,200.56854674600001,48.1,0]
["Polypropylene/PVC - caustic","pp_mov_eq_caustic",{"$error":"#NUM!"},{"$f":"caustic_valve_size","v":0},{"$f":"IF(D123>12,\"pp_mov_eq_large\",\"pp_mov_eq_small\")","v":"pp_mov_eq_small"},0,0,0,0,445.65232098299998,0.21268194000000001,0,0,0,0,12,0]
["Stainless Steel - caustic","ss_mov_eq_caustic",{"$error":"#NUM!"},{"$f":"caustic_valve_size","v":0},"ss_mov_eq",0,0,0,0,0,0,0,76.908725779999997,393.08666071099998,200.56854674600001,48.1,0]
["Polypropylene/PVC - residuals","pp_mov_eq_res",1596.5985493878329,{"$f":"res_valve_size","v":6},{"$f":"IF(D125>12,\"pp_mov_eq_large\",\"pp_mov_eq_small\")","v":"pp_mov_eq_small"},0,0,0,0,445.65232098299998,0.21268194000000001,0,0,0,0,12,0]
["Stainless Steel - residuals","ss_mov_eq_res",5327.8026390919995,{"$f":"res_valve_size","v":6},"ss_mov_eq",0,0,0,0,0,0,0,76.908725779999997,393.08666071099998,200.56854674600001,48.1,0]
["Cast Iron - residuals","ci_mov_eq_res",2479.9715594110003,{"$f":"res_valve_size","v":6},"ci_mov_eq",0,0,0,0,0,0,-6.5106489000000003E-2,28.845623929999999,71.319704893999997,1027.6738701910001,48.1,1]
["Polypropylene/PVC - Polymer","pp_mov_eq_polymer",{"$error":"#NUM!"},{"$f":"polymer_valve_size","v":0},{"$f":"IF(D128>12,\"pp_mov_eq_large\",\"pp_mov_eq_small\")","v":"pp_mov_eq_small"},0,0,0,0,445.65232098299998,0.21268194000000001,0,0,0,0,12,0]
["Stainless Steel - Polymer","ss_mov_eq_polymer",{"$error":"#NUM!"},{"$f":"polymer_valve_size","v":0},"ss_mov_eq",0,0,0,0,0,0,0,76.908725779999997,393.08666071099998,200.56854674600001,48.1,0]
["Cast Iron - Polymer","ci_mov_eq_polymer","contact vendor",{"$f":"polymer_valve_size","v":0},"ci_mov_eq",0,0,0,0,0,0,-6.5106489000000003E-2,28.845623929999999,71.319704893999997,1027.6738701910001,48.1,1]
["Manual"]
["Polypropylene/PVC - Inlet and outlet","pp_man_eq",{"$f":"IF(OR(D132>P132,D132<Q132),\"contact vendor\",F132*D132^G132+H132*LN(D132)+I132+J132*EXP(K132*D132)+L132*D132^3+M132*D132^2+N132*D132+O132)","v":"contact vendor"},{"$f":"in_valve_size","v":36},{"$f":"IF(D132>12,\"pp_man_eq_large\",\"pp_man_eq_small\")","v":"pp_man_eq_large"},{"$f":"VLOOKUP($E132,eq_table_cl,F$5,FALSE)","v":0},0,0,0,0,0,22.608525612000001,-1299.766716117,26028.146920531999,-164294.697081208,24.1,14]
["Stainless Steel - Inlet and outlet","ss_man_eq","contact vendor",{"$f":"in_valve_size","v":36},"ss_man_eq",223.248424414,1.684302033,0,0,0,0,0,0,0,0,12.1,1]
["Cast Iron - Inlet and outlet","ci_bfv_eq",15361.385772500671,{"$f":"in_valve_size","v":36},{"$f":"IF(D134>12,\"ci_bfv_eq_large\",\"ci_bfv_eq_small\")","v":"ci_bfv_eq_large"},51.741944672999999,1.5887577429999999,0,0,0,0,0,0,0,0,48.1,14]
["Polypropylene/PVC - Process","pp_man_eq_proc",2702.9254562980004,{"$f":"tank_valve_size","v":12},{"$f":"IF(D135>12,\"pp_man_eq_large\",\"pp_man_eq_small\")","v":"pp_man_eq_small"},0,0,0,0,0,0,2.7689868610000001,-29.723792209999999,180.93906510599999,27.073457458,12,0]
["Stainless Steel - Process","ss_man_eq_proc",14670.859880135979,{"$f":"tank_valve_size","v":12},"ss_man_eq",223.248424414,1.684302033,0,0,0,0,0,0,0,0,12.1,1]
["Cast Iron - Process","ci_bfv_eq_proc",2607.5819160230003,{"$f":"tank_valve_size","v":12},{"$f":"IF(D137>12,\"ci_bfv_eq_large\",\"ci_bfv_eq_small\")","v":"ci_bfv_eq_small"},0,0,0,0,0,0,-0.46051790100000001,13.155724568,123.18694075800001,30.689222062999999,12,1]
["Polypropylene/PVC - Backwash","pp_man_eq_back",989.98454969800002,{"$f":"back_valve_size","v":8},{"$f":"IF(D138>12,\"pp_man_eq_large\",\"pp_man_eq_small\")","v":"pp_man_eq_small"},0,0,0,0,0,0,2.7689868610000001,-29.723792209999999,180.93906510599999,27.073457458,12,0]
["Stainless Steel - Backwash","ss_man_eq_back",7410.7933578197863,{"$f":"back_valve_size","v":8},"ss_man_eq",223.248424414,1.684302033,0,0,0,0,0,0,0,0,12.1,1]
["Cast Iron - Backwash","ci_man_eq_back",1622.365955167,{"$f":"back_valve_size","v":8},{"$f":"IF(D140>12,\"ci_bfv_eq_large\",\"ci_bfv_eq_small\")","v":"ci_bfv_eq_small"},0,0,0,0,0,0,-0.46051790100000001,13.155724568,123.18694075800001,30.689222062999999,12,1]
["Polypropylene/PVC - Brine","pp_man_eq_brine",{"$error":"#NUM!"},{"$f":"brine_valve_size","v":0},{"$f":"IF(D141>12,\"pp_man_eq_large\",\"pp_man_eq_small\")","v":"pp_man_eq_small"},0,0,0,0,0,0,2.7689868610000001,-29.723792209999999,180.93906510599999,27.073457458,12,0]
["Stainless Steel - Brine","ss_man_eq_brine","contact vendor",{"$f":"brine_valve_size","v":0},"ss_man_eq",{"$f":"VLOOKUP($E142,eq_table_cl,F$5,FALSE)","v":223.248424414},1.684302033,0,0,0,0,0,0,0,0,12.1,1]
["Polypropylene/PVC - Bypass","pp_man_eq_bp",{"$error":"#NUM!"},{"$f":"bypass_valve_size","v":0},{"$f":"IF(D143>12,\"pp_man_eq_large\",\"pp_man_eq_small\")","v":"pp_man_eq_small"},0,0,0,0,0,0,2.7689868610000001,-29.723792209999999,180.93906510599999,27.073457458,12,0]
["Stainless Steel - Bypass","ss_man_eq_bp","contact vendor",{"$f":"bypass_valve_size","v":0},"ss_man_eq",223.248424414,1.684302033,0,0,0,0,0,0,0,0,12.1,1]
["Cast Iron - Bypass","ci_man_eq_bp","contact vendor",{"$f":"bypass_valve_size","v":0},{"$f":"IF(D145>12,\"ci_bfv_eq_large\",\"ci_bfv_eq_small\")","v":"ci_bfv_eq_small"},0,0,0,0,0,0,-0.46051790100000001,13.155724568,123.18694075800001,30.689222062999999,12,1]
["Polypropylene/PVC - Acid line","pp_man_eq_acid",{"$error":"#NUM!"},{"$f":"acid_valve_size","v":0},{"$f":"IF(D146>12,\"pp_man_eq_large\",\"pp_man_eq_small\")","v":"pp_man_eq_small"},0,0,0,0,0,0,2.7689868610000001,-29.723792209999999,180.93906510599999,27.073457458,12,0]
["Stainless Steel - Acid line","ss_man_eq_acid","contact vendor",{"$f":"acid_valve_size","v":0},"ss_man_eq",223.248424414,1.684302033,0,0,0,0,0,0,0,0,12.1,1]
["Polypropylene/PVC - caustic","pp_man_eq_caustic",{"$error":"#NUM!"},{"$f":"caustic_valve_size","v":0},{"$f":"IF(D148>12,\"pp_man_eq_large\",\"pp_man_eq_small\")","v":"pp_man_eq_small"},0,0,0,0,0,0,2.7689868610000001,-29.723792209999999,180.93906510599999,27.073457458,12,0]
["Stainless Steel - caustic","ss_man_eq_caustic","contact vendor",{"$f":"caustic_valve_size","v":0},"ss_man_eq",223.248424414,1.684302033,0,0,0,0,0,0,0,0,12.1,1]
["Polypropylene/PVC - residuals","pp_man_eq_res",640.75249050999992,{"$f":"res_valve_size","v":6},{"$f":"IF(D150>12,\"pp_man_eq_large\",\"pp_man_eq_small\")","v":"pp_man_eq_small"},0,0,0,0,0,0,2.7689868610000001,-29.723792209999999,180.93906510599999,27.073457458,12,0]
["Stainless Steel - residuals","ss_man_eq_res",4564.8880943881331,{"$f":"res_valve_size","v":6},"ss_man_eq",223.248424414,1.684302033,0,0,0,0,0,0,0,0,12.1,1]
["Cast Iron - residuals","ci_man_eq_res",1143.945084443,{"$f":"res_valve_size","v":6},{"$f":"IF(D152>12,\"ci_bfv_eq_large\",\"ci_bfv_eq_small\")","v":"ci_bfv_eq_small"},0,0,0,0,0,0,-0.46051790100000001,13.155724568,123.18694075800001,30.689222062999999,12,1]
["Polypropylene/PVC - Polymer","pp_man_eq_polymer",{"$error":"#NUM!"},{"$f":" polymer_valve_size","v":0},{"$f":"IF(D153>12,\"pp_man_eq_large\",\"pp_man_eq_small\")","v":"pp_man_eq_small"},0,0,0,0,0,0,2.7689868610000001,-29.723792209999999,180.93906510599999,27.073457458,12,0]
["Stainless Steel - Polymer","ss_man_eq_polymer","contact vendor",{"$f":" polymer_valve_size","v":0},"ss_man_eq",223.248424414,1.684302033,0,0,0,0,0,0,0,0,12.1,1]
["Cast Iron - Polymer","ci_man_eq_polymer","contact vendor",{"$f":" polymer_valve_size","v":0},{"$f":"IF(D155>12,\"ci_bfv_eq_large\",\"ci_bfv_eq_small\")","v":"ci_bfv_eq_small"},0,0,0,0,0,0,-0.46051790100000001,13.155724568,123.18694075800001,30.689222062999999,12,1]
["Check Valves"]
["Polypropylene/PVC - Backwash","pp_chv_eq",{"$f":"IF(OR(D157>P157,D157<Q157),\"contact vendor\",F157*D157^G157+H157*LN(D157)+I157+J157*EXP(K157*D157)+L157*D157^3+M157*D157^2+N157*D157+O157)","v":2261.6080379109999},{"$f":"back_valve_size","v":8},"pp_chv_eq",{"$f":"VLOOKUP($E157,eq_table_cl,F$5,FALSE)","v":0},0,0,0,0,0,0,29.515280190999999,41.246830076999998,42.655465071000002,12.1,0]
["Stainless Steel - Backwash","ss_chv_eq",4564.063480926,{"$f":"back_valve_size","v":8},"ss_chv_eq",0,0,0,0,0,0,0,31.65091559,305.12540561700001,97.401638230000003,48.1,0]
["Cast Iron - Backwash","ci_chv_eq",2870.1671423900002,{"$f":"back_valve_size","v":8},"ci_chv_eq",0,0,0,0,0,0,1.023101824,-6.5814120579999997,411.440485583,-523.97450445000004,24.1,2]
["Polypropylene/PVC - Inlet and Outlet","pp_chv_eq_in","contact vendor",{"$f":"in_valve_size","v":36},"pp_chv_eq",0,0,0,0,0,0,0,29.515280190999999,41.246830076999998,42.655465071000002,12.1,0]
["Stainless Steel - Inlet and Outlet","ss_chv_eq_in",52101.502845082003,{"$f":"in_valve_size","v":36},"ss_chv_eq",0,0,0,0,0,0,0,31.65091559,305.12540561700001,97.401638230000003,48.1,0]
["Cast Iron - Inlet and Outlet","ci_chv_eq_in","contact vendor",{"$f":"in_valve_size","v":36},"ci_chv_eq",0,0,0,0,0,0,1.023101824,-6.5814120579999997,411.440485583,-523.97450445000004,24.1,2]
["Polypropylene/PVC - Bypass","pp_chv_eq_bp",{"$error":"#NUM!"},{"$f":"bypass_valve_size","v":0},"pp_chv_eq",0,0,0,0,0,0,0,29.515280190999999,41.246830076999998,42.655465071000002,12.1,0]
["Stainless Steel - Bypass","ss_chv_eq_bp",{"$error":"#NUM!"},{"$f":"bypass_valve_size","v":0},"ss_chv_eq",0,0,0,0,0,0,0,31.65091559,305.12540561700001,97.401638230000003,48.1,0]
["Cast Iron - Bypass","ci_chv_eq_bp","contact vendor",{"$f":"bypass_valve_size","v":0},"ci_chv_eq",0,0,0,0,0,0,1.023101824,-6.5814120579999997,411.440485583,-523.97450445000004,24.1,2]
["Polypropylene/PVC - Regenerant","pp_chv_eq_brine",{"$error":"#NUM!"},{"$f":"brine_valve_size","v":0},"pp_chv_eq",0,0,0,0,0,0,0,29.515280190999999,41.246830076999998,42.655465071000002,12.1,0]
["Stainless Steel - Regenerant","ss_chv_eq_brine",{"$error":"#NUM!"},{"$f":"brine_valve_size","v":0},"ss_chv_eq",{"$f":"VLOOKUP($E167,eq_table_cl,F$5,FALSE)","v":0},0,0,0,0,0,0,31.65091559,305.12540561700001,97.401638230000003,48.1,0]
["Polypropylene/PVC - acid","pp_chv_eq_acid",{"$error":"#NUM!"},{"$f":"acid_valve_size","v":0},"pp_chv_eq",0,0,0,0,0,0,0,29.515280190999999,41.246830076999998,42.655465071000002,12.1,0]
["Stainless Steel - acid","ss_chv_eq_acid",{"$error":"#NUM!"},{"$f":"acid_valve_size","v":0},"ss_chv_eq",0,0,0,0,0,0,0,31.65091559,305.12540561700001,97.401638230000003,48.1,0]
["Polypropylene/PVC - caustic","pp_chv_eq_caustic",{"$error":"#NUM!"},{"$f":"caustic_valve_size","v":0},"pp_chv_eq",0,0,0,0,0,0,0,29.515280190999999,41.246830076999998,42.655465071000002,12.1,0]
["Stainless Steel - caustic","ss_chv_eq_caustic",{"$error":"#NUM!"},{"$f":"caustic_valve_size","v":0},"ss_chv_eq",0,0,0,0,0,0,0,31.65091559,305.12540561700001,97.401638230000003,48.1,0]
["Polypropylene/PVC - Residuals","pp_chv_eq_res",1352.6865324089999,{"$f":"res_valve_size","v":6},"pp_chv_eq",0,0,0,0,0,0,0,29.515280190999999,41.246830076999998,42.655465071000002,12.1,0]
["Stainless Steel - Residuals","ss_chv_eq_res",3067.5870331720002,{"$f":"res_valve_size","v":6},"ss_chv_eq",0,0,0,0,0,0,0,31.65091559,305.12540561700001,97.401638230000003,48.1,0]
["Cast Iron - Residuals","ci_chv_eq_res",1928.7275689439998,{"$f":"res_valve_size","v":6},"ci_chv_eq",0,0,0,0,0,0,1.023101824,-6.5814120579999997,411.440485583,-523.97450445000004,24.1,2]
["Polypropylene/PVC - Polymer","pp_chv_eq_polymer",{"$error":"#NUM!"},{"$f":"polymer_valve_size","v":0},"pp_chv_eq",0,0,0,0,0,0,0,29.515280190999999,41.246830076999998,42.655465071000002,12.1,0]
["Stainless Steel - Polymer","ss_chv_eq_polymer",{"$error":"#NUM!"},{"$f":"polymer_valve_size","v":0},"ss_chv_eq",0,0,0,0,0,0,0,31.65091559,305.12540561700001,97.401638230000003,48.1,0]
["Cast Iron - Polymer","ci_chv_eq_polymer","contact vendor",{"$f":"polymer_valve_size","v":0},"ci_chv_eq",0,0,0,0,0,0,1.023101824,-6.5814120579999997,411.440485583,-523.97450445000004,24.1,2]
["Pumps"]
["Booster","pump_eq",{"$f":"IF(OR(D179>P179,D179<Q179),\"contact vendor\",F179*D179^G179+H179*LN(D179)+I179+J179*EXP(K179*D179)+L179*D179^3+M179*D179^2+N179*D179+O179)","v":82432.552250858993},{"$f":"pump_rating","v":10000},"pump_eq",{"$f":"VLOOKUP($E179,eq_table_cl,F$5,FALSE)","v":0},0,0,0,0,0,0,-4.77083E-4,12.333908155,6801.7707008589996,10001,0]
["Backwash","pump_eq_back",{"$f":"IF(OR(D180>P180,D180<Q180),\"contact vendor\",F180*D180^G180+H180*LN(D180)+I180+J180*EXP(K180*D180)+L180*D180^3+M180*D180^2+N180*D180+O180)","v":21751.945546609},{"$f":"back_pump_rating","v":1275},"back_pump_eq",0,0,0,0,0,0,0,-4.77083E-4,12.333908155,6801.7707008589996,10001,0]
["Regenerant","pump_eq_regen",{"$f":"IF(OR(D181>P181,D181<Q181),\"contact vendor\",F181*D181^G181+H181*LN(D181)+I181+J181*EXP(K181*D181)+L181*D181^3+M181*D181^2+N181*D181+O181)","v":{"$error":"#NUM!"}},{"$f":"regen_pump_rating","v":0},"back_pump_eq",0,0,0,0,0,0,0,-4.77083E-4,12.333908155,6801.7707008589996,10001,0]
["Metering for Regenerant Mixing","pump_eq_mix",{"$f":"IF(OR(D182>P182,D182<Q182),\"contact vendor\",F182*D182^G182+H182*LN(D182)+I182+J182*EXP(K182*D182)+L182*D182^3+M182*D182^2+N182*D182+O182)","v":{"$error":"#NUM!"}},{"$f":"mix_pump_rating","v":0},"chem_pump_eq",0,0,0,0,0,0,1.0000000000000001E-9,-3.8862999999999997E-5,0.74032627600000001,864.25764240000001,30000.01,0]
["Metering for Acid Rinse","pump_eq_rinse",{"$f":"IF(OR(D183>P183,D183<Q183),\"contact vendor\",F183*D183^G183+H183*LN(D183)+I183+J183*EXP(K183*D183)+L183*D183^3+M183*D183^2+N183*D183+O183)","v":{"$error":"#NUM!"}},{"$f":"rinse_pump_rating","v":0},"chem_pump_eq",0,0,0,0,0,0,1.0000000000000001E-9,-3.8862999999999997E-5,0.74032627600000001,864.25764240000001,30000.01,0]
["Metering for pH adjustment"]
["PVC - Motor Driven","pvc_mmpump_eq",{"$f":"IF(OR(D185>P185,D185<Q185),\"contact vendor\",F185*D185^G185+H185*LN(D185)+I185+J185*EXP(K185*D185)+L185*D185^3+M185*D185^2+N185*D185+O185)","v":{"$error":"#NUM!"}},{"$f":"pH_pump_rating","v":0},"pvc_mmpump_eq",{"$f":"VLOOKUP($E185,eq_table_cl,F$5,FALSE)","v":2172.344597881},0.151638992,0,0,0,0,0,0,0,0,108.01,0]
["Stainless Steel - Motor Driven","ss_mmpump_eq",{"$f":"IF(OR(D186>P186,D186<Q186),\"contact vendor\",F186*D186^G186+H186*LN(D186)+I186+J186*EXP(K186*D186)+L186*D186^3+M186*D186^2+N186*D186+O186)","v":{"$error":"#NUM!"}},{"$f":"pH_pump_rating","v":0},"ss_mmpump_eq",0,0,0,0,0,0,-5.1428000000000003E-5,2.3675107000000001E-2,7.1142014380000003,4470.4404501380004,360.01,0]
["PVC - Electric","pvc_empump_eq",{"$f":"IF(OR(D187>P187,D187<Q187),\"contact vendor\",F187*D187^G187+H187*LN(D187)+I187+J187*EXP(K187*D187)+L187*D187^3+M187*D187^2+N187*D187+O187)","v":{"$error":"#NUM!"}},{"$f":"pH_pump_rating","v":0},"pvc_empump_eq",857.79971691399999,0.297241692,0,0,0,0,0,0,0,0,71.160000000000011,0]
["Stainless Steel - Electric","ss_empump_eq",{"$f":"IF(OR(D188>P188,D188<Q188),\"contact vendor\",F188*D188^G188+H188*LN(D188)+I188+J188*EXP(K188*D188)+L188*D188^3+M188*D188^2+N188*D188+O188)","v":{"$error":"#NUM!"}},{"$f":"pH_pump_rating","v":0},"ss_empump_eq",1671.4158388379999,0.21567175299999999,0,0,0,0,0,0,0,0,186.35999999999999,0]
["Residuals","res_pump_eq",{"$f":"IF(OR(D189>P189,D189<Q189),\"contact vendor\",F189*D189^G189+H189*LN(D189)+I189+J189*EXP(K189*D189)+L189*D189^3+M189*D189^2+N189*D189+O189)","v":{"$error":"#NUM!"}},{"$f":"res_pump_rating","v":0},"pump_eq",0,0,0,0,0,0,0,-4.77083E-4,12.333908155,6801.7707008589996,10001,0]
["Polymer Metering"]
["PVC - Motor Driven","pvc_polymer_mmpump_eq",{"$f":"IF(OR(D191>P191,D191<Q191),\"contact vendor\",F191*D191^G191+H191*LN(D191)+I191+J191*EXP(K191*D191)+L191*D191^3+M191*D191^2+N191*D191+O191)","v":{"$error":"#NUM!"}},{"$f":"cm_pump_rating_polymer","v":0},"pvc_mmpump_eq",{"$f":"VLOOKUP($E191,eq_table_cl,F$5,FALSE)","v":2172.344597881},0.151638992,0,0,0,0,0,0,0,0,108.01,0]
["Stainless Steel - Motor Driven","ss_polymer_mmpump_eq",{"$f":"IF(OR(D192>P192,D192<Q192),\"contact vendor\",F192*D192^G192+H192*LN(D192)+I192+J192*EXP(K192*D192)+L192*D192^3+M192*D192^2+N192*D192+O192)","v":{"$error":"#NUM!"}},{"$f":"cm_pump_rating_polymer","v":0},"ss_mmpump_eq",0,0,0,0,0,0,-5.1428000000000003E-5,2.3675107000000001E-2,7.1142014380000003,4470.4404501380004,360.01,0]
["PVC - Electric","pvc_polymer_empump_eq",{"$f":"IF(OR(D193>P193,D193<Q193),\"contact vendor\",F193*D193^G193+H193*LN(D193)+I193+J193*EXP(K193*D193)+L193*D193^3+M193*D193^2+N193*D193+O193)","v":{"$error":"#NUM!"}},{"$f":"cm_pump_rating_polymer","v":0},"pvc_empump_eq",857.79971691399999,0.297241692,0,0,0,0,0,0,0,0,71.160000000000011,0]
["Stainless Steel - Electric","ss_polymer_empump_eq",{"$f":"IF(OR(D194>P194,D194<Q194),\"contact vendor\",F194*D194^G194+H194*LN(D194)+I194+J194*EXP(K194*D194)+L194*D194^3+M194*D194^2+N194*D194+O194)","v":{"$error":"#NUM!"}},{"$f":"cm_pump_rating_polymer","v":0},"ss_empump_eq",1671.4158388379999,0.21567175299999999,0,0,0,0,0,0,0,0,186.35999999999999,0]
["Mixers"]
["Brine"]
["Portable","no equation"]
["Mounted","mount_mix_eq",{"$f":"IF(OR(D198>P198,D198<Q198),\"contact vendor\",F198*D198^G198+H198*LN(D198)+I198+J198*EXP(K198*D198)+L198*D198^3+M198*D198^2+N198*D198+O198)","v":2772.0361261569997},{"$f":"mixer_size","v":1},"mount_mix_eq",{"$f":"VLOOKUP($E198,eq_table_cl,F$5,FALSE)","v":0},0,0,0,0,0,0,-107.78403992600001,1233.9520801589999,1645.8680859240001,4.0999999999999996,0]
["Residuals"]
["Portable","no equation"]
["Mounted","hmount_mix_eq",{"$f":"IF(OR(D201>P201,D201<Q201),\"contact vendor\",F201*D201^G201+H201*LN(D201)+I201+J201*EXP(K201*D201)+L201*D201^3+M201*D201^2+N201*D201+O201)","v":{"$error":"#NUM!"}},{"$f":"hmix_size","v":0},"mount_mix_eq",{"$f":"VLOOKUP($E201,eq_table_cl,F$5,FALSE)","v":0},0,0,0,0,0,0,-107.78403992600001,1233.9520801589999,1645.8680859240001,4.0999999999999996,0]
["Impeller","himp_mix_eq",{"$f":"IF(OR(D202>P202,D202<Q202),\"contact vendor\",F202*D202^G202+H202*LN(D202)+I202+J202*EXP(K202*D202)+L202*D202^3+M202*D202^2+N202*D202+O202)","v":{"$error":"#NUM!"}},{"$f":"hmix_size","v":0},"imp_mix_eq",4383.3876341309997,0.62611698800000004,0,0,0,0,0,0,0,0,110,0]
["Eductors and Chemical Feeders"]
["Eductors"]
["Stainless Steel","ss_eductor_eq",{"$f":"IF(OR(D205>P205,D205<Q205),\"contact vendor\",F205*D205^G205+H205*LN(D205)+I205+J205*EXP(K205*D205)+L205*D205^3+M205*D205^2+N205*D205+O205)","v":{"$error":"#NUM!"}},{"$f":"brine_pipe_diam","v":0},"ss_eductor_eq",{"$f":"VLOOKUP($E205,eq_table_cl,F$5,FALSE)","v":0},0,0,0,0,0,0,133.062250132,527.05247894900003,231.58887476800001,8,0]
["Plastic","pl_eductor_eq",{"$f":"IF(OR(D206>P206,D206<Q206),\"contact vendor\",F206*D206^G206+H206*LN(D206)+I206+J206*EXP(K206*D206)+L206*D206^3+M206*D206^2+N206*D206+O206)","v":{"$error":"#NUM!"}},{"$f":"brine_pipe_diam","v":0},"pl_eductor_eq",0,0,0,0,383.643847569,0.60207698600000004,0,0,0,0,3.1,0]
["Slurry Pump System for solids","res_slurry_eq",{"$f":"IF(OR(D207>P207,D207<Q207),\"contact vendor\",F207*D207^G207+H207*LN(D207)+I207+J207*EXP(K207*D207)+L207*D207^3+M207*D207^2+N207*D207+O207)","v":{"$error":"#NUM!"}},{"$f":"res_transfer_rate","v":0},"gac_slurry_eq",0,0,0,0,0,0,0,2.2932E-5,4.4447339000000002E-2,7282.0233269930004,31242,0]
["Eductors for solids","res_seductor_eq",{"$f":"IF(OR(D208>P208,D208<Q208),\"contact vendor\",F208*D208^G208+H208*LN(D208)+I208+J208*EXP(K208*D208)+L208*D208^3+M208*D208^2+N208*D208+O208)","v":"contact vendor"},{"$f":"res_eductor_size","v":"NA"},"seductor_eq",0,0,0,0,0,0,0,0,2957.7663495749998,-2746.946806985,6.1,1.5]
["Volumetric Feeders","vol_feed_eq",{"$f":"IF(OR(D209>P209,D209<Q209),\"contact vendor\",F209*D209^G209+H209*LN(D209)+I209+J209*EXP(K209*D209)+L209*D209^3+M209*D209^2+N209*D209+O209)","v":{"$error":"#NUM!"}},{"$f":"vol_feed_rate","v":0},"vol_feed_eq",0,0,0,0,0,0,0,0,376.52630596099999,15176.853694399,2.5099999999999998,0]
["Gravimetric Feeders","no equation"]
["Volumetric Feeders for coagulant","res_vol_feed_eq",{"$f":"IF(OR(D211>P211,D211<Q211),\"contact vendor\",F211*D211^G211+H211*LN(D211)+I211+J211*EXP(K211*D211)+L211*D211^3+M211*D211^2+N211*D211+O211)","v":{"$error":"#NUM!"}},{"$f":"res_vol_feed_rate","v":0},"vol_feed_eq",{"$f":"VLOOKUP($E211,eq_table_cl,F$5,FALSE)","v":0},0,0,0,0,0,0,0,376.52630596099999,15176.853694399,2.5099999999999998,0]
["Gravimetric Feeders for coagulant","no equation"]
["Salt Saturator"]
["Fiberglass","fg_saltbox_eq",{"$f":"IF(OR(D214>P214,D214<Q214),\"contact vendor\",F214*D214^G214+H214*LN(D214)+I214+J214*EXP(K214*D214)+L214*D214^3+M214*D214^2+N214*D214+O214)","v":{"$error":"#NUM!"}},{"$f":"salt_box_size","v":0},"fg_saltbox_eq",{"$f":"VLOOKUP($E214,eq_table_cl,F$5,FALSE)","v":0},0,0,0,0,0,0.140791365,-20.480493523,1375.752707719,16108.530025823,75.099999999999994,0]
["Reinforced Plastic","pl_saltbox_eq",{"$f":"IF(OR(D215>P215,D215<Q215),\"contact vendor\",F215*D215^G215+H215*LN(D215)+I215+J215*EXP(K215*D215)+L215*D215^3+M215*D215^2+N215*D215+O215)","v":"contact vendor"},{"$f":"salt_box_size","v":0},"pl_saltbox_eq",0,0,0,0,0,0,-1.1798941E-2,-1.984634767,575.45050508199995,21526.521474727,80.099999999999994,23]
["Instrumentation and Controls"]
["Flow Meters - Inlet and Outlet"]
["Orifice Plate","op_fm_eq_in",{"$f":"IF(OR(D218>P218,D218<Q218),\"contact vendor\",F218*D218^G218+H218*LN(D218)+I218+J218*EXP(K218*D218)+L218*D218^3+M218*D218^2+N218*D218+O218)","v":14784.720705442},{"$f":"in_meter_size","v":36},"op_fm_eq",{"$f":"VLOOKUP($E218,eq_table_cl,F$5,FALSE)","v":0},0,0,0,0,0,0.100507337,-4.5180455940000002,372.09362808600002,2555.4668690980002,60.1,0]
["Propeller","prop_fm_eq_in","contact vendor",{"$f":"in_meter_size","v":36},"prop_fm_eq",0,0,0,0,0,0,8.915703422,-172.289864142,1293.6972747970001,655.77680475800003,14.1,0]
["Venturi","ven_fm_eq_in","contact vendor",{"$f":"in_meter_size","v":36},"ven_fm_eq",0,0,0,0,0,0,8.413593852,-263.19800276199999,3397.39818913,-230.584107966,24.1,0]
["Magnetic","mag_fm_eq_in","contact vendor",{"$f":"in_meter_size","v":36},"mag_fm_eq",0,0,0,0,0,0,0,57.575432208000002,189.85395229299999,3620.6311514190002,20.100000000000001,0]
["Flow Meters - Process"]
["Orifice Plate","op_fm_eq_proc",6543.6685189300006,{"$f":"proc_meter_size","v":12},"op_fm_eq",{"$f":"VLOOKUP($E223,eq_table_cl,F$5,FALSE)","v":0},0,0,0,0,0,0.100507337,-4.5180455940000002,372.09362808600002,2555.4668690980002,60.1,0]
["Propeller","prop_fm_eq_proc",6776.739179090001,{"$f":"proc_meter_size","v":12},"prop_fm_eq",0,0,0,0,0,0,8.915703422,-172.289864142,1293.6972747970001,655.77680475800003,14.1,0]
["Venturi","ven_fm_eq_proc",17176.371940122004,{"$f":"proc_meter_size","v":12},"ven_fm_eq",0,0,0,0,0,0,8.413593852,-263.19800276199999,3397.39818913,-230.584107966,24.1,0]
["Magnetic","mag_fm_eq_proc",14189.740816887001,{"$f":"proc_meter_size","v":12},"mag_fm_eq",0,0,0,0,0,0,0,57.575432208000002,189.85395229299999,3620.6311514190002,20.100000000000001,0]
["Flow Meters - Backwash"]
["Orifice Plate","op_fm_eq_back",5294.5207323140003,{"$f":"back_meter_size","v":8},"op_fm_eq",{"$f":"VLOOKUP($E228,eq_table_cl,F$5,FALSE)","v":0},0,0,0,0,0,0.100507337,-4.5180455940000002,372.09362808600002,2555.4668690980002,60.1,0]
["Propeller","prop_fm_eq_back",4543.643850110001,{"$f":"back_meter_size","v":8},"prop_fm_eq",0,0,0,0,0,0,8.915703422,-172.289864142,1293.6972747970001,655.77680475800003,14.1,0]
["Venturi","ven_fm_eq_back",14411.689280529999,{"$f":"back_meter_size","v":8},"ven_fm_eq",0,0,0,0,0,0,8.413593852,-263.19800276199999,3397.39818913,-230.584107966,24.1,0]
["Magnetic","mag_fm_eq_back",8824.290431075,{"$f":"back_meter_size","v":8},"mag_fm_eq",0,0,0,0,0,0,0,57.575432208000002,189.85395229299999,3620.6311514190002,20.100000000000001,0]
["Flow Meters - Residuals"]
["Orifice Plate","op_fm_eq_res",4647.0885810220007,{"$f":"res_meter_size","v":6},"op_fm_eq",{"$f":"VLOOKUP($E233,eq_table_cl,F$5,FALSE)","v":0},0,0,0,0,0,0.100507337,-4.5180455940000002,372.09362808600002,2555.4668690980002,60.1,0]
["Propeller","prop_fm_eq_res",4141.3172835800005,{"$f":"res_meter_size","v":6},"prop_fm_eq",0,0,0,0,0,0,8.915703422,-172.289864142,1293.6972747970001,655.77680475800003,14.1,0]
["Venturi","ven_fm_eq_res",12496.013199414001,{"$f":"res_meter_size","v":6},"ven_fm_eq",0,0,0,0,0,0,8.413593852,-263.19800276199999,3397.39818913,-230.584107966,24.1,0]
["Magnetic","mag_fm_eq_res",6832.4704246649999,{"$f":"res_meter_size","v":6},"mag_fm_eq",0,0,0,0,0,0,0,57.575432208000002,189.85395229299999,3620.6311514190002,20.100000000000001,0]
["Building Structures and HVAC",null,{"$f":"IF(LEN($E237)=0,\"\",IF(OR(D237>P237,D237<Q237),\"contact vendor\",F237*D237^G237+H237*LN(D237)+I237+J237*EXP(K237*D237)+L237*D237^3+M237*D237^2+N237*D237+O237))","v":""},null,null,{"$f":"IF(LEN($E237)=0,\"\",VLOOKUP($E237,eq_table_cl,F$7,FALSE))","v":""},"","","","","","","","","","",""]
["Building 1",null,"",null,null,"","","","","","","","","","","",""]
["Low Quality Structure","bldg_lo_eq_1",58.876582172810558,{"$f":"build1_fp","v":22360},"bldg_lo_eq",{"$f":"VLOOKUP($E239,eq_table_cl,F$5,FALSE)","v":155.424184946},-9.6925793999999996E-2,0,0,0,0,0,0,0,0,200000.1,0]
["Medium Quality Structure","bldg_mid_eq_1",71.318725178273326,{"$f":"build1_fp","v":22360},"bldg_mid_eq",190.764076528,-9.8240209999999994E-2,0,0,0,0,0,0,0,0,200000.1,0]
["High Quality Structure","bldg_hi_eq_1",89.008904792110499,{"$f":"build1_fp","v":22360},"bldg_hi_eq",334.86430719700002,-0.13230006499999999,0,0,0,0,0,0,0,0,200000.1,0]
["Heating System",null,"",null,null,{"$f":"IF(LEN($E242)=0,\"\",VLOOKUP($E242,eq_table_cl,F$7,FALSE))","v":""},"","","","","","","","","","",""]
["Electric resistance","hvac_elec_eq_1",122814.3988587482,{"$f":"build1_heat_mbh/build1_zones","v":362.06159179643424},"hvac_elec_eq",{"$f":"VLOOKUP($E243,eq_table_cl,F$5,FALSE)","v":1458.1434692969999},0.75248641199999999,0,0,0,0,0,0,0,0,6148.1,0]
["Natural gas non-condensing furnace","hvac_gas_non_eq_1",79981.616570299171,{"$f":"build1_heat_mbh/build1_zones","v":362.06159179643424},"hvac_gas_non_eq",813.17633428099998,0.77881003199999999,0,0,0,0,0,0,0,0,5032.1000000000004,0]
["Natural gas condensing furnace","hvac_gas_eq_1",79981.616570299171,{"$f":"build1_heat_mbh/build1_zones","v":362.06159179643424},"hvac_gas_eq",813.17633428099998,0.77881003199999999,0,0,0,0,0,0,0,0,5032.1000000000004,0]
["Standard efficiency oil furnace","hvac_oil_std_eq_1",84859.017061863167,{"$f":"build1_heat_mbh/build1_zones","v":362.06159179643424},"hvac_oil_std_eq",969.86352683699999,0.75894977500000005,0,0,0,0,0,0,0,0,3350.1,0]
["Mid-efficiency oil furnace","hvac_oil_mid_eq_1",84859.017061863167,{"$f":"build1_heat_mbh/build1_zones","v":362.06159179643424},"hvac_oil_mid_eq",969.86352683699999,0.75894977500000005,0,0,0,0,0,0,0,0,3350.1,0]
["Cooling System",null,"",null,null,{"$f":"IF(LEN($E248)=0,\"\",VLOOKUP($E248,eq_table_cl,F$7,FALSE))","v":""},"","","","","","","","","","",""]
["Air conditioning system","hvac_ac_eq_1",{"$f":"IF(LEN($E249)=0,\"\",IF(OR(D249>P249,D249<Q249),\"contact vendor\",F249*D249^G249+H249*LN(D249)+I249+J249*EXP(K249*D249)+L249*D249^3+M249*D249^2+N249*D249+O249))","v":35689.537748661809},{"$f":"build1_cooling_tons/build1_zones","v":9.3165564509936409},"hvac_ac_eq",{"$f":"VLOOKUP($E249,eq_table_cl,F$5,FALSE)","v":2628.2259000700001},1.168812894,0,0,0,0,0,0,0,0,113.33,0]
["Heat pump","hvac_hp_eq_1",13349.769652681096,{"$f":"build1_cooling_tons/build1_zones","v":9.3165564509936409},{"$f":"IF(D250>12,\"hvac_hp_eq_large\",\"hvac_hp_eq_small\")","v":"hvac_hp_eq_small"},0,0,0,0,3286.0714454029999,0.15046400200000001,0,0,0,0,12,0]
["Building 2",null,{"$f":"IF(LEN($E251)=0,\"\",IF(OR(D251>P251,D251<Q251),\"contact vendor\",F251*D251^G251+H251*LN(D251)+I251+J251*EXP(K251*D251)+L251*D251^3+M251*D251^2+N251*D251+O251))","v":""},null,null,{"$f":"IF(LEN($E251)=0,\"\",VLOOKUP($E251,eq_table_cl,F$7,FALSE))","v":""},"","","","","","","","","","",""]
["Low Quality Structure","bldg_lo_eq_2",{"$f":"IF(LEN($E252)=0,\"\",IF(OR(D252>P252,D252<Q252),\"contact vendor\",F252*D252^G252+H252*LN(D252)+I252+J252*EXP(K252*D252)+L252*D252^3+M252*D252^2+N252*D252+O252))","v":69.893148070999302},{"$f":"build2_fp","v":3810},"bldg_lo_eq",{"$f":"VLOOKUP($E252,eq_table_cl,F$5,FALSE)","v":155.424184946},-9.6925793999999996E-2,0,0,0,0,0,0,0,0,200000.1,0]
["Medium Quality Structure","bldg_mid_eq_2",{"$f":"IF(LEN($E253)=0,\"\",IF(OR(D253>P253,D253<Q253),\"contact vendor\",F253*D253^G253+H253*LN(D253)+I253+J253*EXP(K253*D253)+L253*D253^3+M253*D253^2+N253*D253+O253))","v":84.860536459409005},{"$f":"build2_fp","v":3810},"bldg_mid_eq",190.764076528,-9.8240209999999994E-2,0,0,0,0,0,0,0,0,200000.1,0]
["High Quality Structure","bldg_hi_eq_2",{"$f":"IF(LEN($E254)=0,\"\",IF(OR(D254>P254,D254<Q254),\"contact vendor\",F254*D254^G254+H254*LN(D254)+I254+J254*EXP(K254*D254)+L254*D254^3+M254*D254^2+N254*D254+O254))","v":112.48956879724031},{"$f":"build2_fp","v":3810},"bldg_hi_eq",334.86430719700002,-0.13230006499999999,0,0,0,0,0,0,0,0,200000.1,0]
["Heating System",null,""]
["Electric resistance","hvac_elec_eq_2",54145.776436687491,{"$f":"build2_heat_mbh/build2_zones","v":121.92793600618},"hvac_elec_eq",{"$f":"VLOOKUP($E256,eq_table_cl,F$5,FALSE)","v":1458.1434692969999},0.75248641199999999,0,0,0,0,0,0,0,0,6148.1,0]
["Natural gas non-condensing furnace","hvac_gas_non_eq_2",34265.95562616321,{"$f":"build2_heat_mbh/build2_zones","v":121.92793600618},"hvac_gas_non_eq",813.17633428099998,0.77881003199999999,0,0,0,0,0,0,0,0,5032.1000000000004,0]
["Natural gas condensing furnace","hvac_gas_eq_2",34265.95562616321,{"$f":"build2_heat_mbh/build2_zones","v":121.92793600618},"hvac_gas_eq",813.17633428099998,0.77881003199999999,0,0,0,0,0,0,0,0,5032.1000000000004,0]
["Standard efficiency oil furnace","hvac_oil_std_eq_2",37149.946991671277,{"$f":"build2_heat_mbh/build2_zones","v":121.92793600618},"hvac_oil_std_eq",969.86352683699999,0.75894977500000005,0,0,0,0,0,0,0,0,3350.1,0]
["Mid-efficiency oil furnace","hvac_oil_mid_eq_2",37149.946991671277,{"$f":"build2_heat_mbh/build2_zones","v":121.92793600618},"hvac_oil_mid_eq",969.86352683699999,0.75894977500000005,0,0,0,0,0,0,0,0,3350.1,0]
["Cooling System",null,"",null,null,{"$f":"IF(LEN($E261)=0,\"\",VLOOKUP($E261,eq_table_cl,F$7,FALSE))","v":""},"","","","","","","","","","",""]
["Air conditioning system","hvac_ac_eq_2",{"$f":"IF(LEN($E262)=0,\"\",IF(OR(D262>P262,D262<Q262),\"contact vendor\",F262*D262^G262+H262*LN(D262)+I262+J262*EXP(K262*D262)+L262*D262^3+M262*D262^2+N262*D262+O262))","v":143394.16141026179},{"$f":"build2_cooling_tons/build2_zones","v":30.62040749909627},"hvac_ac_eq",{"$f":"VLOOKUP($E262,eq_table_cl,F$5,FALSE)","v":2628.2259000700001},1.168812894,0,0,0,0,0,0,0,0,113.33,0]
["Heat pump","hvac_hp_eq_2",43667.717290503613,{"$f":"build2_cooling_tons/build2_zones","v":30.62040749909627},{"$f":"IF(D263>12,\"hvac_hp_eq_large\",\"hvac_hp_eq_small\")","v":"hvac_hp_eq_large"},2333.7509261290002,0.85605423899999999,0,0,0,0,0,0,0,0,50.01,12]
[]
["O&M"]
["Replacement Cartridge Filters","cart_replace_eq_ro",{"$f":"IF(OR(D266>P266,D266<Q266),\"contact vendor\",F266*D266^G266+H266*LN(D266)+I266+J266*EXP(K266*D266)+L266*D266^3+M266*D266^2+N266*D266+O266)","v":295.63830439647251},{"$f":"filter_size","v":2.7804444444444445},"cart_replace_eq_ro",{"$f":"VLOOKUP($E266,eq_table_cl,F$5,FALSE)","v":260.76811222600003},0.12273018300000001,0,0,0,0,0,0,0,0,5,0]

{"sheet":"Cost Coefficients","index":19,"n_rows":67,"n_cols":17,"rows_kept":67,"cut":false,"hidden":false,"merged":[]}
["Coefficients for Component Cost Equations"]
["This sheet is used internally to calculate component costs using the cost equations method; see model documentation for more details on the development of cost equations"]
[]
[null,"Power: C1*x^C2",null,"Logarithmic: C3*Ln(x) + C4",null,"Exponential: C5*e^(C6*x)",null,"Polynomial: C7*x^3 + C8*x^2 + C9*x + C10",null,null,null,"NOTES"]
["Equation Lookup Name","C1","C2","C3","C4","C5","C6","C7","C8","C9","C10","Pct deviation of fit equation","Modified by","Last modified","Rsq of fit equation","max size used to gen curve","min size for which curve fits are valid"]
["back_pump_eq",0,0,0,0,0,0,0,-4.77083E-4,12.333908155,6801.7707008589996,0.13368713398242682,null," 8/14/2018 11:44:39 AM",0.93196883970002076,10001,0]
["bldg_hi_eq",334.86430719700002,-0.13230006499999999,0,0,0,0,0,0,0,0,3.9891100445137453E-2,null," 8/14/2018 1:31:57 PM",0.95292288207253861,200000.1,0]
["bldg_lo_eq",155.424184946,-9.6925793999999996E-2,0,0,0,0,0,0,0,0,2.5518207619233447E-2,null," 8/14/2018 1:31:19 PM",0.96714729333932081,200000.1,0]
["bldg_mid_eq",190.764076528,-9.8240209999999994E-2,0,0,0,0,0,0,0,0,2.7511361690370377E-2,null," 8/14/2018 1:31:38 PM",0.96388247777818759,200000.1,0]
["cart_eq",23052.637051139001,0.89552410100000002,0,0,0,0,0,0,0,0,0.15823881367721077,null," 8/14/2018 12:58:34 PM",0.86330987657044189,2.8809999999999998,0]
["cart_replace_eq_ro",260.76811222600003,0.12273018300000001,0,0,0,0,0,0,0,0,9.6673829825859023E-2,null," 8/14/2018 1:01:16 PM",0.72652392351048989,5,0]
["chem_pump_eq",0,0,0,0,0,0,1.0000000000000001E-9,-3.8862999999999997E-5,0.74032627600000001,864.25764240000001,8.4474570408544364E-2,null," 8/14/2018 11:49:51 AM",0.99862564757263206,30000.01,0]
["ci_bfv_eq_large",51.741944672999999,1.5887577429999999,0,0,0,0,0,0,0,0,6.0646037127800111E-2,null," 8/14/2018 11:18:25 AM",0.9890776861102849,48.1,14]
["ci_bfv_eq_small",0,0,0,0,0,0,-0.46051790100000001,13.155724568,123.18694075800001,30.689222062999999,4.4231092552301912E-2,null," 8/14/2018 11:17:48 AM",0.99015972795888274,12,1]
["ci_chv_eq",0,0,0,0,0,0,1.023101824,-6.5814120579999997,411.440485583,-523.97450445000004,0.10410962425320962,null," 8/14/2018 11:23:50 AM",0.99424538642984728,24.1,2]
["ci_mov_eq",0,0,0,0,0,0,-6.5106489000000003E-2,28.845623929999999,71.319704893999997,1027.6738701910001,9.8818965452308227E-2,null," 8/14/2018 11:05:13 AM",0.97022531386890176,48.1,1]
["cpvc_pipe_eq",0,0,0,0,0,0,1.0356694E-2,0.56514584199999995,3.222257634,0.95450391800000001,9.9235552633260657E-2,null," 8/14/2018 10:46:23 AM",0.9969433433879562,18.100000000000001,0]
["cs_pv_eq",0,0,0,0,0,0,0,-5.0831999999999997E-5,9.8575955700000009,14399.226375742999,0.1378934813173387,null," 8/14/2018 10:06:26 AM",0.98308106420889463,27101,0]
["csp_pv_eq",0,0,0,0,0,0,4.0000000000000002E-9,-1.38219E-4,6.1268369070000004,9678.1653989080005,7.3954364363476952E-2,null," 8/14/2018 10:07:19 AM",0.99796056225592311,27101,0]
["cst_heat_eq",0,0,0,0,0,0,1.0000000000000001E-9,-2.4671000000000001E-5,0.26333174300000001,1444.6155199699999,5.8946825576682765E-2,null," 8/14/2018 10:44:16 AM",0.90900547292567069,30001,0]
["cst_insul_eq",16.480455510999999,0.64952204300000005,0,0,0,0,0,0,0,0,6.0975352621949676E-2,null," 8/14/2018 10:42:21 AM",0.98997017344098082,30001,0]
["di_pipe_eq",0,0,0,0,0,0,0,0.100985408,4.4966242760000004,12.030020025000001,5.1809377456166372E-2,null," 8/14/2018 10:45:41 AM",0.99144707089993411,48.1,4]
["fg_bwt_eq",0,0,0,0,0,0,0,-9.0589999999999992E-6,1.617507891,5391.7204035880004,0.20336987294085085,null," 8/14/2018 10:14:03 AM",0.89612036654223204,50001,0]
["fg_cst_eq",0,0,0,0,0,0,0,-2.3530999999999999E-5,1.774526442,4677.3740770209997,0.15408010146217457,null," 8/14/2018 10:32:55 AM",0.88652549222902688,30001,0]
["fg_pv_eq",0,0,0,0,0,0,-3.4580000000000002E-6,4.462751E-3,16.993719766000002,1007.233463829,2.2930383357517875E-2,null," 8/14/2018 10:08:20 AM",0.99877256624411559,901,0]
["fg_saltbox_eq",0,0,0,0,0,0,0.140791365,-20.480493523,1375.752707719,16108.530025823,3.5619352470517666E-2,null," 8/14/2018 12:30:39 PM",0.98397944098105861,75.099999999999994,0]
["gac_slurry_eq",0,0,0,0,0,0,0,2.2932E-5,4.4447339000000002E-2,7282.0233269930004,0,null," 8/14/2018 11:50:18 AM",1.0000000000000013,31242,0]
["hdpe_bwt_eq",0,0,0,0,0,0,0,-7.1860000000000003E-6,1.039757461,1210.6270696910001,0.20798417562603763,null," 8/14/2018 10:26:40 AM",0.89284355659971304,15001,0]
["hvac_ac_eq",2628.2259000700001,1.168812894,0,0,0,0,0,0,0,0,4.4402508043847003E-2,null," 8/14/2018 1:32:18 PM",0.99405924702166393,113.33,0]
["hvac_elec_eq",1458.1434692969999,0.75248641199999999,0,0,0,0,0,0,0,0,0.19936480781415922,null," 8/14/2018 1:32:35 PM",0.97228079248510613,6148.1,0]
["hvac_gas_eq",813.17633428099998,0.77881003199999999,0,0,0,0,0,0,0,0,0.1337070138486971,null," 8/14/2018 1:33:05 PM",0.94231975089747422,5032.1000000000004,0]
["hvac_gas_non_eq",813.17633428099998,0.77881003199999999,0,0,0,0,0,0,0,0,0.1337070138486971,null," 8/14/2018 1:32:50 PM",0.94231975089747422,5032.1000000000004,0]
["hvac_hp_eq_large",2333.7509261290002,0.85605423899999999,0,0,0,0,0,0,0,0,5.6204592203796817E-2,null," 8/14/2018 1:35:22 PM",0.98147216715343732,50.01,12]
["hvac_hp_eq_small",0,0,0,0,3286.0714454029999,0.15046400200000001,0,0,0,0,8.9476801358507829E-2,null," 8/14/2018 1:34:19 PM",0.97324811259994914,12,0]
["hvac_oil_mid_eq",969.86352683699999,0.75894977500000005,0,0,0,0,0,0,0,0,8.4960799755245564E-2,null," 8/14/2018 1:33:34 PM",0.98796386653060342,3350.1,0]
["hvac_oil_std_eq",969.86352683699999,0.75894977500000005,0,0,0,0,0,0,0,0,8.4960799755245564E-2,null," 8/14/2018 1:33:20 PM",0.98796386653060342,3350.1,0]
["imp_mix_eq",4383.3876341309997,0.62611698800000004,0,0,0,0,0,0,0,0,0.13445897351163477,null," 8/14/2018 12:26:16 PM",0.88388946502339472,110,0]
["mag_fm_eq",0,0,0,0,0,0,0,57.575432208000002,189.85395229299999,3620.6311514190002,9.8588956417284587E-2,null," 8/14/2018 12:34:51 PM",0.98921845528759511,20.100000000000001,0]
["mount_mix_eq",0,0,0,0,0,0,0,-107.78403992600001,1233.9520801589999,1645.8680859240001,7.7132601499578984E-2,null," 8/14/2018 12:22:29 PM",0.91460257963012426,4.0999999999999996,0]
["op_fm_eq",0,0,0,0,0,0,0.100507337,-4.5180455940000002,372.09362808600002,2555.4668690980002,4.8009299780790902E-2,null," 8/14/2018 12:31:50 PM",0.99930959833000055,60.1,0]
["pl_cst_eq",0,0,0,0,0,0,0,2.9169000000000001E-5,1.572614629,790.64854799700004,0.28944693249705705,null," 8/14/2018 10:28:57 AM",0.93675073290181121,6601,0]
["pl_eductor_eq",0,0,0,0,383.643847569,0.60207698600000004,0,0,0,0,7.2252256245696922E-2,null," 8/14/2018 12:27:58 PM",0.99041142098565527,3.1,0]
["pl_saltbox_eq",0,0,0,0,0,0,-1.1798941E-2,-1.984634767,575.45050508199995,21526.521474727,8.2674699830423526E-2,null," 8/14/2018 12:30:59 PM",0.67277013787946549,80.099999999999994,23]
["pp_chv_eq",0,0,0,0,0,0,0,29.515280190999999,41.246830076999998,42.655465071000002,0.19788005287761823,null," 8/14/2018 11:23:05 AM",0.98218691787661361,12.1,0]
["pp_man_eq_large",0,0,0,0,0,0,22.608525612000001,-1299.766716117,26028.146920531999,-164294.697081208,1.2710414919042026E-2,null," 8/14/2018 11:12:08 AM",0.99884823158729841,24.1,14]
["pp_man_eq_small",0,0,0,0,0,0,2.7689868610000001,-29.723792209999999,180.93906510599999,27.073457458,0.13581016236231788,null," 8/14/2018 11:11:09 AM",0.97203462725342071,12,0]
["pp_mov_eq_large",0,0,0,0,0,0,9.4997273530000008,-564.68970656399995,12682.378826201,-83302.816206217001,1.3307536002403792E-2,null," 8/14/2018 11:02:34 AM",0.99844470826618181,24.1,14]
["pp_mov_eq_small",0,0,0,0,445.65232098299998,0.21268194000000001,0,0,0,0,0.1307774382403781,null," 8/14/2018 10:59:31 AM",0.97483041133410342,12,0]
["prop_fm_eq",0,0,0,0,0,0,8.915703422,-172.289864142,1293.6972747970001,655.77680475800003,0.10543863979455978,null," 8/14/2018 12:34:34 PM",0.91981460985863206,14.1,0]
["pump_eq",0,0,0,0,0,0,0,-4.77083E-4,12.333908155,6801.7707008589996,0.13368713398242682,null," 8/14/2018 11:44:39 AM",0.93196883970002076,10001,0]
["pvc_empump_eq",857.79971691399999,0.297241692,0,0,0,0,0,0,0,0,0.34011731773465026,null," 8/14/2018 11:46:58 AM",0.72414142212749388,71.160000000000011,0]
["pvc_mmpump_eq",2172.344597881,0.151638992,0,0,0,0,0,0,0,0,9.9798215900419374E-2,null," 8/14/2018 11:45:29 AM",0.86072008652499521,108.01,0]
["pvc_pipe_eq",0,0,0,0,0,0,0,0.110356803,0.235228044,2.3914712530000002,0.32313533066570455,null," 8/14/2018 10:49:52 AM",0.9951485251712211,48.1,0]
["seductor_eq",0,0,0,0,0,0,0,0,2957.7663495749998,-2746.946806985,0.10614684233473387,null," 8/14/2018 12:29:18 PM",0.97313610525831418,6.1,1.5]
["ss_chv_eq",0,0,0,0,0,0,0,31.65091559,305.12540561700001,97.401638230000003,0.18377907399043944,null," 8/14/2018 11:21:30 AM",0.99310274961944256,48.1,0]
["ss_cst_eq",0,0,0,0,0,0,0,-7.7020000000000001E-6,2.7162509039999998,4402.7309929370003,4.870703541644069E-2,null," 8/14/2018 10:34:33 AM",0.9974150386562457,30001,0]
["ss_eductor_eq",0,0,0,0,0,0,0,133.062250132,527.05247894900003,231.58887476800001,0.21561353837809932,null," 8/14/2018 12:27:28 PM",0.84926156391124907,8,0]
["ss_empump_eq",1671.4158388379999,0.21567175299999999,0,0,0,0,0,0,0,0,0.12606292168277333,null," 8/14/2018 11:47:39 AM",0.94251394750649986,186.35999999999999,0]
["ss_man_eq",223.248424414,1.684302033,0,0,0,0,0,0,0,0,0.4318394443116948,null," 8/14/2018 11:09:08 AM",0.90694492088045375,12.1,1]
["ss_mmpump_eq",0,0,0,0,0,0,-5.1428000000000003E-5,2.3675107000000001E-2,7.1142014380000003,4470.4404501380004,0.14107933817401597,null," 8/14/2018 11:46:03 AM",0.55546205527018022,360.01,0]
["ss_mov_eq",0,0,0,0,0,0,0,76.908725779999997,393.08666071099998,200.56854674600001,0.15788457355449312,null," 8/14/2018 11:03:35 AM",0.99604842930537429,48.1,0]
["ss_pipe_eq",0,0,0,0,0,0,4.5974516999999999E-2,-2.1581476180000001,37.689363942,-3.0714885430000001,0.28526425848243608,null," 8/14/2018 10:51:11 AM",0.87771972619519889,48.1,0]
["ss_pv_eq",0,0,0,0,0,0,0,-6.6983999999999994E-5,14.522866852,15272.942541242999,0.13552842426399497,null," 8/14/2018 10:05:17 AM",0.98795554540983654,27101,0]
["st_bwt_eq",340.81529969399998,0.52157091300000002,0,0,0,0,0,0,0,0,0.31259270730646654,null," 8/14/2018 10:17:08 AM",0.62632217510536325,282095,0]
["st_pipe_eq",0,0,0,0,0,0,6.630642E-3,-0.63889849600000004,21.167729973,-5.1486801040000003,0.1378681964794661,null," 8/14/2018 10:54:40 AM",0.94052208829194073,48.1,1]
["ven_fm_eq",0,0,0,0,0,0,8.413593852,-263.19800276199999,3397.39818913,-230.584107966,2.769325562732472E-2,null," 8/14/2018 12:32:03 PM",0.99967845562317881,24.1,0]
["vol_feed_eq",0,0,0,0,0,0,0,0,376.52630596099999,15176.853694399,4.8612574425237548E-5,null," 8/14/2018 12:30:12 PM",0.99999722878165387,2.5099999999999998,0]

{"sheet":"Cost Data","index":20,"n_rows":1761,"n_cols":7,"rows_kept":1761,"cut":false,"hidden":false,"merged":[]}
["Cost Data"]
["This sheet is used internally and contains component cost data extracted from the central cost database"]
["To maintain vendor confidentiality, the central cost database itself is not provided here"]
[]
["bls118","Alarms (High/Low Pressure Alarms, Level Switch/Alarms, Low Alarms)"]
[43,null,null,"Unit Cost","Useful Life (large)","Useful Life (small)"]
["alarm_cost_cl",0,0,592.57106898296445,15,14]
[]
[]
["bls066","Anion Resins for Perchlorate Removal"]
[12,"Resin Type","Units","Avg. Unit Cost","Useful Life (large)","Useful Life (small)"]
["an_ClO4_cost_cl","Strong Base Polyacrylic","cf",260.56053912519616,"N/A","N/A"]
[null,"Strong Base Polystyrenic","cf",156.67661055376757,"N/A","N/A"]
[null,"Nitrate-selective","cf",183.88430613199887,"N/A","N/A"]
[null,"Perchlorate-selective","cf",242.38451871703288,"N/A","N/A"]
[]
[]
["bls1141","Centrifugal Pumps (Backwash)"]
[30,"Size needed (gpm)","Size selected (gpm)","Avg. Unit Cost","Useful Life (large)","Useful Life (small)"]
["back_pump_cost_cl",0,10,5677.2511607538163,20,17]
[null,11,30,5907.7773247902132,20,17]
[null,31,50,6736.3908144099287,20,17]
[null,51,55,7918.8558741541174,20,17]
[null,56,75,8404.3144159870735,20,17]
[null,76,100,8404.3144159870735,20,17]
[null,101,120,10747.924187245231,20,17]
[null,121,125,9058.9315257220987,20,17]
[null,126,140,10747.924187245231,20,17]
[null,141,200,10052.398939539858,20,17]
[null,201,250,10605.869564837847,20,17]
[null,251,300,11163.348507247631,20,17]
[null,301,500,15106.120511414303,20,17]
[null,501,750,15541.926595522043,20,17]
[null,751,1000,17819.26280561243,20,17]
[null,1001,1500,21313.394051832671,20,17]
[null,1501,2000,31639.579131048209,20,17]
[null,2001,3000,36351.963074920728,20,17]
[null,3001,3500,41402.29357946603,20,17]
[null,3501,4000,43425.006674004457,20,17]
[null,4001,6000,89976.509472825419,20,17]
[null,6001,10000,80591.971358605399,20,17]
[null,10001,"contact vendor","contact vendor",20,17]
[]
[]
["BCI","Backfill and Compaction"]
[3,null,null,"Avg. Unit Cost (per cy)","Useful Life (large)","Useful Life (small)"]
["backfill_cost_cl",0,0,14.406259946949602,"N/A","N/A"]
[]
[]
["CCI","Pipe bedding costs (crushed stone and sand)"]
[2,null,null,"Avg. Unit Cost (per day)","Useful Life (large)","Useful Life (small)"]
["bedding_cost_cl",0,0,56.007394993191568,"N/A","N/A"]
[]
[]
["bore_rig_cost",0,0,3008.4293495338848,"N/A","N/A"]
[null,"Borings, cased borings in earth, w/samples, 2.5\" dia",null,"Avg. Unit Cost (per lf)","Useful Life (large)","Useful Life (small)"]
["bore_cost_cl",0,0,80.974546978108293,"N/A","N/A"]
[]
[]
["stake_out_cost",0,0,1433.9242694040011,"N/A","N/A"]
[null,"Borings, drawings showing boring details",null,"Avg. Unit Cost (per job)","Useful Life (large)","Useful Life (small)"]
["bore_draw_cost_cl",0,0,477.97475646800041,"N/A","N/A"]
[]
[]
["bore_report_cost",0,0,1090.907091232848,"N/A","N/A"]
[null,"Borings, mobilization and demobilization, minimum",null,"Avg. Unit Cost","Useful Life (large)","Useful Life (small)"]
["bore_mob_cost_cl",0,0,753.51314549073004,"N/A","N/A"]
[]
[]
["bore_draw_cost",0,0,477.97475646800041,"N/A","N/A"]
[null,"Borings, report and recommendations from P.E.",null,"Avg. Unit Cost (per job)","Useful Life (large)","Useful Life (small)"]
["bore_report_cost_cl",0,0,1090.907091232848,"N/A","N/A"]
[]
[]
["bore_mob_cost",0,0,753.51314549073004,"N/A","N/A"]
[null,"Borings, drill rig and crew with truck mounted auger",null,"Avg. Unit Cost (per day)","Useful Life (large)","Useful Life (small)"]
["bore_rig_cost_cl",0,0,3008.4293495338848,"N/A","N/A"]
[]
[]
["bls11","Cartridge Filter Systems (for pretreatment)"]
[26,"Size Needed (mgd)","Size Selected (mgd)","Avg. Unit Cost","Useful Life(large)","Useful Life (small)"]
["cart_cost_cl",0,0.216,5019.8070607714935,35,30]
[null,0.217,0.64800000000000002,16918.019161326571,35,30]
[null,0.64900000000000002,1.08,31230.692185840329,35,30]
[null,1.081,1.728,43264.423182844679,35,30]
[null,1.7289999999999999,2.3039999999999998,43352.7242470606,35,30]
[null,2.3049999999999997,2.88,49371.138887040244,35,30]
[null,2.8809999999999998,"contact vendor","contact vendor",35,30]
[]
[]
["bls11","Replacement Cartridge Filters for Reverse Osmosis"]
[26,"Size Needed (mgd)","Size Selected (mgd)","Avg. Unit Cost","Useful Life(large)","Useful Life (small)"]
["cart_replace_cost_ro_cl",0,0.05,181.72326771283929,"N/A","N/A"]
[null,5.0999999999999997E-2,0.14399999999999999,181.72326771283929,"N/A","N/A"]
[null,0.14499999999999999,0.2,204.66857046024029,"N/A","N/A"]
[null,0.20100000000000001,0.5,285.25600375568905,"N/A","N/A"]
[null,0.501,1,285.25600375568905,"N/A","N/A"]
[null,1.0009999999999999,2,285.25600375568905,"N/A","N/A"]
[null,2.0009999999999999,5,285.25600375568905,"N/A","N/A"]
[null,5.0010000000000003,"contact vendor","contact vendor","N/A","N/A"]
[]
[]
["bls061","Chemical Costs"]
[11,"Chemical","Units","Avg. Unit Cost","Useful Life (large)","Useful Life (small)"]
["chem_cost_cl","Acetic Acid","lb",9.7816703626244561E-2,"N/A","N/A"]
[null,"Aluminum Sulfate (alum)","ton",425.91524172147228,"N/A","N/A"]
[null,"Ammonium Chloride","lb",1.0567607726597328,"N/A","N/A"]
[null,"Antiscalant - Basic","lb",1.844723327788462,"N/A","N/A"]
[null,"Antiscalant - Premium","lb",2.5828465026670431,"N/A","N/A"]
[null,"Calcium Hydroxide (Lime) - Large Qty","lb",9.1473116418599301E-2,"N/A","N/A"]
[null,"Calcium Hydroxide (Lime) - Mid Qty","lb",0.22149901926848969,"N/A","N/A"]
[null,"Calcium Hydroxide (Lime) - Small Qty","lb",0.78313433735971694,"N/A","N/A"]
[null,"Calcium Hypochlorite - Large Qty","lb",1.2760664589823472,"N/A","N/A"]
[null,"Calcium Hypochlorite - Mid Qty","lb",1.3545201338410064,"N/A","N/A"]
[null,"Calcium Hypochlorite - Small Qty","lb",1.8581124264451367,"N/A","N/A"]
[null,"Calcium Oxide (Quicklime)","ton",140.82976808584289,"N/A","N/A"]
[null,"Citric Acid (food grade)","lb",1.1224261787916434,"N/A","N/A"]
[null,"Ethanol","gal",3.1734425961702204,"N/A","N/A"]
[null,"Ferric Chloride - Large Qty","lb",0.12349386209099067,"N/A","N/A"]
[null,"Ferric Chloride - Mid Qty","lb",0.56529861075129717,"N/A","N/A"]
[null,"Ferric Chloride - Small Qty","lb",0.99611420422571673,"N/A","N/A"]
[null,"Ferric Sulfate - Large Qty","lb",9.7136610130379608E-2,"N/A","N/A"]
[null,"Ferric Sulfate - Mid Qty","lb",0.80539761530041443,"N/A","N/A"]
[null,"Ferric Sulfate - Small Qty","lb",1.2968449922961784,"N/A","N/A"]
[null,"Ferrous Sulfate","lb",0.6246429720941582,"N/A","N/A"]
[null,"Hydrochloric Acid","lb",0.33459428783595818,"N/A","N/A"]
[null,"Hydrogen Peroxide","lb",0.26724659284459285,"N/A","N/A"]
[null,"Liquid Oxygen","ton",1735.7127453205412,"N/A","N/A"]
[null,"Membrane Cleaner - High pH Detergent","gal",31.602800600153142,"N/A","N/A"]
[null,"Membrane Cleaner - Low pH Sulfate Control","gal",27.547369338188009,"N/A","N/A"]
[null,"Phosphoric Acid - Large Qty","lb",0.50096930284382735,"N/A","N/A"]
[null,"Phosphoric Acid - Small Qty","lb",0.54920572437430792,"N/A","N/A"]
[null,"Phosphoric Acid 75% - Large Qty","lb",0.50096930284382735,"N/A","N/A"]
[null,"Phosphoric Acid 75% - Small Qty","lb",0.54920572437430792,"N/A","N/A"]
[null,"Phosphoric Acid 36% - Large Qty","lb",0.35788954635108478,"N/A","N/A"]
[null,"Phosphoric Acid 36% - Small Qty","lb",0.39234936439012547,"N/A","N/A"]
[null,"Polyaluminum Chloride - Large Qty","lb",0.12592942229494669,"N/A","N/A"]
[null,"Polyaluminum Chloride - Mid Qty","lb",0.18911015835055295,"N/A","N/A"]
[null,"Polyaluminum Chloride - Small Qty","lb",0.65861475780890755,"N/A","N/A"]
[null,"Polymers - Large Qty","lb",0.81129966674355547,"N/A","N/A"]
[null,"Polymers - Small Qty","lb",1.5734980240573635,"N/A","N/A"]
[null,"Potassium Permanganate - Large Qty","lb",1.6851274950963424,"N/A","N/A"]
[null,"Potassium Permanganate - Mid Qty","lb",2.1576825366856522,"N/A","N/A"]
[null,"Potassium Permanganate - Small Qty","lb",4.7641817972036042,"N/A","N/A"]
[null,"Sodium Bicarbonate","lb",0.73808606864968795,"N/A","N/A"]
[null,"Sodium Bisulfite","lb",0.1857940167899175,"N/A","N/A"]
[null,"Sodium Carbonate (soda ash)","lb",0.27088058151609556,"N/A","N/A"]
[null,"Sodium Chloride - Large Qty","lb",0.13056074766355141,"N/A","N/A"]
[null,"Sodium Chloride - Small Qty","lb",0.14753769780530898,"N/A","N/A"]
[null,"Sodium Chlorite 25.0% Solution","lb",0.58384033752880993,"N/A","N/A"]
[null,"Sodium Chlorite 7.5% Solution","lb",0.4053348119410578,"N/A","N/A"]
[null,"Sodium Hexametaphosphate","lb",1.9887198457212967,"N/A","N/A"]
[null,"Sodium Hydroxide - Large Qty","lb",0.12541027678918049,"N/A","N/A"]
[null,"Sodium Hydroxide - Mid Qty","lb",0.20600613765892153,"N/A","N/A"]
[null,"Sodium Hydroxide - Small Qty","lb",0.30196922592029452,"N/A","N/A"]
[null,"Sodium Hydroxide 50% - Large Qty","lb",0.12541027678918049,"N/A","N/A"]
[null,"Sodium Hydroxide 50% - Mid Qty","lb",0.20600613765892153,"N/A","N/A"]
[null,"Sodium Hydroxide 50% - Small Qty","lb",0.30196922592029452,"N/A","N/A"]
[null,"Sodium Hydroxide 25% - Large Qty","lb",8.0980101463823354E-2,"N/A","N/A"]
[null,"Sodium Hydroxide 25% - Mid Qty","lb",0.13302257483917029,"N/A","N/A"]
[null,"Sodium Hydroxide 25% - Small Qty","lb",0.19498799604026804,"N/A","N/A"]
[null,"Sodium Hypochlorite - Large Qty","gal",1.5279794302670986,"N/A","N/A"]
[null,"Sodium Hypochlorite - Small Qty","gal",2.0861212330994263,"N/A","N/A"]
[null,"Sodium Phosphate","gal",7.9409068881966087,"N/A","N/A"]
[null,"Sulfuric Acid - Large Qty","lb",0.11072026361268483,"N/A","N/A"]
[null,"Sulfuric Acid - Small Qty","lb",0.30865593040631134,"N/A","N/A"]
[null,"Tetrasodium Polyphosphate - Large Qty","lb",7.2457351937494412,"N/A","N/A"]
[null,"Tetrasodium Polyphosphate - Small Qty","lb",30.240797025951633,"N/A","N/A"]
[null,"Zinc Orthophosphate - Large Qty","gal",4.5989284898788423,"N/A","N/A"]
[null,"Zinc Orthophosphate - Mid Qty","gal",6.5353194735993103,"N/A","N/A"]
[null,"Zinc Orthophosphate - Small Qty","gal",7.8446708471864701,"N/A","N/A"]
[]
[]
["bls1141","Chemical Pumps (non-metering, for regeneration chemicals, etc.)"]
[30,"Size needed (gph)","Size selected (gph)","Avg. Unit Cost","Useful Life (large)","Useful Life (small)"]
["chem_pump_cost_cl",0,300,1159.3676575803506,20,17]
[null,300.01,600,1185.6202002923042,20,17]
[null,600.01,1020,1847.7676664715773,20,17]
[null,1020.01,1200,1515.9646960843866,20,17]
[null,1200.01,1500,1964.4456340802594,20,17]
[null,1500.01,11400,6527.3153861967312,20,17]
[null,11400.01,14400,6800.0501354820262,20,17]
[null,14400.01,30000,21575.691845430905,20,17]
[null,30000.01,"contact vendor","contact vendor",20,17]
[]
[]
["bls1149","Cast Iron Manual Valves"]
[35,"Size needed (in. diam)","Size selected (in. diam)","Avg. Unit Cost","Useful Life (large)","Useful Life (small)"]
["ci_bfv_cost_cl",0,1,166.0085502801667,25,20]
[null,1.1000000000000001,2,331.17089212312271,25,20]
[null,2.1,2.5,403.17289057322023,25,20]
[null,2.6,3,529.46246599720769,25,20]
[null,3.1,4,679.65807865790498,25,20]
[null,4.0999999999999996,6,1174.3475555780219,25,20]
[null,6.1,8,1529.5218754147334,25,20]
[null,8.1,10,2326.9334646040388,25,20]
[null,10.1,12,2528.9332250806997,25,20]
[null,12.1,14,3499.2771843579658,25,20]
[null,14.1,16,4214.5506752969141,25,20]
[null,16.100000000000001,18,4966.6410017568842,25,20]
[null,18.100000000000001,20,6632.296091377596,25,20]
[null,20.100000000000001,24,7747.8988849057714,25,20]
[null,24.1,30,10387.933201383395,25,20]
[null,30.1,48,25748.037412195856,25,20]
[null,48.1,"contact vendor","contact vendor",25,20]
[]
[]
["bls1149","Cast Iron Check Valves"]
[35,"Size needed (in. diam)","Size selected (in. diam)","Avg. Unit Cost","Useful Life (large)","Useful Life (small)"]
["ci_chv_cost_cl",0,2,297.80974848421818,25,20]
[null,2.1,2.5,454.57050982301939,25,20]
[null,2.6,3,593.50959967831341,25,20]
[null,3.1,4,1427.8846153846155,25,20]
[null,4.0999999999999996,6,1930.2884615384617,25,20]
[null,6.1,8,3014.4230769230771,25,20]
[null,8.1,12,4812.5,25,20]
[null,12.1,16,8197.1153846153848,25,20]
[null,16.100000000000001,18,11951.923076923076,25,20]
[null,18.100000000000001,24,19461.538461538461,25,20]
[null,24.1,"contact vendor","contact vendor",25,20]
[]
[]
["bls1149","Cast Iron Motor/Air Operated Valves (on/off)"]
[35,"Size needed (in. diam)","Size selected (in. diam)","Avg. Unit Cost","Useful Life (large)","Useful Life (small)"]
["ci_mov_cost_cl",0,1,1162.4784693789438,25,20]
[null,1.1000000000000001,2,1179.0809967196158,25,20]
[null,2.1,3,1551.1148185981419,25,20]
[null,3.1,4,1854.7917114206177,25,20]
[null,4.0999999999999996,6,2661.3332835297279,25,20]
[null,6.1,8,3196.9164651247756,25,20]
[null,8.1,10,4782.905010429381,25,20]
[null,10.1,12,6086.1268971968566,25,20]
[null,12.1,14,7747.1021472312341,25,20]
[null,14.1,16,8323.5956340773228,25,20]
[null,16.100000000000001,18,9631.3036306079466,25,20]
[null,18.100000000000001,20,14809.688650581335,25,20]
[null,20.100000000000001,24,18982.941698579121,25,20]
[null,24.1,30,36780.293391321859,25,20]
[null,30.1,48,59789.439846856025,25,20]
[null,48.1,"contact vendor","contact vendor",25,20]
[]
[]
["BCI","Concrete for Basins"]
[3,null,null,"Avg. Unit Cost (per cy)","Useful Life (large)","Useful Life (small)"]
["conc_basin_cost_cl",0,0,601.26511720822305,40,37]
[]
[]
["bls061","Chemical Resistant Coating for Concrete"]
[11,null,null,"Avg. Unit Cost (per gal)","Useful Life (large)","Useful Life (small)"]
["conc_coating_cost_cl",0,0,257.02531540504651,10,10]
[]
[]
["BCI","Concrete Pad"]
[3,null,null,"Avg. Unit Cost (per cy)","Useful Life (large)","Useful Life (small)"]
["conc_pad_cost_cl",0,0,647.97398379459571,40,37]
[]
[]
["bls118","Conductivity Meters"]
[43,null,null,"Avg. Unit Cost","Useful Life (large)","Useful Life (small)"]
["conduct_meter_cost_cl",0,0,1615.8991512850687,15,14]
[]
[]
["bls072106033","CPVC Piping"]
[15,"Size needed (in. diam)","Size selected (in. diam)","Avg. Unit Cost ($/lf)","Useful Life (large)","Useful Life (small)"]
["cpvc_pipe_cost_cl",0,0.5,2.7129668376829081,22,17]
[null,0.6,0.75,3.9174378195461803,22,17]
[null,0.76,1,4.653337804185762,22,17]
[null,1.1000000000000001,1.5,6.9987300584466148,22,17]
[null,1.6,2,7.9058027959432033,22,17]
[null,2.1,2.5,14.367588287753282,22,17]
[null,2.6,3,18.892896248787522,22,17]
[null,3.1,4,28.580390597813643,22,17]
[null,4.0999999999999996,6,43.372013394722444,22,17]
[null,6.1,8,64.095340161167229,22,17]
[null,8.1,10,90.460468065566772,22,17]
[null,10.1,12,134.22448515538855,22,17]
[null,12.1,14,196.20317692387175,22,17]
[null,14.1,16,250.71242216546051,22,17]
[null,16.100000000000001,18,303.57754308803931,22,17]
[null,18.100000000000001,"contact vendor","contact vendor",22,17]
[]
[]
["bls1072","Carbon Steel Pressure Vessels - Stainless Steel Internals"]
[23,"Size needed (gal)","Size selected (gal)","Avg. Unit Cost","Useful Life (large)","Useful Life (small)"]
["cs_pv_cost_cl",0,180,13858.648185865099,35,30]
[null,181,300,16821.381049558688,35,30]
[null,301,650,19787.604400643886,35,30]
[null,651,750,21845.902943494446,35,30]
[null,751,880,24240.42238415256,35,30]
[null,881,950,26228.825543229508,35,30]
[null,951,1400,35554.17345202584,35,30]
[null,1401,1700,39825.709659724744,35,30]
[null,1701,2000,38484.858352925963,35,30]
[null,2001,2900,47966.620937281281,35,30]
[null,2901,4300,52314.518115312734,35,30]
[null,4301,4700,58669.393092542683,35,30]
[null,4701,6800,59782.347444985331,35,30]
[null,6801,17000,188978.83571466777,35,30]
[null,17001,27100,247627.64903829011,35,30]
[null,27101,"contact vendor","contact vendor",35,30]
[]
[]
["bls1072","Carbon Steel Pressure Vessels - Plastic Internals"]
[23,"Size needed (gal)","Size selected (gal)","Avg. Unit Cost","Useful Life (large)","Useful Life (small)"]
["csp_pv_cost_cl",0,180,11941.965039546278,35,30]
[null,181,300,11979.543232512808,35,30]
[null,301,650,12149.726084141044,35,30]
[null,651,750,13034.264216724367,35,30]
[null,751,880,13900.725956952443,35,30]
[null,881,950,15067.255810277584,35,30]
[null,951,1400,19814.399055811744,35,30]
[null,1401,1700,21160.927033903194,35,30]
[null,1701,2000,25226.667048759489,35,30]
[null,2001,2900,26332.531891194689,35,30]
[null,2901,4300,34286.110576907246,35,30]
[null,4301,4700,34871.895141847432,35,30]
[null,4701,6800,43482.836741266336,35,30]
[null,6801,17000,98767.962692792978,35,30]
[null,17001,27100,160703.36019649555,35,30]
[null,27101,"contact vendor","contact vendor",35,30]
[]
[]
["bls106","Heat Tracing for Storage Tanks"]
[22,"Size Needed (gal)","Size Selected (gal)","Avg. Unit Cost","Useful Life (large)","Useful Life (small)"]
["cst_heat_cost_cl",0,40,1438.4821336095288,10,7]
[null,41,60,1438.4821336095288,10,7]
[null,61,80,1438.4821336095288,10,7]
[null,81,120,1438.4821336095288,10,7]
[null,121,140,1438.4821336095288,10,7]
[null,141,175,1438.4821336095288,10,7]
[null,176,200,1438.4821336095288,10,7]
[null,201,250,1438.4821336095288,10,7]
[null,251,300,1438.4821336095288,10,7]
[null,301,400,1656.433972035215,10,7]
[null,401,550,1831.3270326255827,10,7]
[null,551,625,1656.433972035215,10,7]
[null,626,700,1684.0766442257898,10,7]
[null,701,850,1748.9306059036769,10,7]
[null,851,950,1748.9306059036769,10,7]
[null,951,1000,1723.8579085856413,10,7]
[null,1001,1100,1748.9306059036769,10,7]
[null,1101,1200,1748.9306059036769,10,7]
[null,1201,1500,1807.405489383739,10,7]
[null,1501,1850,1807.405489383739,10,7]
[null,1851,2000,1807.405489383739,10,7]
[null,2001,2050,1807.405489383739,10,7]
[null,2051,2400,2040.2418436043502,10,7]
[null,2401,2500,2145.1345751880522,10,7]
[null,2501,2900,2067.8845157949249,10,7]
[null,2901,3000,2067.8845157949249,10,7]
[null,3001,4000,2067.8845157949249,10,7]
[null,4001,4100,2067.8845157949249,10,7]
[null,4101,4200,2067.8845157949249,10,7]
[null,4201,5000,2758.9513205592957,10,7]
[null,5001,5200,2038.2392900906214,10,7]
[null,5201,5500,2313.4790264111862,10,7]
[null,5501,5600,2313.4790264111862,10,7]
[null,5601,6500,2396.4070429829108,10,7]
[null,6501,6510,2396.4070429829108,10,7]
[null,6511,7300,2477.20870015536,10,7]
[null,7301,8000,2671.1938048539814,10,7]
[null,8001,8400,2710.0450543759712,10,7]
[null,8401,10000,2710.0450543759712,10,7]
[null,10001,10500,3246.9508026929057,10,7]
[null,10501,12000,2805.7312273433454,10,7]
[null,12001,"contact vendor","contact vendor",10,7]
[]
[]
["bls106","Insulation for Storage Tanks"]
[22,"Size Needed (gal)","Size Selected (gal)","Avg. Unit Cost","Useful Life (large)","Useful Life (small)"]
["cst_insul_cost_cl",0,40,184.99326773692388,10,7]
[null,41,60,237.08907301916108,10,7]
[null,61,80,284.93215950284826,10,7]
[null,81,120,371.04971517348525,10,7]
[null,121,140,408.26100466079754,10,7]
[null,141,175,450.78819264629726,10,7]
[null,176,200,496.5049197307095,10,7]
[null,201,250,586.87519419989644,10,7]
[null,251,300,710.20403935784577,10,7]
[null,301,500,820.77472812014503,10,7]
[null,501,550,1111.0227861211808,10,7]
[null,551,625,1054.6742620403936,10,7]
[null,626,700,1054.6742620403936,10,7]
[null,701,850,1392.7654065251165,10,7]
[null,851,950,1420.4080787156915,10,7]
[null,951,1000,1400.0450856355117,10,7]
[null,1001,1100,1481.0093215950285,10,7]
[null,1101,1200,1641.5494562402901,10,7]
[null,1201,1500,1994.5251165199379,10,7]
[null,1501,1850,2280.5204557224238,10,7]
[null,1851,2000,2280.5204557224238,10,7]
[null,2001,2050,2615.4220611082342,10,7]
[null,2051,2400,2602.6639047125841,10,7]
[null,2401,2500,2906.3118774792724,10,7]
[null,2501,2900,2947.1341273951321,10,7]
[null,2901,3000,2947.1341273951321,10,7]
[null,3001,4000,3569.094251683066,10,7]
[null,4001,4100,3675.4122216468154,10,7]
[null,4101,4200,3760.4665976178148,10,7]
[null,4201,5000,4821.5199378560337,10,7]
[null,5001,5200,4026.1775591404457,10,7]
[null,5201,5500,3884.8586224754017,10,7]
[null,5501,5600,4584.4308648368724,10,7]
[null,5601,6500,5070.3039875712066,10,7]
[null,6501,6510,4279.2982910409119,10,7]
[null,6511,7300,5628.4733298808915,10,7]
[null,7301,8000,5547.78344562455,10,7]
[null,8001,8400,5935.7322630761264,10,7]
[null,8401,10000,6601.2827550491975,10,7]
[null,10001,10500,6458.8166752977731,10,7]
[null,10501,12000,7332.7503883997933,10,7]
[null,12001,"contact vendor","contact vendor",10,7]
[]
[]
[]
["Current Year","current_year_cl",2017]
[]
[]
["bls10150211","Ductile Iron Piping"]
[19,"Size needed (in. diam)","Size selected (in. diam)","Avg. Unit Cost ($/lf)","Useful Life (large)","Useful Life (small)"]
["di_pipe_cost_cl",0,4,33.764512955067232,40,35]
[null,4.0999999999999996,6,40.125942932108885,40,35]
[null,6.1,8,51.870121351262711,40,35]
[null,8.1,10,67.039685142669725,40,35]
[null,10.1,12,77.805182026894059,40,35]
[null,12.1,14,97.868153492948508,40,35]
[null,14.1,16,114.50573958674975,40,35]
[null,16.100000000000001,18,129.18596261069203,40,35]
[null,18.100000000000001,20,151.69563791407018,40,35]
[null,20.100000000000001,24,187.90685470646113,40,35]
[null,24.1,30,226.13759441585236,40,35]
[null,30.1,36,279.46399605001488,40,35]
[null,36.1,48,484.52392326873428,40,35]
[null,48.1,"contact vendor","contact vendor",40,35]
[]
[]
["bls1154","Dot Matrix Printer"]
[38,null,null,"Avg. Unit Cost","Useful Life (large)","Useful Life (small)"]
["dotmatrix_printer_cost_cl",0,0,641.91281559323488,10,8]
[]
[]
["bls118","Electrical Enclosure"]
[43,null,null,"Avg. Unit Cost","Useful Life (large)","Useful Life (small)"]
["elec_encl_cost_cl",0,0,1201.1687264911338,22,17]
[]
[]
[3,null,null,"Avg. Unit Cost (per cy)","Useful Life (large)"]
["ep_dike_construct_cl","Evaporation pond dike construction","ep_dike_construct_cl",8.1865355248195826,"NA"]
[]
[]
["bls07210606","Evaporation pond liner"]
[16,null,null,"Avg. Unit Cost (per sf)","Useful Life (large)","Useful Life (small)"]
["ep_liner_cost_cl",0,0,1.8586831275720166,10,10]
[]
[]
["BCI","Excavation"]
[3,null,null,"Avg. Unit Cost (per cy)","Useful Life (large)","Useful Life (small)"]
["excavate_cost_cl",0,0,31.07454575596817,"N/A","N/A"]
[]
[]
["bls07210606","Fiberglass Backwash Tanks"]
[16,"Size needed (gal)","Size selected (gal)","Avg. Unit Cost","Useful Life (large)","Useful Life (small)"]
["fg_bwt_cost_cl",0,564,5382.5641232018497,25,20]
[null,565,600,6993.7674825168688,25,20]
[null,601,1000,7072.9869337562768,25,20]
[null,1001,1470,6171.2296807067014,25,20]
[null,1471,1500,10002.26032728829,25,20]
[null,1501,2000,11590.459046954549,25,20]
[null,2001,3000,12262.81572826606,25,20]
[null,3001,4000,13901.160796631186,25,20]
[null,4001,4500,9623.7258668615195,25,20]
[null,4501,5000,15510.293236828365,25,20]
[null,5001,6000,17396.275475936804,25,20]
[null,6001,7000,19018.766175031349,25,20]
[null,7001,8000,20640.069975297007,25,20]
[null,8001,9000,22139.115143456893,25,20]
[null,9001,10000,17920.437509988311,25,20]
[null,10001,11000,25202.281831909368,25,20]
[null,11001,11750,16327.136172427296,25,20]
[null,11751,12000,26784.601799858792,25,20]
[null,12001,13000,31612.118241366792,25,20]
[null,13001,14000,33462.107699471038,25,20]
[null,14001,15000,34915.239482596502,25,20]
[null,15001,20000,33451.282214445098,25,20]
[null,20001,20300,24741.237368280155,25,20]
[null,20301,35000,65902.56467140303,25,20]
[null,35001,50000,64281.645049289044,25,20]
[null,50001,"contact vendor","contact vendor",25,20]
[]
[]
["bls07210606","Fiberglass Chemical Storage Tanks"]
[16,"Size Needed (gal)","Size Selected (gal)","Avg. Unit Cost","Useful Life (large)","Useful Life (small)"]
["fg_cst_cost_cl",0,564,5382.5641232018497,10,7]
[null,565,600,5663.3333736660179,10,7]
[null,601,1000,6837.9816506646766,10,7]
[null,1001,1470,6171.2296807067014,10,7]
[null,1471,1500,9009.1631677735368,10,7]
[null,1501,2000,9312.1167097474518,10,7]
[null,2001,3000,10958.851255419495,10,7]
[null,3001,4000,12647.533187626123,10,7]
[null,4001,4500,9623.7258668615195,10,7]
[null,4501,5000,13849.821775209295,10,7]
[null,5001,6000,15479.433867277188,10,7]
[null,6001,7000,15307.333537087936,10,7]
[null,7001,8000,16618.856743012937,10,7]
[null,8001,9000,17852.036573501144,10,7]
[null,9001,10000,23645.425996872909,10,7]
[null,10001,11000,24407.56400937002,10,7]
[null,11001,11750,16327.136172427296,10,7]
[null,11751,12000,26163.987583747585,10,7]
[null,12001,13000,27595.891510769292,10,7]
[null,13001,14000,29032.53295089108,10,7]
[null,14001,15000,31990.305511641182,10,7]
[null,15001,20000,39033.473634182825,10,7]
[null,20001,20300,24741.237368280155,10,7]
[null,20301,30000,37606.727626485503,10,7]
[null,30001,"contact vendor","contact vendor",10,7]
[]
[]
["bls07210606","Fiberglass Pressure Vessels - Plastic Internals"]
[16,"Size needed (gal)","Size selected (gal)","Avg. Unit Cost","Useful Life (large)","Useful Life (small)"]
["fg_pv_cost_cl",0,187,4352.1706334005594,25,20]
[null,188,264,5573.5467443086018,25,20]
[null,265,345,7548.5341075289562,25,20]
[null,346,463,9357.2797422765543,25,20]
[null,464,900,17407.533422888078,25,20]
[null,901,"contact vendor","contact vendor",25,20]
[]
[]
["bls114","Fiberglass Salt Saturator (Brinemaker)"]
[29,"Size Needed (tons)","Size Selected (tons)","Avg. Unit Cost","Useful Life(large)","Useful Life (small)"]
["fg_saltbox_cost_cl",0,5,22755.290437113552,25,20]
[null,5.0999999999999996,10,26278.512201329082,25,20]
[null,10.1,15,33255.963136466118,25,20]
[null,15.1,16,36796.04975682019,25,20]
[null,16.100000000000001,20,36498.615021285892,25,20]
[null,20.100000000000001,25,39637.011431794679,25,20]
[null,25.1,30,41006.131116496363,25,20]
[null,30.1,35,44152.193370704495,25,20]
[null,35.1,40,48489.527735789663,25,20]
[null,40.1,45,48943.345682790452,25,20]
[null,45.1,50,51391.816160358867,25,20]
[null,50.1,55,53788.15890077177,25,20]
[null,55.1,60,56997.081073314475,25,20]
[null,60.1,65,58521.050800742778,25,20]
[null,65.099999999999994,70,57299.115315068368,25,20]
[null,70.099999999999994,75,64822.374321598232,25,20]
[null,75.099999999999994,"contact vendor","contact vendor",25,20]
[]
[]
["bls1141","Slurry Pumps for Media Transfer"]
[30,"Size Needed (lb/hr)","Size Selected (lb/hr)","Avg. Unit Cost","Useful Life(large)","Useful Life (small)"]
["gac_slurry_cost_cl",0,1165,7364.9280246731105,20,15]
[null,1166,11014,10553.375815329422,20,15]
[null,11015,31241,31051.994682000124,20,15]
[null,31242,"contact vendor","contact vendor",20,15]
[]
[]
["bls114","Gravimetric Dry Feeder"]
[29,"Size Needed (lb/min)","Size Selected (lb/min)","Avg. Unit Cost","Useful Life(large)","Useful Life (small)"]
["grav_feed_cost_cl",0,0.02,33883.451182143777,25,20]
[null,0.4,4.5,33111.720699786878,25,20]
[null,4.51,44,35529.856875414844,25,20]
[null,44.1,107.5,37609.06664252458,25,20]
[null,107.5,"contact vendor","contact vendor",25,20]
[]
[]
["bls07210606","HDPE Backwash Tanks "]
[16,"Size Needed (gal)","Size Selected (gal)","Avg. Unit Cost","Useful Life (large)","Useful Life (small)"]
["hdpe_bwt_cost_cl",0,300,1736.037045599056,25,20]
[null,301,550,1532.1824615355076,25,20]
[null,551,850,2032.7477066246133,25,20]
[null,851,905,3502.1829044968717,25,20]
[null,906,1000,2018.1537781377003,25,20]
[null,1001,1050,3971.4439062170959,25,20]
[null,1051,1200,2246.9454479365645,25,20]
[null,1201,1500,2466.1190433257261,25,20]
[null,1501,2000,2742.293183545768,25,20]
[null,2001,2500,3881.8127772181756,25,20]
[null,2501,3000,4152.1428878075958,25,20]
[null,3001,4200,5762.9590028574503,25,20]
[null,4201,5200,8489.0560914189537,25,20]
[null,5201,6500,9551.3419903256981,25,20]
[null,6501,8000,12478.660096308166,25,20]
[null,8001,10000,7915.2657621618137,25,20]
[null,10001,12000,12751.409724118665,25,20]
[null,12001,15000,17652.735280045181,25,20]
[null,15001,"contact vendor","contact vendor",25,20]
[]
[]
["bls118","Head Loss Sensor"]
[43,null,null,"Unit Cost","Useful Life (large)","Useful Life (small)"]
["headloss_cost_cl",0,0,2121.0930305173688,15,14]
[]
[]
["bls114","Impeller Mixers for Rapid Mix"]
[29,"Size needed (hp)","Size selected (hp)","Avg. Unit Cost","Useful Life (large)","Useful Life (small)"]
["imp_mix_cost_cl",0,1,4670.0920438608591,25,20]
[null,1.1000000000000001,1.5,5185.8438043197912,25,20]
[null,1.6,2,5767.7970300153593,25,20]
[null,2.1,3,9417.155362357953,25,20]
[null,3.1,5,11668.264019463384,25,20]
[null,5.0999999999999996,7.5,19534.188362911675,25,20]
[null,7.6,10,20361.448563695776,25,20]
[null,10.1,20,23577.800706555863,25,20]
[null,20.100000000000001,"contact vendor","contact vendor",25,20]
[]
[]
["bls1154","Laser Jet Printer"]
[38,null,null,"Avg. Unit Cost","Useful Life (large)","Useful Life (small)"]
["laser_printer_cost_cl",0,0,627.16285861019526,10,8]
[]
[]
["bls118","Magnetic Flow Meters"]
[43,"Size needed (in. diam)","Size selected (in. diam)","Avg. Unit Cost","Useful Life (large)","Useful Life (small)"]
["mag_fm_cost_cl",0,0.75,5266.5310303449451,15,14]
[null,0.76,1,3737.0701052521649,15,14]
[null,1.1000000000000001,1.5,3831.033761897907,15,14]
[null,1.6,2,4209.2380938966562,15,14]
[null,2.1,2.5,4105.5710709593259,15,14]
[null,2.6,3,4481.3390271288199,15,14]
[null,3.1,4,4713.8023961711842,15,14]
[null,4.0999999999999996,6,7747.4619998290036,15,14]
[null,6.1,8,9978.7261018798472,15,14]
[null,8.1,10,12076.756326839053,15,14]
[null,10.1,12,14357.808465803988,15,14]
[null,12.1,14,17614.41640217376,15,14]
[null,14.1,16,21512.384613409264,15,14]
[null,16.100000000000001,18,25120.373133416404,15,14]
[null,18.100000000000001,20,28272.26294309954,15,14]
[null,20.100000000000001,"contact vendor","contact vendor",15,14]
[]
[]
["CCI","Metalwork"]
[2,null,"Units","Avg. Unit Cost","Useful Life (large)","Useful Life (small)"]
["metal_cost_cl","Aluminum Railing","lf",37.394495653084739,40,35]
[null,"Aluminum Stairs","riser",562.32324290352983,40,35]
[null,"Checkered Plate Platform","sf",49.252487037812919,40,35]
[null,"Grating","sf",46.110505918089444,40,35]
[]
[]
["bls114","Mounted Mixers (for neutralization tanks, etc)"]
[29,"Size needed (hp)","Size selected (hp)","Avg. Unit Cost","Useful Life (large)","Useful Life (small)"]
["mount_mix_cost_cl",0,0.33333333333333331,2152.1911149383404,25,22]
[null,0.34,0.5,2249.5563661604838,25,22]
[null,0.51,0.75,2433.3086300980585,25,22]
[null,0.76,1,2698.9713434764844,25,22]
[null,1.1000000000000001,1.5,2910.8087127200633,25,22]
[null,1.6,2,4196.2218815641208,25,22]
[null,2.1,3,4890.7286981634461,25,22]
[null,3.1,4,4588.240922609597,25,22]
[null,4.0999999999999996,"contact vendor","contact vendor",25,22]
[]
[]
["bls118","Orifice Plate Flow Meters"]
[43,"Size needed (in. diam)","Size selected (in. diam)","Avg. Unit Cost","Useful Life (large)","Useful Life (small)"]
["op_fm_cost_cl",0,2,3340.9756510202192,15,14]
[null,2.1,3,3449.0303581646272,15,14]
[null,3.1,6,5093.5074255753598,15,14]
[null,6.1,12,6219.2647459408408,15,14]
[null,12.1,24,10437.005481311237,15,14]
[null,48.1,60,30284.544905206916,15,14]
[null,60.1,"contact vendor","contact vendor",15,14]
[]
[]
["bls117507","Operator Interface Software"]
[42,null,null,"Avg. Unit Cost","Useful Life (large)","Useful Life (small)"]
["op_interface_software_cost_cl",0,0,183.22815160365667,10,8]
[]
[]
["bls118","ORP Sensor"]
[43,null,null,"Avg. Unit Cost","Useful Life (large)","Useful Life (small)"]
["orp_anal_cost_cl",0,0,2030.9784551627101,15,14]
[]
[]
["bls11510114","PC Workstation"]
[37,null,null,"Avg. Unit Cost","Useful Life (large)","Useful Life (small)"]
["pc_workstation_cost_cl",0,0,1006.4840370291496,10,8]
[]
[]
["bls118","pH Meters/Controllers"]
[43,null,null,"Avg. Unit Cost","Useful Life (large)","Useful Life (small)"]
["pH_meter_cost_cl",0,0,2632.3973326835253,15,14]
[]
[]
["bore_cost",0,0,80.974546978108293,"N/A","N/A"]
[null,"Hand Dug Test Pits",null,"Avg. Unit Cost (per cy)","Useful Life (large)","Useful Life (small)"]
["pit_cost_cl",0,0,266.54121713627313,"N/A","N/A"]
[]
[]
["bls07210606","Plastic (XLPE) Chemical Storage Tanks"]
[16,"Size Needed (gal)","Size Selected (gal)","Avg. Unit Cost","Useful Life (large)","Useful Life (small)"]
["pl_cst_cost_cl",0,60,605.71944186780297,10,7]
[null,61,65,486.07891353673773,10,7]
[null,66,100,1588.8009497742278,10,7]
[null,101,125,1464.8625221608795,10,7]
[null,126,130,1384.6122834745943,10,7]
[null,131,150,1550.3078359239598,10,7]
[null,151,200,1611.8284618333778,10,7]
[null,201,205,1943.441724547893,10,7]
[null,206,220,1464.9308784118898,10,7]
[null,221,230,1538.4138482481389,10,7]
[null,231,250,1763.9211203316611,10,7]
[null,251,300,2053.3414871099671,10,7]
[null,301,310,1774.2429142342412,10,7]
[null,311,325,2003.1679988682863,10,7]
[null,326,330,1724.6846322516544,10,7]
[null,331,450,1678.5441628195908,10,7]
[null,451,500,2302.2265970390681,10,7]
[null,501,525,1943.4246354851407,10,7]
[null,526,540,2994.4190838337827,10,7]
[null,541,550,1825.0374092930208,10,7]
[null,551,600,1917.9617277379277,10,7]
[null,601,750,1660.4267767158406,10,7]
[null,751,825,1771.1889580916131,10,7]
[null,826,850,2506.9718255121384,10,7]
[null,851,1000,2109.4915229988255,10,7]
[null,1001,1025,2075.2781412442282,10,7]
[null,1026,1050,3624.4354460159188,10,7]
[null,1051,1200,2995.6809024499721,10,7]
[null,1201,1500,2885.2946879219239,10,7]
[null,1501,1600,2652.3579621612503,10,7]
[null,1601,2000,3312.1423143539578,10,7]
[null,2001,2400,3595.275188494832,10,7]
[null,2401,2500,4071.9612940846769,10,7]
[null,2501,2550,6543.5891984647606,10,7]
[null,2551,3000,4798.102514911915,10,7]
[null,3001,4200,7675.4135819409667,10,7]
[null,4201,5200,10973.123214636913,10,7]
[null,5201,5300,12610.699397846669,10,7]
[null,5301,6500,14059.546798274405,10,7]
[null,6501,6600,14183.340346127778,10,7]
[null,6601,"contact vendor","contact vendor",10,7]
[]
[]
["bls114","Plastic Eductors (for liquid solutions)"]
[29,"Size Needed (in. diam)","Size Selected (in. diam)","Avg. Unit Cost","Useful Life(large)","Useful Life (small)"]
["pl_eductor_cost_cl",0,0.5,582.20313776907904,22,17]
[null,0.51,0.75,604.9803094825063,22,17]
[null,0.76,1,638.19238703274334,22,17]
[null,1.1000000000000001,1.5,869.96057502822134,22,17]
[null,1.6,2,1296.9258096278425,22,17]
[null,2.1,3,2439.6417527990066,22,17]
[null,3.1,"contact vendor","contact vendor",22,17]
[]
[]
["bls114","Reinforced Plastic Salt Saturator (Brinemaker)"]
[29,"Size Needed (tons)","Size Selected (tons)","Avg. Unit Cost","Useful Life(large)","Useful Life (small)"]
["pl_saltbox_cost_cl",0,23,35521.451620946224,25,20]
[null,23.1,25,31760.754114934261,25,20]
[null,25.1,27,36673.396257630789,25,20]
[null,27.1,40,43692.140516464053,25,20]
[null,40.1,42,38927.154305236021,25,20]
[null,42.1,59,43450.002087845169,25,20]
[null,59.1,60,56462.185979585956,25,20]
[null,60.1,63,43776.363403321404,25,20]
[null,63.1,80,49015.40461356422,25,20]
[null,80.099999999999994,"contact vendor","contact vendor",25,20]
[]
[]
["bls115","Plant Intelligence Software"]
[36,null,null,"Avg. Unit Cost","Useful Life (large)","Useful Life (small)"]
["plant_intel_software_cost_cl",0,0,11480.115842868938,10,8]
[]
[]
["bls115","Expansion Base Controller Module"]
[36,null,null,"Avg. Unit Cost","Useful Life (large)","Useful Life (small)"]
["plc_base_expansion_controller_cost_cl",0,0,85.678421835734241,10,8]
[]
[]
["bls117507","Base Expansion Module"]
[42,null,null,"Avg. Unit Cost","Useful Life (large)","Useful Life (small)"]
["plc_base_expansion_cost_cl",0,0,118.37181499391322,10,8]
[]
[]
["bls117507","I/O Combination Analog Module"]
[42,null,null,"Avg. Unit Cost","Useful Life (large)","Useful Life (small)"]
["plc_combination_analog_cost_cl",0,0,652.67796318607805,10,8]
[]
[]
["bls117507","CPU"]
[42,null,null,"Avg. Unit Cost","Useful Life (large)","Useful Life (small)"]
["plc_cpu_cost_cl",0,0,628.20399656420727,10,8]
[]
[]
["bls117507","PLC Data Collection Software"]
[42,null,null,"Avg. Unit Cost","Useful Life (large)","Useful Life (small)"]
["plc_data_software_cost_cl",0,0,690.22366161995012,10,8]
[]
[]
["bls117507","I/O Discrete Input Module"]
[42,null,null,"Avg. Unit Cost","Useful Life (large)","Useful Life (small)"]
["plc_discrete_input_cost_cl",0,0,306.87179411739436,10,8]
[]
[]
["bls117507","I/O Discrete Output Module"]
[42,null,null,"Avg. Unit Cost","Useful Life (large)","Useful Life (small)"]
["plc_discrete_output_cost_cl",0,0,374.94265970264058,10,8]
[]
[]
["bls117507","Ethernet Module"]
[42,null,null,"Avg. Unit Cost","Useful Life (large)","Useful Life (small)"]
["plc_ethernet_cost_cl",0,0,865.22261904631989,10,8]
[]
[]
["bls115","Operator Interface Unit"]
[36,"System Size",null,"Avg. Unit Cost","Useful Life (large)","Useful Life (small)"]
["plc_op_interface_cost_cl","small","small",1955.7290443086633,10,8]
[null,"large","large",459.89513426134209,10,8]
[]
[]
["bls115","PLC Rack/Power Supply"]
[36,null,null,"Avg. Unit Cost","Useful Life (large)","Useful Life (small)"]
["plc_rack_cost_cl",0,0,340.15912297436552,10,8]
[]
[]
["bls117507","PLC  Programming Software"]
[42,null,null,"Avg. Unit Cost","Useful Life (large)","Useful Life (small)"]
["plc_software_cost_cl",0,0,473.69298983008503,10,8]
[]
[]
["bls114","Portable Mixers"]
[29,"Size needed (hp)","Size selected (hp)","Avg. Unit Cost","Useful Life (large)","Useful Life (small)"]
["port_mix_cost_cl",0,1,2096.6750305733167,25,20]
[null,1.1000000000000001,"contact vendor","contact vendor",25,20]
[]
[]
["bls1149","PVC Check Valves"]
[35,"Size needed (in. diam)","Size selected (in. diam)","Avg. Unit Cost","Useful Life (large)","Useful Life (small)"]
["pp_chv_cost_cl",0,0.5,79.855769230769226,25,20]
[null,0.6,0.75,87.259615384615387,25,20]
[null,0.76,1,104.18269230769231,25,20]
[null,1.1000000000000001,1.5,158.65384615384616,25,20]
[null,1.51,2,208.36538461538461,25,20]
[null,2.1,2.5,847.80375410854936,25,20]
[null,2.6,3,512.98076923076928,25,20]
[null,3.1,4,708.65384615384619,25,20]
[null,4.0999999999999996,6,1461.93404847739,25,20]
[null,6.1,8,2162.9867807076007,25,20]
[null,8.1,10,3222.9673163205507,25,20]
[null,10.1,12,4519.3087751028288,25,20]
[null,12.1,"contact vendor","contact vendor",25,20]
[]
[]
["bls1149","Polypropylene/PVC Manual Valves"]
[35,"Size needed (in. diam)","Size selected (in. diam)","Avg. Unit Cost","Useful Life (large)","Useful Life (small)"]
["pp_man_cost_cl",0,0.5,123.13887138767572,25,20]
[null,0.6,0.75,136.02311869660861,25,20]
[null,0.76,1,153.40629612728506,25,20]
[null,1.1000000000000001,1.5,325.47949510987348,25,20]
[null,1.6,2,329.89360435744584,25,20]
[null,2.1,3,358.37714931881567,25,20]
[null,3.1,4,470.91776878293058,25,20]
[null,4.0999999999999996,6,555.70567145655411,25,20]
[null,6.1,8,1128.5194457109608,25,20]
[null,8.1,10,1892.112903276141,25,20]
[null,10.1,12,2446.3541403619543,25,20]
[null,12.1,14,7398.6601526975719,25,20]
[null,14.1,16,11867.62109822923,25,20]
[null,16.100000000000001,18,15276.892816195012,25,20]
[null,18.100000000000001,20,17020.9386051287,25,20]
[null,20.100000000000001,24,24298.01344826557,25,20]
[null,24.1,"contact vendor","contact vendor",25,20]
[]
[]
["bls1149","Polypropylene/PVC Motor/Air Operated Valves (on/off)"]
[35,"Size needed (in. diam)","Size selected (in. diam)","Avg. Unit Cost","Useful Life (large)","Useful Life (small)"]
["pp_mov_cost_cl",0,1.5,702.22885157223027,25,20]
[null,1.6,2,702.22885157223027,25,20]
[null,2.1,2.5,572.19377909706236,25,20]
[null,2.6,3,877.78864752968707,25,20]
[null,3.1,4,1111.5667392202163,25,20]
[null,4.0999999999999996,6,1564.7845763815203,25,20]
[null,6.1,8,2406.3677797857363,25,20]
[null,8.1,10,4289.6012005962166,25,20]
[null,10.1,12,5234.4271376082852,25,20]
[null,12.1,14,9662.6363587324395,25,20]
[null,14.1,16,13781.864810300089,25,20]
[null,16.100000000000001,18,17833.037649262747,25,20]
[null,18.100000000000001,20,20203.516766600213,25,20]
[null,20.100000000000001,24,27184.884533339362,25,20]
[null,24.1,"contact vendor","contact vendor",25,20]
[]
[]
["bls118","Propeller Flow Meters"]
[43,"Size needed (in. diam)","Size selected (in. diam)","Avg. Unit Cost","Useful Life (large)","Useful Life (small)"]
["prop_fm_cost_cl",0,2,2692.2143919020632,15,14]
[null,2.1,3,3397.2089027065267,15,14]
[null,3.1,4,3162.9667103957627,15,14]
[null,4.0999999999999996,6,4458.2134561275525,15,14]
[null,6.1,8,5057.7014318214297,15,14]
[null,8.1,10,5410.4972361560685,15,14]
[null,10.1,12,5805.3942026027316,15,14]
[null,12.1,14,10960.912532079818,15,14]
[null,14.1,"contact vendor","contact vendor",15,14]
[]
[]
["bls1141","Centrifugal Pumps (Booster)"]
[30,"Size needed (gpm)","Size selected (gpm)","Avg. Unit Cost","Useful Life (large)","Useful Life (small)"]
["pump_cost_cl",0,10,5677.2511607538163,20,17]
[null,11,30,5907.7773247902132,20,17]
[null,31,50,6736.3908144099287,20,17]
[null,51,55,7918.8558741541174,20,17]
[null,56,75,8404.3144159870735,20,17]
[null,76,100,8404.3144159870735,20,17]
[null,101,120,10747.924187245231,20,17]
[null,121,125,9058.9315257220987,20,17]
[null,126,140,10747.924187245231,20,17]
[null,141,200,10052.398939539858,20,17]
[null,201,250,10605.869564837847,20,17]
[null,251,300,11163.348507247631,20,17]
[null,301,500,15106.120511414303,20,17]
[null,501,750,15541.926595522043,20,17]
[null,751,1000,17819.26280561243,20,17]
[null,1001,1500,21313.394051832671,20,17]
[null,1501,2000,31639.579131048209,20,17]
[null,2001,3000,36351.963074920728,20,17]
[null,3001,3500,41402.29357946603,20,17]
[null,3501,4000,43425.006674004457,20,17]
[null,4001,6000,89976.509472825419,20,17]
[null,6001,10000,80591.971358605399,20,17]
[null,10001,"contact vendor","contact vendor",20,17]
[]
[]
["bls1141","PVC Chemical Metering Pumps - Electric"]
[30,"Size needed (gph)","Size selected (gph)","Avg. Unit Cost","Useful Life (large)","Useful Life (small)"]
["pvc_empump_cost_cl",0,0.25,531.22119483019981,20,15]
[null,0.26,0.5,1031.7122521873109,20,15]
[null,0.51,0.85,547.35956024276288,20,15]
[null,0.86,1,531.22119483019981,20,15]
[null,1.01,1.3,2016.2197855428749,20,15]
[null,1.31,1.75,611.91302189301496,20,15]
[null,1.76,2.5,1384.9272765169405,20,15]
[null,2.5099999999999998,3.17,1627.3120763757934,20,15]
[null,3.1799999999999997,3.39,1190.2044491765237,20,15]
[null,3.4,5,1633.6194875245369,20,15]
[null,5.01,5.93,910.472782025431,20,15]
[null,5.9399999999999995,8,1542.6125552355252,20,15]
[null,8.01,10,1816.0233626000306,20,15]
[null,10.01,20,2238.9292282362449,20,15]
[null,20.010000000000002,25,2264.7506128963455,20,15]
[null,25.01,33.880000000000003,2704.5210703886878,20,15]
[null,33.89,71.150000000000006,2759.1376861038216,20,15]
[null,71.160000000000011,"contact vendor","contact vendor",20,15]
[]
[]
["bls1141","PVC Chemical Metering Pumps - Mechanical"]
[30,"Size needed (gph)","Size selected (gph)","Avg. Unit Cost","Useful Life (large)","Useful Life (small)"]
["pvc_mmpump_cost_cl",0,1,2461.1007254158626,20,17]
[null,1.01,2,2461.1007254158626,20,17]
[null,2.0099999999999998,4,2461.1007254158626,20,17]
[null,4.01,5,2461.1007254158626,20,17]
[null,5.01,7,2461.1007254158626,20,17]
[null,7.01,11,3543.7160718419659,20,17]
[null,10.01,14,3543.7160718419659,20,17]
[null,14.01,30,3655.4944260560915,20,17]
[null,30.01,65,3898.3829471941708,20,17]
[null,65.010000000000005,108,4687.4177031478857,20,17]
[null,108.01,"contact vendor","contact vendor",20,17]
[]
[]
["bls072106033","PVC Piping"]
[15,"Size needed (in. diam)","Size selected (in. diam)","Avg. Unit Cost ($/lf)","Useful Life (large)","Useful Life (small)"]
["pvc_pipe_cost_cl",0,0.5,3.0128258684277665,22,17]
[null,0.6,0.75,3.9351530427680776,22,17]
[null,0.76,1,5.8268559963551469,22,17]
[null,1.1000000000000001,1.5,9.0831143135917074,22,17]
[null,1.6,2,1.9292992424242426,22,17]
[null,2.1,2.5,3.015700757575758,22,17]
[null,2.6,3,4.9169034090909092,22,17]
[null,3.1,4,8.2884943181818187,22,17]
[null,4.0999999999999996,6,12.175189393939394,22,17]
[null,6.1,8,17.232575757575759,22,17]
[null,8.1,10,25.755208333333336,22,17]
[null,10.1,12,32.779356060606062,22,17]
[null,12.1,14,23.882102272727273,22,17]
[null,14.1,16,30.437973484848488,22,17]
[null,16.100000000000001,18,38.398674242424249,22,17]
[null,18.100000000000001,20,46.827651515151523,22,17]
[null,20.100000000000001,24,64.153882575757578,22,17]
[null,24.1,30,110.51325757575759,22,17]
[null,30.1,36,156.40435606060606,22,17]
[null,36.1,42,208.85132575757578,22,17]
[null,42.1,48,262.2348484848485,22,17]
[null,48.1,"contact vendor","contact vendor",22,17]
[]
[]
["bls114","Eductors (for bed transfer)"]
[29,"Size Needed (in. diam)","Size Selected (in. diam)","Avg. Unit Cost","Useful Life(large)","Useful Life (small)"]
["seductor_cost_cl",0,1.5,1846.7358896626049,45,40]
[null,1.6,2,2821.978972458744,45,40]
[null,2.1,2.5,4149.531285425358,45,40]
[null,2.6,3,6729.785512923132,45,40]
[null,3.1,4,10692.666736358129,45,40]
[null,4.0999999999999996,6,14782.233575049395,45,40]
[null,6.1,"contact vendor","contact vendor",45,40]
[]
[]
[3,null,null,"Avg. Unit Cost (per sf)","Useful Life (large)"]
["sitework_sf_cl","Sitework unit cost","sitework_sf_cl",12.815384615384616,"N/A"]
[]
[]
["bls1149","Stainless Steel Check Valves"]
[35,"Size needed (in. diam)","Size selected (in. diam)","Avg. Unit Cost","Useful Life (large)","Useful Life (small)"]
["ss_chv_cost_cl",0,0.5,294.59199775933519,25,20]
[null,0.6,0.75,275.48029735890964,25,20]
[null,0.76,1,509.08776123157827,25,20]
[null,1.1000000000000001,1.5,784.79758176028861,25,20]
[null,1.6,2,842.84019306979849,25,20]
[null,2.1,2.5,822.37739511699749,25,20]
[null,2.6,3,2183.4761700412892,25,20]
[null,3.1,4,2979.4198707075684,25,20]
[null,4.0999999999999996,6,3203.9711202113463,25,20]
[null,6.1,8,4908.3737252046567,25,20]
[null,8.1,10,4861.0680549464869,25,20]
[null,10.1,12,7435.4192154304619,25,20]
[null,12.1,14,9908.3857787401084,25,20]
[null,14.1,16,13048.630347474615,25,20]
[null,16.100000000000001,18,15605.757320614572,25,20]
[null,18.100000000000001,20,20584.821496283024,25,20]
[null,20.100000000000001,24,31328.181067057405,25,20]
[null,24.1,30,43091.509363992904,25,20]
[null,30.1,36,51600.088447803006,25,20]
[null,36.1,42,70035.343129391593,25,20]
[null,42.1,48,84216.308269075103,25,20]
[null,48.1,"contact vendor","contact vendor",25,20]
[]
[]
["bls1072","Stainless Steel Chemical Storage Tanks"]
[23,"Size needed (gal)","Size selected (gal)","Avg. Unit Cost","Useful Life (large)","Useful Life (small)"]
["ss_cst_cost_cl",0,1100,7949.7779824916643,35,30]
[null,1101,2400,10194.359395373389,35,30]
[null,2401,3000,11788.978167510269,35,30]
[null,3001,4300,16281.924302517553,35,30]
[null,4301,5100,17506.133126392397,35,30]
[null,5101,6100,20471.825383349282,35,30]
[null,6101,8000,27050.981279310548,35,30]
[null,8001,10000,32803.710819726221,35,30]
[null,10001,30000,77642.371206736992,35,30]
[null,30001,"contact vendor","contact vendor",35,30]
[]
[]
["bls114","Stainless Steel Eductors (for liquid solutions)"]
[29,"Size Needed (in. diam)","Size Selected (in. diam)","Avg. Unit Cost","Useful Life(large)","Useful Life (small)"]
["ss_eductor_cost_cl",0,0.5,610.96543455401127,45,40]
[null,0.51,0.75,719.06996525972477,45,40]
[null,0.76,1,779.83179528768051,45,40]
[null,1.1000000000000001,1.5,1095.9275729765218,45,40]
[null,1.6,2,1825.1022780558269,45,40]
[null,2.1,3,4294.5504454546171,45,40]
[null,3.1,4,7628.9121587964992,45,40]
[null,4.0999999999999996,6,9431.2936920697102,45,40]
[null,6.1,8,10446.584394702575,45,40]
[null,8.1,"contact vendor","contact vendor",45,40]
[]
[]
["bls1141","316 Stainless Steel Chemical Metering Pumps - Electric"]
[30,"Size needed (gph)","Size selected (gph)","Avg. Unit Cost","Useful Life (large)","Useful Life (small)"]
["ss_empump_cost_cl",0,0.13,1041.6238982781933,20,15]
[null,0.14000000000000001,0.25,1499.1869036378866,20,15]
[null,0.26,0.5,1276.8002282527682,20,15]
[null,0.51,0.85,1822.2904278352423,20,15]
[null,0.86,1,1240.7578788313774,20,15]
[null,1.01,1.3,2230.3221000162112,20,15]
[null,1.31,1.75,1872.5614360953764,20,15]
[null,1.76,2.5,1906.7411491754006,20,15]
[null,2.5099999999999998,3.17,1820.1386457802341,20,15]
[null,3.1799999999999997,4,2230.3221000162112,20,15]
[null,4.01,5,2454.3764064939614,20,15]
[null,5.01,5.93,2454.3764064939614,20,15]
[null,5.9399999999999995,8,2445.7692782739277,20,15]
[null,8.01,16.940000000000001,3503.3701583105585,20,15]
[null,16.950000000000003,20,3463.4277039144649,20,15]
[null,20.010000000000002,25,3255.646249227716,20,15]
[null,25.01,55,4271.2873791916827,20,15]
[null,55.01,71.150000000000006,4251.1542477838348,20,15]
[null,71.160000000000011,186.35,4726.2942858810748,20,15]
[null,186.35999999999999,"contact vendor","contact vendor",20,15]
[]
[]
["bls1149","Stainless Steel Manual Valves"]
[35,"Size needed (in. diam)","Size selected (in. diam)","Avg. Unit Cost","Useful Life (large)","Useful Life (small)"]
["ss_man_cost_cl",0,1,277.97823676388771,25,20]
[null,1.1000000000000001,1.5,313.35999755720997,25,20]
[null,1.6,2,358.71736233051587,25,20]
[null,2.1,3,2538.9221006530552,25,20]
[null,3.1,4,3794.4098011850811,25,20]
[null,4.0999999999999996,6,5551.354855323485,25,20]
[null,6.1,8,6752.0126300930642,25,20]
[null,8.1,10,8764.2729998057875,25,20]
[null,10.1,12,12557.923454678745,25,20]
[null,12.1,"contact vendor","contact vendor",25,20]
[]
[]
["bls1141","316 Stainless Steel Chemical Metering Pumps - Mechanical"]
[30,"Size needed (gph)","Size selected (gph)","Avg. Unit Cost","Useful Life (large)","Useful Life (small)"]
["ss_mmpump_cost_cl",0,7,4041.8571318776076,20,17]
[null,7.01,14,4656.9259324334571,20,17]
[null,14.01,24,4450.1652566154844,20,17]
[null,24.01,32.299999999999997,5052.102831694523,20,17]
[null,32.31,40.6,5078.7994798621876,20,17]
[null,40.61,55.5,6109.5514889397837,20,17]
[null,55.51,61.8,5196.9218086073897,20,17]
[null,61.81,78.900000000000006,5368.6444288743351,20,17]
[null,78.91,96,4595.6627929271172,20,17]
[null,96.01,104.6,6753.6002061786585,20,17]
[null,104.61,125,5389.665340418589,20,17]
[null,125.01,137.9,7367.8640159863662,20,17]
[null,137.91,150,4768.557415954414,20,17]
[null,150.01,180,4922.2415253120125,20,17]
[null,180.01,192,6984.1699925264511,20,17]
[null,192.01,218.7,8447.3940066781724,20,17]
[null,218.71,250,7080.2225608749504,20,17]
[null,250.01,272.60000000000002,8781.9358527519344,20,17]
[null,272.61,300,7157.0646155537488,20,17]
[null,300.01,360,7310.7487249113456,20,17]
[null,360.01,"contact vendor","contact vendor",20,17]
[]
[]
["bls1149","Stainless Steel Motor/Air Operated Valves (on/off)"]
[35,"Size needed (in. diam)","Size selected (in. diam)","Avg. Unit Cost","Useful Life (large)","Useful Life (small)"]
["ss_mov_cost_cl",0,1,908.90636697142929,25,20]
[null,1.1000000000000001,1.5,921.31867767961535,25,20]
[null,1.6,2,948.00514570221583,25,20]
[null,2.1,3,2481.1712113123772,25,20]
[null,3.1,4,3800.7701575172755,25,20]
[null,4.0999999999999996,6,5899.9391263669186,25,20]
[null,6.1,8,8985.463196894576,25,20]
[null,8.1,14,21494.827213674158,25,20]
[null,14.1,16,24828.454975352688,25,20]
[null,16.100000000000001,20,40774.139121219967,25,20]
[null,20.100000000000001,24,57114.984815850723,25,20]
[null,24.1,30,70475.957982031381,25,20]
[null,30.1,48,194516.18030450642,25,20]
[null,48.1,"contact vendor","contact vendor",25,20]
[]
[]
["bls10170674","Stainless Steel Piping"]
[21,"Size needed (in. diam)","Size selected (in. diam)","Avg. Unit Cost ($/lf)","Useful Life (large)","Useful Life (small)"]
["ss_pipe_cost_cl",0,0.5,19.541095890410958,45,40]
[null,0.6,0.75,25.124266144814086,45,40]
[null,0.76,1,28.381115459882579,45,40]
[null,1.1000000000000001,1.25,33.49902152641878,45,40]
[null,1.26,1.5,42.339041095890401,45,40]
[null,1.6,2,60.48434442270058,45,40]
[null,2.1,2.5,78.629647749510752,45,40]
[null,2.6,3,95.844422700587074,45,40]
[null,3.1,4,115.38551859099803,45,40]
[null,4.0999999999999996,6,207.50782778864968,45,40]
[null,6.1,8,302.42172211350288,45,40]
[null,8.1,10,423.39041095890406,45,40]
[null,10.1,12,539.70645792563596,45,40]
[null,12.1,16,167.93951178548772,45,40]
[null,16.100000000000001,36,1097.6578735821997,45,40]
[null,36.1,48,1676.409131112634,45,40]
[null,48.1,"contact vendor","contact vendor",45,40]
[]
[]
["bls1072","Stainless Steel Pressure Vessels"]
[23,"Size needed (gal)","Size selected (gal)","Avg. Unit Cost","Useful Life (large)","Useful Life (small)"]
["ss_pv_cost_cl",0,180,16585.954758781289,35,30]
[null,181,300,19243.127622665736,35,30]
[null,301,650,22313.478959083448,35,30]
[null,651,750,25444.310115011875,35,30]
[null,751,880,28910.15707592418,35,30]
[null,881,950,29768.183166386476,35,30]
[null,951,1400,47364.193185800556,35,30]
[null,1401,1700,47942.497181107661,35,30]
[null,1701,2000,48478.941235837083,35,30]
[null,2001,2900,69712.763470221951,35,30]
[null,2901,4300,74515.531238453172,35,30]
[null,4301,4700,85176.144656086297,35,30]
[null,4701,6800,82846.764016942616,35,30]
[null,6801,17000,248847.28839886823,35,30]
[null,17001,27100,381164.93173247052,35,30]
[null,27101,"contact vendor","contact vendor"]
[]
[]
["bls1072","Steel Backwash Tanks"]
[23,"Size needed (gal)","Size selected (gal)","Avg. Unit Cost","Useful Life (large)","Useful Life (small)"]
["st_bwt_cost_cl",0,14309,39868.827312175803,35,30]
[null,14310,24000,82656.21510894761,35,30]
[null,24001,43000,95129.273097015233,35,30]
[null,43001,130000,217219.85218862572,35,30]
[null,130001,135182,108734.6403554008,35,30]
[null,135183,256000,322598.93240150256,35,30]
[null,256001,282094,167945.29480370696,35,30]
[null,282095,"contact vendor","contact vendor",35,30]
[]
[]
["bls107411","Steel Piping"]
[25,"Size needed (in. diam)","Size selected (in. diam)","Avg. Unit Cost ($/lf)","Useful Life (large)","Useful Life (small)"]
["st_pipe_cost_cl",0,1,18.831336633663369,35,33]
[null,1.1000000000000001,1.5,23.97623762376238,35,33]
[null,1.6,2,29.970297029702973,35,33]
[null,2.1,2.5,42.457920792079214,35,33]
[null,2.6,3,48.451980198019804,35,33]
[null,3.1,4,59.940594059405946,35,33]
[null,4.0999999999999996,6,103.89702970297031,35,33]
[null,6.1,8,145.85544554455447,35,33]
[null,8.1,10,183.81782178217824,35,33]
[null,10.1,12,222.77920792079212,35,33]
[null,12.1,36,212.72920334095431,35,33]
[null,36.1,48,289.72575255278639,35,33]
[null,48.1,"contact vendor","contact vendor",35,33]
[]
[]
["CCI","Geotechnical costs"]
[2,"Borings, initial field stake out & determination of elevations",null,"Avg. Unit Cost (per day)","Useful Life (large)","Useful Life (small)"]
["stake_out_cost_cl",0,0,1433.9242694040011,"N/A","N/A"]
[]
[]
["bls1173","Standby Generators for Standby Power Calculations"]
[40,"Size needed (kW)","Size selected (kW)","Avg. Unit Cost ($/kW)","Useful Life (large)","Useful Life (small)"]
["std_gen_cost_cl",0,30,516.77599243856332]
[null,31,50,519.27008506616255]
[null,51,125,303.28166351606808]
[null,126,150,318.24621928166351]
[null,151,175,301.28638941398867]
[null,176,200,283.82774102079395]
[null,201,250,240.43052930056712]
[null,251,300,213.64397448015123]
[null,301,350,206.01205103969755]
[null,351,400,218.98133270321361]
[null,401,500,217.43499527410208]
[null,501,750,225.01703686200381]
[null,751,1000,210.70094517958412]
[]
[]
["bls118","Drive Controllers"]
[43,null,null,"Avg. Unit Cost","Useful Life (large)","Useful Life (small)"]
["switch_cost_cl",0,0,1072.4341728020522,15,14]
[]
[]
["bls118","Temperature Meter"]
[43,null,null,"Avg. Unit Cost","Useful Life (large)","Useful Life (small)"]
["temp_meter_cost_cl",0,0,593.29510833944676,15,14]
[]
[]
["bls118","Turbidimeter"]
[43,null,null,"Avg. Unit Cost","Useful Life (large)","Useful Life (small)"]
["turbidimeter_cost_cl",0,0,5223.1635202481766,15,14]
[]
[]
["bls117507","UPS"]
[42,null,null,"Avg. Unit Cost","Useful Life (large)","Useful Life (small)"]
["ups_cost_cl",0,0,563.15461702991672,10,8]
[]
[]
["bls118","Venturi Flow Meters"]
[43,"Size needed (in. diam)","Size selected (in. diam)","Avg. Unit Cost","Useful Life (large)","Useful Life (small)"]
["ven_fm_cost_cl",0,2,5465.3094164165286,15,14]
[null,2.1,3,8218.0024846268898,15,14]
[null,3.1,6,12117.433322137349,15,14]
[null,6.1,12,17331.263115229482,15,14]
[null,12.1,24,45943.763901792663,15,14]
[null,24.1,"contact vendor","contact vendor",15,14]
[]
[]
["bls114","Volumetric Dry Feeder"]
[29,"Size Needed (cfm)","Size Selected (cfm)","Avg. Unit Cost","Useful Life(large)","Useful Life (small)"]
["vol_feed_cost_cl",0,5.0000000000000001E-4,15177.944752161706,25,20]
[null,5.1000000000000004E-4,5.3E-3,15177.944752161706,25,20]
[null,5.4000000000000003E-3,2.5,16118.171418224822,25,20]
[null,2.5099999999999998,"contact vendor","contact vendor",25,20]
[]
[]
["BCI","High Quality, No Heating or Cooling"]
[3,"Size needed (sf)","Size selected (sf)","Avg. Unit Cost","Useful Life (large)","Useful Life (small)"]
["bldg_hi_cost_cl",0,500,164.32066168808467,40,37]
[null,500.1,1000,138.92127434441062,40,37]
[null,1000.1,2000,123.94424800758561,40,37]
[null,2000.1,3000,116.78034174436795,40,37]
[null,3000.1,4000,110.07521237910991,40,37]
[null,4000.1,5000,104.59747484770055,40,37]
[null,5000.1000000000004,7500,99.401198925910123,40,37]
[null,7500.1,8000,98.60810463326834,40,37]
[null,8000.1,10000,94.44682086185442,40,37]
[null,10000.1,12000,94.43891097214248,40,37]
[null,12000.1,15000,90.346080881452835,40,37]
[null,15000.1,18000,88.874169726348228,40,37]
[null,18000.099999999999,20000,86.552325796374404,40,37]
[null,20000.099999999999,24000,87.940940056356169,40,37]
[null,24000.1,25000,84.656313322033512,40,37]
[null,25000.1,30000,84.001143445139476,40,37]
[null,30000.1,36000,83.786621555099913,40,37]
[null,36000.1,42000,81.417795911777972,40,37]
[null,42000.1,48000,81.027117774032121,40,37]
[null,48000.1,50000,80.056981554700471,40,37]
[null,50000.1,54000,80.229887632699445,40,37]
[null,54000.1,60000,80.091173785927808,40,37]
[null,60000.1,100000,76.639430988004463,40,37]
[null,100000.1,200000,74.006349053593496,40,37]
[null,200000.1,"contact vendor"]
[]
[]
["BCI","Low Quality, No Heating or Cooling"]
[3,"Size needed (sf)","Size selected (sf)","Avg. Unit Cost","Useful Life (large)","Useful Life (small)"]
["bldg_lo_cost_cl",0,500,90.895204266982759,40,37]
[null,500.1,1000,80.17905227893165,40,37]
[null,1000.1,2000,75.104239977760983,40,37]
[null,2000.1,3000,72.769358231718499,40,37]
[null,3000.1,4000,69.31697283119486,40,37]
[null,4000.1,5000,66.194847058636313,40,37]
[null,5000.1000000000004,7500,64.492195301784065,40,37]
[null,7500.1,8000,64.084083199268534,40,37]
[null,8000.1,10000,61.565758614742805,40,37]
[null,10000.1,12000,62.122837621819031,40,37]
[null,12000.1,15000,59.962180691418723,40,37]
[null,15000.1,18000,58.9176202039759,40,37]
[null,18000.099999999999,20000,57.584641809587026,40,37]
[null,20000.099999999999,24000,58.617472761730703,40,37]
[null,24000.1,25000,56.765292437966217,40,37]
[null,25000.1,30000,56.340683783728537,40,37]
[null,30000.1,36000,56.419923260843667,40,37]
[null,36000.1,42000,54.918096825614136,40,37]
[null,42000.1,48000,54.718462124432079,40,37]
[null,48000.1,50000,54.271568663407955,40,37]
[null,50000.1,54000,54.285457492411808,40,37]
[null,54000.1,60000,54.446146131750346,40,37]
[null,60000.1,100000,52.495709810916672,40,37]
[null,100000.1,200000,51.013446998123108,40,37]
[null,200000.1,"contact vendor"]
[]
[]
["BCI","Mid Quality, No Heating or Cooling"]
[3,"Size needed (sf)","Size selected (sf)","Avg. Unit Cost","Useful Life (large)","Useful Life (small)"]
["bldg_mid_cost_cl",0,500,110.86911254054154,40,37]
[null,500.1,1000,98.12779547183915,40,37]
[null,1000.1,2000,91.725483413626321,40,37]
[null,2000.1,3000,88.296937966054386,40,37]
[null,3000.1,4000,84.19971661186635,40,37]
[null,4000.1,5000,80.516200964144105,40,37]
[null,5000.1000000000004,7500,77.852610368077492,40,37]
[null,7500.1,8000,77.393670422405037,40,37]
[null,8000.1,10000,74.577535811427779,40,37]
[null,10000.1,12000,74.921282744137969,40,37]
[null,12000.1,15000,72.351780007854828,40,37]
[null,15000.1,18000,71.13548158022607,40,37]
[null,18000.099999999999,20000,69.67599550027218,40,37]
[null,20000.099999999999,24000,70.754419992349042,40,37]
[null,24000.1,25000,68.61432148343026,40,37]
[null,25000.1,30000,68.161517957939836,40,37]
[null,30000.1,36000,68.221925008171567,40,37]
[null,36000.1,42000,66.514319987158785,40,37]
[null,42000.1,48000,66.298145448410892,40,37]
[null,48000.1,50000,65.7850969381429,40,37]
[null,50000.1,54000,65.819359081900728,40,37]
[null,54000.1,60000,65.942437143994255,40,37]
[null,60000.1,100000,63.703758186296518,40,37]
[null,100000.1,200000,62.020711526202142,40,37]
[null,200000.1,"contact vendor"]
[]
[]
["BCI","Small Low Cost Shed"]
[3,"Size needed (sf)","Size selected (sf)","Avg. Unit Cost","Useful Life (large)","Useful Life (small)"]
["bldg_shed_cost_cl",0,500,46.002457179826116,25,20]
[null,500.1,"contact vendor","contact vendor"]
[]
[]
["bls1148","Air conditioning system"]
[34,"Size needed (tons)","Size selected (tons)","Avg. Unit Cost","Useful Life (large)","Useful Life (small)"]
["hvac_ac_cost_cl",0,3.33,11317.697405784169,25,20]
[null,3.34,6.66,22944.621516644409,25,20]
[null,6.67,16.66,70503.688757343989,25,20]
[null,16.670000000000002,33.33,154613.35253803511,25,20]
[null,33.339999999999996,66.66,340149.3755836772,25,20]
[null,66.67,113.32,705036.88757343998,25,20]
[null,113.33,"contact vendor","contact vendor",25,20]
[]
[]
["bls106","Electric resistance heaters"]
[22,"Size needed (MBH)","Size selected (MBH)","Avg. Unit Cost","Useful Life (large)","Useful Life (small)"]
["hvac_elec_cost_cl",0,41,26463.924267001355,25,20]
[null,41.1,103,55841.308086333127,25,20]
[null,103.1,461,95981.011491973477,25,20]
[null,461.1,820,208008.87262159091,25,20]
[null,820.1,1010,266435.87606061727,25,20]
[null,1010.1,1432,367532.92252648302,25,20]
[null,1432.1,2273,465158.09635915502,25,20]
[null,2273.1,3071,685034.46089057182,25,20]
[null,3071.1,6148,1179696.1909829928,25,20]
[null,6148.1,"contact vendor","contact vendor",25,20]
[]
[]
["bls106","Natural gas condensing furnace"]
[22,"Size needed (MBH)","Size selected (MBH)","Avg. Unit Cost","Useful Life (large)","Useful Life (small)"]
["hvac_gas_cost_cl",0,80,29582.996885815766,25,20]
[null,80.099999999999994,163,39052.618839774048,25,20]
[null,163.1,544,98579.773596827465,25,20]
[null,544.1,1088,171909.2893951693,25,20]
[null,1088.0999999999999,3264,401582.867178655,25,20]
[null,3264.1,5032,768313.93781164405,25,20]
[null,5032.1000000000004,"contact vendor","contact vendor",25,20]
[]
[]
["bls106","Natural gas non-condensing furnace"]
[22,"Size needed (MBH)","Size selected (MBH)","Avg. Unit Cost","Useful Life (large)","Useful Life (small)"]
["hvac_gas_non_cost_cl",0,80,29582.996885815766,25,20]
[null,80.099999999999994,163,39052.618839774048,25,20]
[null,163.1,544,98579.773596827465,25,20]
[null,544.1,1088,171909.2893951693,25,20]
[null,1088.0999999999999,3264,401582.867178655,25,20]
[null,3264.1,5032,768313.93781164405,25,20]
[null,5032.1000000000004,"contact vendor","contact vendor",25,20]
[]
[]
["bls1148","Heat pump"]
[34,"Size needed (MBH)","Size selected (MBH)","Avg. Unit Cost","Useful Life (large)","Useful Life (small)"]
["hvac_hp_cost_cl",0,0.5,3972.9940028402084,25,20]
[null,0.51,0.75,4334.1752758256816,25,20]
[null,0.76,1,3769.8295367858796,25,20]
[null,1.01,1.5,3905.272514155432,25,20]
[null,1.51,2,4176.1584688945368,25,20]
[null,2.0099999999999998,2.5,4492.1920827568265,25,20]
[null,2.5099999999999998,3,4785.6518670575233,25,20]
[null,3.01,3.5,5304.8499469741419,25,20]
[null,3.51,4,5711.1788790827995,25,20]
[null,4.01,5,6298.0984476841932,25,20]
[null,5.01,7.5,12144.720304136545,25,20]
[null,7.51,10,15869.402181799242,25,20]
[null,10.01,12,18781.426195244621,25,20]
[null,12.01,15,25282.689108983144,25,20]
[null,15.01,20,27630.367383388722,25,20]
[null,20.010000000000002,25,37562.852390489243,25,20]
[null,25.01,30,41174.665120343976,25,20]
[null,30.01,40,58150.184950661234,25,20]
[null,40.01,50,65734.991683356173,25,20]
[null,50.01,"contact vendor","contact vendor"]
[]
[]
["bls106","Mid-efficiency oil furnace"]
[22,"Size needed (MBH)","Size selected (MBH)","Avg. Unit Cost","Useful Life (large)","Useful Life (small)"]
["hvac_oil_mid_cost_cl",0,109,38239.756202149161,25,20]
[null,109.1,235,55844.855228314664,25,20]
[null,235.1,940,157088.20036094138,25,20]
[null,940.1,1600,250948.40007660387,25,20]
[null,1600.1,2480,389971.45739603695,25,20]
[null,2480.1,3350,489329.74412433244,25,20]
[null,3350.1,"contact vendor","contact vendor",25,20]
[]
[]
["bls106","Standard efficiency oil furnace"]
[22,"Size needed (MBH)","Size selected (MBH)","Avg. Unit Cost","Useful Life (large)","Useful Life (small)"]
["hvac_oil_std_cost_cl",0,109,38239.756202149161,25,20]
[null,109.1,235,55844.855228314664,25,20]
[null,235.1,940,157088.20036094138,25,20]
[null,940.1,1600,250948.40007660387,25,20]
[null,1600.1,2480,389971.45739603695,25,20]
[null,2480.1,3350,489329.74412433244,25,20]
[null,3350.1,"contact vendor","contact vendor",25,20]
[]
[]
[null,"Building maintenance (labor and materials)","building_matl_rate_cl",5.7866132725374513,"/sf/yr"]
[]
[]
[null,"Cooling system maintenance (labor and materials)","cooling_matl_rate_cl",7.3551926283142985E-2,"/sf/yr"]
[]
[]
[null,"Heating oil cost","diesel_cost_cl",2.3528514873883046,"/gal"]
[]
[]
[null,"Energy cost","energy_cost_cl",0.12121832061068702,"/kwh"]
[]
[]
[null,"Natural gas cost","gas_cost_cl",0.79405665355998734,"/therm"]
[]
[]
[5,"Hazardous waste disposal","haz_disposal_cost_cl",365.22256038668081,"/ton"]
[]
[]
[null,"Hazardous waste minimum charge per shipment","haz_trans_min_cost_cl",3132.433195825839,"/shipment"]
[]
[]
[null,"Hazardous waste transportation","haz_transportation_cost_cl",0.11505034988905954,"/ton-mile"]
[]
[]
[null,"Radioactive hazardous waste annual fee","hazrad_annual_fee_cl",1618.8271655284022,"/year"]
[]
[]
[null,"Radioactive hazardous waste disposal","hazrad_disposal_cost_cl",11278.653485407178,"/ton"]
[]
[]
[null,"Radioactive hazardous waste minimum charge per shipment","hazrad_trans_min_cost_cl",3132.433195825839,"/shipment"]
[]
[]
[null,"Radioactive hazardous waste transportation","hazrad_transportation_cost_cl",0.27006758042614443,"/ton-mile"]
[]
[]
[null,"Heating system maintenance (labor and materials)","heating_matl_rate_cl",0.13269710372451446,"/sf/yr"]
[]
[]
["ECI","Labor Costs",null,null,"Inf. Adj. Rates"]
[4,"Design Flow Needed (mgd)","Design Flow (mgd)","Average Water Treatment Plant Operators3","Technical Rate (Loaded)","Managerial Rate (Loaded)","Clerical Rate (Loaded)"]
["labor_table_cl",0,0.03,1,31.9148911743602,45.239626883520685,30.477646496053573]
[null,3.1E-2,0.124,1,31.9148911743602,45.239626883520685,30.477646496053573]
[null,0.1241,0.30499999999999999,1.2,31.9148911743602,45.239626883520685,30.477646496053573]
[null,0.30509999999999998,0.74,1.2,31.9148911743602,45.239626883520685,30.477646496053573]
[null,0.74099999999999999,2.1520000000000001,1.6,34.050609901937335,51.740808419038501,30.477646496053573]
[null,2.1520999999999999,7.3650000000000002,2.8,35.944549150920828,57.637541258072218,39.356326237742159]
[null,7.3651,22.614000000000001,3.8,37.516115761779474,67.25499162879693,39.356326237742159]
[null,22.614100000000001,75.069999999999993,7.8,43.842678784979661,71.848801722076047,39.356326237742159]
[]
[]
[null,"Land Costs"]
["CPI","Land Costs"]
[5,"System Size  greater than (MGD)","Assumed Population","Unit Cost ($/acre)"]
["land_cost_cl",0,"25-100",22071.006650033491]
[null,3.1E-2,"101-500",22047.109132569258]
[null,0.1241,"501-1,000",16524.280174168169]
[null,0.30509999999999998,"1,001-3,300",19717.525281399929]
[null,0.74099999999999999,"3,301-10,000",36189.204491085293]
[null,2.1520999999999999,"10,001-50,000",46531.704610662571]
[null,7.3651,"50,001-100,000",52021.957885134674]
[null,22.614100000000001,"100,001-1,000,000",111427.57541372362]
[]
[]
[null,"Liquid hazardous waste disposal","lhaz_disposal_cost_cl",3.0514129216979957,"/gal"]
[]
[]
[null,"Liquid hazardous waste minimum charge per shipment","lhaz_trans_min_cost_cl",3132.433195825839,"/shipment"]
[]
[]
[null,"Liquid hazardous waste transportation","lhaz_transportation_cost_cl",2.5831788699201999E-3,"/gal-mile"]
[]
[]
[null,"NEPA Compliance Costs"]
[null,"Land area (acres)","Permit Cost (inf. adj.)"]
["NEPA_cost_cl",0,1683.538163695446]
[null,1.0009999999999999,6628.9315195508179]
[]
[]
[null,"Non-hazardous waste disposal","nonhaz_disposal_cost_cl",69.656391522899071,"/ton"]
[]
[]
[null,"Non-hazardous waste transportation","nonhaz_transportation_cost_cl",0.52588469022017403,"/ton-mile"]
[]
[]
[null,"Permit Costs"]
["CPI","NPDES Permit Costs"]
[5,"Avg Discharge (gpd)","Permit Cost (inf. adj.)"]
["NPDES_permit_cost_cl",0,2735.7495160050994]
[null,100000.1,3367.0763273908919]
[null,1000000.1,5787.1624377030948]
[]
[]
[null,"Pilot Studies"]
["ECI","Pilot study costs"]
[4,"Small systems"]
[null,"Model ","Total (current yr $)"]
["pilot_cost_small","GAC",15572.823955072055]
[null,"AA",15572.823955072055]
[null,"AAFS-50",15572.823955072055]
[null,"G2",15572.823955072055]
[null,"SORB33",15572.823955072055]
[null,"GFH",15572.823955072055]
[null,"GF",15572.823955072055]
[null,"AX",15572.823955072055]
[null,"CX",15572.823955072055]
[null,"Lime",600.08180869565217]
[null,"RO",1329.9758360248447]
[null,"NF",1329.9758360248447]
[null,"EDR",861.26992795031049]
[null,"PLPM",55766.146054318531]
[null,"SLPM",55766.146054318531]
[null,"confilt",2613.984054423036]
[null,"dirfilt",2613.984054423036]
[null,"UV",0]
[null,"PTA",0]
[null,"MSBA",15855.11024876718]
[null,"Tray Aeration",15855.11024876718]
[null,"Diffuse Aeration",14524.034514344819]
[null,"O3_PX",2232.7060694407633]
[null,"O3_D",27594.090314029738]
[null,"RCF for Cr(VI) Removal",4924.208725406329]
[null,"BIO",132668.5186518738]
[null,"Medium systems"]
["pilot_cost_medium","GAC",69717.429975702486]
[null,"AA",69717.429975702486]
[null,"AAFS-50",69717.429975702486]
[null,"G2",69717.429975702486]
[null,"SORB33",69717.429975702486]
[null,"GFH",69717.429975702486]
[null,"GF",69717.429975702486]
[null,"AX",69717.429975702486]
[null,"CX",69717.429975702486]
[null,"Lime",600.08180869565217]
[null,"RO",64003.819048107347]
[null,"NF",64003.819048107347]
[null,"EDR",65033.728720497835]
[null,"PLPM",99841.718513606014]
[null,"SLPM",99841.718513606014]
[null,"confilt",74488.011817506456]
[null,"dirfilt",74488.011817506456]
[null,"UV",19609.232766838373]
[null,"PTA",0]
[null,"MSBA",36377.315705213186]
[null,"Tray Aeration",36377.315705213186]
[null,"Diffuse Aeration",34140.251865897611]
[null,"O3_PX",3349.0591041611456]
[null,"O3_D",40836.142363691913]
[null,"RCF for Cr(VI) Removal",170289.71903937656]
[null,"BIO",212081.97024098787]
[null,"Large systems"]
["pilot_cost_large_cl","GAC",69717.429975702486]
[null,"AA",69717.429975702486]
[null,"AAFS-50",69717.429975702486]
[null,"G2",69717.429975702486]
[null,"SORB33",69717.429975702486]
[null,"GFH",69717.429975702486]
[null,"GF",69717.429975702486]
[null,"AX",69717.429975702486]
[null,"CX",69717.429975702486]
[null,"Lime",600.08180869565217]
[null,"RO",132874.78909204234]
[null,"NF",132874.78909204234]
[null,"EDR",137077.38620505284]
[null,"PLPM",205079.6531157617]
[null,"SLPM",205079.6531157617]
[null,"confilt",135469.17306912655]
[null,"dirfilt",135469.17306912655]
[null,"UV",38548.26694225258]
[null,"PTA",0]
[null,"MSBA",69861.049767324992]
[null,"Tray Aeration",69861.049767324992]
[null,"Diffuse Aeration",67623.98592800941]
[null,"O3_PX",4465.4121388815265]
[null,"O3_D",40836.142363691913]
[null,"RCF for Cr(VI) Removal",200075.17669549288]
[null,"BIO",347912.58680744353]
[]
[]
[null,"Pilot Studies"]
["ECI","Pilot study costs"]
[4,"Small systems"]
[null,"Model ","Total (current yr $)"]
["pilot_cost_small","GAC",15572.823955072055]
[null,"AA",15572.823955072055]
[null,"AAFS-50",15572.823955072055]
[null,"G2",15572.823955072055]
[null,"SORB33",15572.823955072055]
[null,"GFH",15572.823955072055]
[null,"GF",15572.823955072055]
[null,"AX",15572.823955072055]
[null,"CX",15572.823955072055]
[null,"Lime",600.08180869565217]
[null,"RO",1329.9758360248447]
[null,"NF",1329.9758360248447]
[null,"EDR",861.26992795031049]
[null,"PLPM",55766.146054318531]
[null,"SLPM",55766.146054318531]
[null,"confilt",2613.984054423036]
[null,"dirfilt",2613.984054423036]
[null,"UV",0]
[null,"PTA",0]
[null,"MSBA",15855.11024876718]
[null,"Tray Aeration",15855.11024876718]
[null,"Diffuse Aeration",14524.034514344819]
[null,"O3_PX",2232.7060694407633]
[null,"O3_D",27594.090314029738]
[null,"RCF for Cr(VI) Removal",4924.208725406329]
[null,"BIO",132668.5186518738]
[null,"Medium systems"]
["pilot_cost_medium_cl","GAC",69717.429975702486]
[null,"AA",69717.429975702486]
[null,"AAFS-50",69717.429975702486]
[null,"G2",69717.429975702486]
[null,"SORB33",69717.429975702486]
[null,"GFH",69717.429975702486]
[null,"GF",69717.429975702486]
[null,"AX",69717.429975702486]
[null,"CX",69717.429975702486]
[null,"Lime",600.08180869565217]
[null,"RO",64003.819048107347]
[null,"NF",64003.819048107347]
[null,"EDR",65033.728720497835]
[null,"PLPM",99841.718513606014]
[null,"SLPM",99841.718513606014]
[null,"confilt",74488.011817506456]
[null,"dirfilt",74488.011817506456]
[null,"UV",19609.232766838373]
[null,"PTA",0]
[null,"MSBA",36377.315705213186]
[null,"Tray Aeration",36377.315705213186]
[null,"Diffuse Aeration",34140.251865897611]
[null,"O3_PX",3349.0591041611456]
[null,"O3_D",40836.142363691913]
[null,"RCF for Cr(VI) Removal",170289.71903937656]
[null,"BIO",212081.97024098787]
[]
[]
[null,"Pilot Studies"]
["ECI","Pilot study costs"]
[4,"Small systems"]
[null,"Model ","Total (current yr $)"]
["pilot_cost_small_cl","GAC",15572.823955072055]
[null,"AA",15572.823955072055]
[null,"AAFS-50",15572.823955072055]
[null,"G2",15572.823955072055]
[null,"SORB33",15572.823955072055]
[null,"GFH",15572.823955072055]
[null,"GF",15572.823955072055]
[null,"AX",15572.823955072055]
[null,"CX",15572.823955072055]
[null,"Lime",600.08180869565217]
[null,"RO",1329.9758360248447]
[null,"NF",1329.9758360248447]
[null,"EDR",861.26992795031049]
[null,"PLPM",55766.146054318531]
[null,"SLPM",55766.146054318531]
[null,"confilt",2613.984054423036]
[null,"dirfilt",2613.984054423036]
[null,"UV",0]
[null,"PTA",0]
[null,"MSBA",15855.11024876718]
[null,"Tray Aeration",15855.11024876718]
[null,"Diffuse Aeration",14524.034514344819]
[null,"O3_PX",2232.7060694407633]
[null,"O3_D",27594.090314029738]
[null,"RCF for Cr(VI) Removal",4924.208725406329]
[null,"BIO",132668.5186518738]
[]
[]
[null,"POTW discharge base rate (average)","POTW_base_cost_avg_cl",15.660922468236553,"/month"]
[]
[]
[null,"POTW discharge base rate (typical)","POTW_base_cost_typ_cl",17.618537776766122,"/month"]
[]
[]
[null,"POTW discharge TSS rate (average)","POTW_TSS_cost_avg_cl",0.24067976379657613,"/lb over limit"]
[]
[]
[null,"POTW discharge TSS rate (typical)","POTW_TSS_cost_typ_cl",0.41612856357351946,"/lb over limit"]
[]
[]
[null,"POTW discharge volume rate (average)","POTW_vol_cost_avg_cl",4.418734203989966,"/1,000 gallons"]
[]
[]
[null,"POTW discharge volume rate (typical)","POTW_vol_cost_typ_cl",4.5506367175419058,"/1,000 gallons"]
[]
[]
[null,"Radioactive waste annual fee","rad_annual_fee_cl",1618.8271655284022,"/year"]
[]
[]
[null,"Radioactive waste disposal","rad_disposal_cost_cl",5255.7957047867203,"/ton"]
[]
[]
[null,"Radioactive waste minimum charge per shipment","rad_trans_min_cost_cl",3132.433195825839,"/shipment"]
[]
[]
[null,"Radioactive waste transportation","rad_transportation_cost_cl",0.27006758042614443,"/ton-mile"]
[]
[]
["RMP_cost_cl","Risk Management Plan",1788.7592989264112,1700]
[]
[]
[null,"Storm Water Permit Costs"]
[null,"Land area (acres)","Permit Cost (inf. adj.)"]
["SW_permit_cost_cl",0,0]
[null,1,2314.8649750812383]
[null,5,2420.0861103122033]

{"sheet":"Engineering Data","index":21,"n_rows":331,"n_cols":8,"rows_kept":331,"cut":false,"hidden":false,"merged":[]}
["Engineering Data"]
["This sheet is used internally and contains engineering reference and indirect cost data extracted from the central cost database"]
[]
["Architectural Fee"]
["Building cost lookup","Corresponds to the range","Architectural fee"]
[0,"<$250,000",0.09]
[250000,"$250,000 to $500,000",0.08]
[500000,"$500,000 to $1,000,000",7.0000000000000007E-2]
[1000000,"$1,000,000 to $5,000,000",6.2E-2]
[5000000,"$5,000,000 to $10,000,000",5.2999999999999999E-2]
[10000000,"$10,000,000 to $50,000,000",4.9000000000000002E-2]
[50000000,">$50,000,000",4.4999999999999998E-2]
[]
[]
["Cartridge Filter Dimensions (for 5 micron filters for RO/NF)",null,null,null,null,null,null,"Based on Parker Hannifin and Harmsco filter housings."]
["Flow needed (mgd)","Flow selected (mgd)","Length (in)","Width (in)","Length (ft)","Width (ft)","# elements"]
[0,0.05,15,15,1.25,1.25,1]
[5.0999999999999997E-2,0.1,15,15,1.25,1.25,1]
[0.10100000000000001,0.2,18,18,1.5,1.5,1]
[0.20100000000000001,0.5,25,25,2.0833333333333335,2.0833333333333335,3]
[0.501,1,32,32,2.6666666666666665,2.6666666666666665,5]
[1.0009999999999999,2,42,42,3.5,3.5,8]
[2.0009999999999999,5,92.95,22,7.7458333333333336,1.8333333333333333,20]
[]
[]
["Chemical Price Break Points"]
["Chemical","Quantity Breakpoint","Units"]
["Calcium Hydroxide (Lime) - Large Qty",50000,"lbs","Large Qty price is for bulk truckload of 50,000 lbs"]
["Calcium Hydroxide (Lime) - Mid Qty",500,"lbs","Mid Qty price is for 200x 50 lb bags per year; assume breakpoint occurs at monthly purchase of 10x 50 lb bags (120 per year) (approximate midpoint between mid and small qtys)"]
["Calcium Hydroxide (Lime) - Small Qty",0,"lbs"]
["Calcium Hypochlorite - Large Qty",2000,"lbs","Large Qty price is for 100x 100 lb bags per year; assume breakpoint occurs at monthly purchase of 5x 100 lb bags (60 per year) (approximate midpoint between large and mid qtys)"]
["Calcium Hypochlorite - Mid Qty",500,"lbs","Mid Qty price is for 52x 100 lb bags per year; assume breakpoint occurs at monthly purchase of 2x 100 lb bags (24 per year) (approximate midpoint between mid and small qtys)"]
["Calcium Hypochlorite - Small Qty",0,"lbs"]
["Ferric Chloride - Large Qty",29625,"lbs","Large Qty price is for 30,000 gal annually (2,500 gal/month); assume 11.85 lbs/gal, consistent with 40% solution"]
["Ferric Chloride - Mid Qty",2607,"lbs","Mid Qty price is for 4+ 55 gal drums; assume 11.85 lbs/gal, consistent with 40% solution"]
["Ferric Chloride - Small Qty",0,"lbs"]
["Ferric Sulfate - Large Qty",19380,"lbs","Large Qty price is for bulk truckloads of 4,500 gal; assume 9.69 lbs/gal of solution at 19% FeSO4  and that breakpoint occurs at a bulk truckload of 2,000 gal"]
["Ferric Sulfate - Mid Qty",200,"lbs","Mid Qty price is for 4+ 50 lb containers"]
["Ferric Sulfate - Small Qty",0,"lbs"]
["Phosphoric Acid - Large Qty",44000,"lbs","Large Qty price is for bulk truck deliveries in minimum quantities of 44,000 to 48,000 lbs"]
["Phosphoric Acid - Mid Qty",44000,"lbs","Uses same value as large qty because no intermediate price break exists"]
["Phosphoric Acid - Small Qty",0,"lbs"]
["Phosphoric Acid 75% - Large Qty",44000,"lbs","Large Qty price is for bulk truck deliveries in minimum quantities of 44,000 to 48,000 lbs"]
["Phosphoric Acid 75% - Mid Qty",44000,"lbs","Uses same value as large qty because no intermediate price break exists"]
["Phosphoric Acid 75% - Small Qty",0,"lbs"]
["Phosphoric Acid 36% - Large Qty",44000,"lbs","Large Qty price is for bulk truck deliveries in minimum quantities of 44,000 to 48,000 lbs"]
["Phosphoric Acid 36% - Mid Qty",44000,"lbs","Uses same value as large qty because no intermediate price break exists"]
["Phosphoric Acid 36% - Small Qty",0,"lbs"]
["Polyaluminum Chloride - Large Qty",19800,"lbs","Large Qty price is for 104,000 gal per year (8,667 gal per month); assume 9.9 lbs/gal and that breakpoint occurs at a bulk truckload of 2,000 gal"]
["Polyaluminum Chloride - Mid Qty",5445,"lbs","Mid Qty prices are for 74,250 to 182,000 lbs per year (6,188 to 15,167 lbs per month); assume 9.9 lbs/gal and that breakpoint occurs at monthly purchas of 10x 55 gal drums (120 per year)"]
["Polyaluminum Chloride - Small Qty",0,"lbs"]
["Polymers - Large Qty",450,"lbs","Large Qty price is for puchases in 450 lb drums"]
["Polymers - Mid Qty",450,"lbs","Uses same value as large qty because no intermediate price break exists"]
["Polymers - Small Qty",0,"lbs"]
["Potassium Permanganate - Large Qty",650,"lbs","Mid Qty price is for 12,000 to 15,300 lbs per year (1,000 to 1,275 lbs per month); assume breakpoint occurs at 650 lb shipment (approximate midpoint between large and mid qtys)"]
["Potassium Permanganate - Mid Qty",100,"lbs","Mid Qty price is for 2,420 to 3,700 lbs per year (202 to 308 lbs per month); assume breakpoint occurs at 100 lb shipment (approximate midpoint between mid and small qtys)"]
["Potassium Permanganate - Small Qty",0,"lbs"]
["Sodium Chloride - Large Qty",3500,"lbs","Large Qty price is for 69,600 lbs per year (5,800 lbs per month); assume breakpoint occurs at 3,500 lbs (approximate midpoint between large and small qtys)"]
["Sodium Chloride - Mid Qty",3500,"lbs","Uses same value as large qty because no intermediate price break exists"]
["Sodium Chloride - Small Qty",0,"lbs"]
["Sodium Hydroxide - Large Qty",25228.5,"lbs","Large Qty price is for 80 tons per year as NaOH in bulk truckloads (converts to 317,140 lbs of bulk solution per year = 26,428 lbs of bulk solution per month); assume breakpoint occurs at bulk truckload of 2,000 gal"]
["Sodium Hydroxide - Mid Qty",12751.75,"lbs","Mid Qty price is for less than bulk truckload; assume breakpoint occurs at midpoint between large and small qtys"]
["Sodium Hydroxide - Small Qty",0,"lbs"]
["Sodium Hydroxide 50% - Large Qty",25228.5,"lbs","Large Qty price is for 80 tons per year as NaOH in bulk truckloads (converts to 317,140 lbs of bulk solution per year = 26,428 lbs of bulk solution per month); assume breakpoint occurs at bulk truckload of 2,000 gal"]
["Sodium Hydroxide 50% - Mid Qty",12751.75,"lbs","Mid Qty price is for less than bulk truckload; assume breakpoint occurs at midpoint between large and small qtys"]
["Sodium Hydroxide 50% - Small Qty",0,"lbs"]
["Sodium Hydroxide 25% - Large Qty",21317.039999999997,"lbs","Large Qty price is for 118 tons per year as NaOH in bulk truckloads; assume breakpoint occurs at bulk truckload of 2,000 gal"]
["Sodium Hydroxide 25% - Mid Qty",10796.019999999999,"lbs","Mid Qty price is for less than bulk truckload; assume breakpoint occurs at midpoint between large and small qtys"]
["Sodium Hydroxide 25% - Small Qty",0,"lbs"]
["Sodium Hypochlorite - Large Qty",165,"gal","Large Qty price is for 2,310 to 5,300 gal per year (7x 330 gal containers to 100x 53 gal drums); assume breakpoint occurs at monthly purchase of 3x 55 gal drums (1,980 gal per year) (approximate midpoint between large and small qtys)"]
["Sodium Hypochlorite - Mid Qty",165,"gal","Uses same value as large qty because no intermediate price break exists"]
["Sodium Hypochlorite - Small Qty",0,"gal"]
["Sulfuric Acid - Large Qty",28427.723999999998,"lbs","Large Qty price is for bulk delivery of 2,900 gal (converts to 41,220 lbs of bulk solution); assume breakpoint occurs at bulk truckload of 2,000 gal"]
["Sulfuric Acid - Mid Qty",28427.723999999998,"lbs","Uses same value as large qty because no intermediate price break exists"]
["Sulfuric Acid - Small Qty",0,"lbs"]
["Tetrasodium Polyphosphate - Large Qty",99.18,"lbs","Large Qty price is for 45 kg bulk container"]
["Tetrasodium Polyphosphate - Mid Qty",99.18,"lbs","Uses same value as large qty because no intermediate price break exists"]
["Tetrasodium Polyphosphate - Small Qty",0,"lbs"]
["Zinc Orthophosphate - Large Qty",2000,"gal","Large Qty price is for bulk delivery of 844,000 lbs per year in typical order of 41,000 lbs (3,130 gal assuming bulk density 13.1 lbs/gal consistent with 36% as PO4); assume breakpoint occurs at bulk truckload of 2,000 gal"]
["Zinc Orthophosphate - Mid Qty",300,"gal","Mid Qty price is for 200x 30 gal drums per year (500 gal/month); assume breakpont occurs at 300 gal per month (approximate midpoint between mid and small qtys)"]
["Zinc Orthophosphate - Small Qty",0,"gal"]
[]
[]
["Construction Management Fee"]
["Building cost lookup","Corresponds to the range","Construction management fee"]
[0,"<$100,000",0.1]
[100000,"$100,000 to $250,000",0.09]
[250000,"$250,000 to $1,000,000",0.06]
[1000000,"$1,000,000 to $5,000,000",0.05]
[5000000,"$5,000,000 to $10,000,000",0.04]
[10000000,">$10,000,000",3.2000000000000001E-2]
[]
[]
["Contingency Factors"]
["Project direct cost","Corresponds to the range","Default contingency (prior to application of technology complexity factor)"]
[0,"<$500,000",6.7000000000000004E-2]
[500000,"$500,000 to $3,000,000",5.8000000000000003E-2]
[3000000,"$3,000,000 to $15,000,000",4.9000000000000002E-2]
[15000000,"$15,000,000 to $50,000,000",4.1000000000000002E-2]
[50000000,"$50,000,000 to $100,000,000",3.2000000000000001E-2]
[100000000,">$100,000,000",5.8000000000000003E-2]
[]
[]
["Eductor Size Selection"]
["Transfer Rate (GPM)","Diameter (inch)"]
[0,1.5]
[6.95,2]
[13.1,2.5]
[22.2,3]
[33,4]
[39.200000000000003,6]
[53.5,8]
[]
[]
["HCl Properties"]
["Percent HCL","Specific Gravity","Concentration (lbs/cubic ft)","Concentration (lbs/gallon)"]
[0.01,1.0032000000000001,0.62629999999999997,8.3699999999999997E-2]
[0.02,1.0082,1.2589999999999999,0.16800000000000001]
[0.04,1.0181,2.5419999999999998,0.33989999999999998]
[0.06,1.0279,3.85,0.51470000000000005]
[0.08,1.0376000000000001,5.1820000000000004,0.69269999999999998]
[0.1,1.0474000000000001,6.5890000000000004,0.87409999999999999]
[0.12,1.0573999999999999,7.9210000000000003,1.0589999999999999]
[0.14000000000000001,1.0674999999999999,9.33,1.2470000000000001]
[0.16,1.0775999999999999,10.76,1.4390000000000001]
[0.18,1.0878000000000001,12.22,1.6339999999999999]
[0.2,1.0980000000000001,13.71,1.883]
[0.22,1.1083000000000001,15.22,2.0350000000000001]
[0.24,1.1187,16.760000000000002,2.2410000000000001]
[0.26,1.129,18.32,2.4500000000000002]
[0.28000000000000003,1.1392,19.91,2.6619999999999999]
[0.3,1.1493,21.52,2.8769999999999998]
[0.32,1.1593,23.16,3.0960000000000001]
[0.34,1.1691,24.81,3.3170000000000002]
[0.36,1.1789000000000001,26.49,3.5419999999999998]
[0.38,1.1884999999999999,28.19,3.7690000000000001]
[0.4,1.198,29.92,3.9990000000000001]
[]
[]
["Maximum cooling capacity for heat pump","hp_max_cool_cl",50,"tons"]
[]
[]
["Maximum heating capacity for heat pump","hp_max_heat_cl",200,"MBH"]
[]
[]
["Maximum cooling capacity","max_cool_cl",113.32,"tons"]
[]
[]
["Maximum heating capacity","max_heat_cl",6148,"MBH"]
[]
[]
["Maximum diameter in table","max_vessel_diam_cl",14,"ft"]
[]
[]
["Minimum diameter in table","min_vessel_diam_cl",1.5,"ft"]
[]
[]
["NaOH Properties"]
["Percent NaOH","Concentration (lbs/gallon)","Concentration (g/L)","Specific Gravity"]
[0.02,0.1704,20.41,1.0209999999999999]
[0.04,0.34810000000000002,41.71,1.0429999999999999]
[0.06,0.53320000000000001,63.89,1.0649999999999999]
[0.08,0.72560000000000002,86.95,1.087]
[0.1,0.9254,110.9,1.109]
[0.12,1.133,135.69999999999999,1.131]
[0.14000000000000001,1.347,161.4,1.153]
[0.16,1.569,188,1.175]
[0.18,1.798,215.5,1.1970000000000001]
[0.2,2.0350000000000001,243.8,1.2190000000000001]
[0.22,2.2789999999999999,273,1.2410000000000001]
[0.24,2.5289999999999999,303.10000000000002,1.2629999999999999]
[0.25,2.66,318.7,1.278]
[0.26,2.7879999999999998,334,1.2849999999999999]
[0.28000000000000003,3.0529999999999999,365.8,1.306]
[0.3,3.3239999999999998,398.4,1.3280000000000001]
[0.32,3.6019999999999999,431.7,1.349]
[0.34,3.8860000000000001,465.7,1.37]
[0.36,4.1760000000000002,500.4,1.39]
[0.38,4.4720000000000004,535.79999999999995,1.41]
[0.4,4.7729999999999997,572,1.34]
[0.42,5.08,608.70000000000005,1.4490000000000001]
[0.44,5.3920000000000003,646.1,1.468]
[0.46,5.7089999999999996,684.2,1.4870000000000001]
[0.48,6.0350000000000001,723.1,1.506]
[0.5,6.3639999999999999,762.7,1.5249999999999999]
[]
[]
["Performance Bond"]
["Direct cost lookup","Corresponds to the range","Base cost","Plus fraction","Of amount over"]
[0,"<$100,000",0,2.5000000000000001E-2,0]
[100000,"$100,000 to $500,000",2500,1.4999999999999999E-2,100000]
[500000,"$500,000 to $2,500,000",8500,0.01,500000]
[2500000,"$2,500,000 to $5,000,000",28500,7.4999999999999997E-3,2500000]
[5000000,"$5,000,000 to $7,500,000",47250,7.0000000000000001E-3,5000000]
[7500000,">$7,500,000",64750,6.0000000000000001E-3,7500000]
[]
[]
["Pipe Size Selection"]
["Pipe Flow to Pipe Diameter"]
["Flow (GPM)","Diameter (inch)"]
[0,0.5]
[2.1,0.75]
[4.0999999999999996,1]
[7.1,1.5]
[21.1,2]
[41.1,2.5]
[66.099999999999994,3]
[116.1,4]
[238.1,6]
[697.1,8]
[1435.1,10]
[2608.1,12]
[4132.1000000000004,14]
[5299.1,16]
[7528.1,18]
[10265.1,20]
[13643.1,24]
[22174.1,30]
[50561.1,36]
[81777.100000000006,42]
[122025.1,48]
[]
[]
["Pump Dimensions (for centrifugal pumps)"]
["Pump Rating Needed (gpm)","Pump Rating Selected (gpm)","Length (ft)","Width (ft)"]
[0,350,2.5,2.5]
[351,1740,3.75,3.75]
[1741,7000,5,5]
[7001,35000,7.083333333333333,7.083333333333333]
[]
[]
["Salt Saturator Dimensions"]
["Size Needed (tons)","Size Selected (tons)","Diameter (ft)"]
[0,16,8]
[16.100000000000001,25,10]
[25.1,40,11.5]
[40.1,70,12]
[]
[]
["WBS Tech Name","TDB Link","TDB Technology Category"]
["Adsorb","https://iaspub.epa.gov/tdb/pages/treatment/treatmentOverview.do?treatmentProcessId=1176996650","Adsorptive Media"]
["MSBA","https://iaspub.epa.gov/tdb/pages/treatment/treatmentOverview.do?treatmentProcessId=-346223903","Aeration and Air Stripping"]
["PTA","https://iaspub.epa.gov/tdb/pages/treatment/treatmentOverview.do?treatmentProcessId=-346223903","Aeration and Air Stripping"]
["Diffuse Aeration","https://iaspub.epa.gov/tdb/pages/treatment/treatmentOverview.do?treatmentProcessId=-346223903","Aeration and Air Stripping"]
["Tray Aeration","https://iaspub.epa.gov/tdb/pages/treatment/treatmentOverview.do?treatmentProcessId=-346223903","Aeration and Air Stripping"]
["Spray Aeration","https://iaspub.epa.gov/tdb/pages/treatment/treatmentOverview.do?treatmentProcessId=-346223903","Aeration and Air Stripping"]
["BAF","https://iaspub.epa.gov/tdb/pages/treatment/treatmentOverview.do?treatmentProcessId=1174340674","Biological Filtration"]
["BIO","https://iaspub.epa.gov/tdb/pages/treatment/treatmentOverview.do?treatmentProcessId=10000","Biological Treatment"]
["None","https://iaspub.epa.gov/tdb/pages/treatment/treatmentOverview.do?treatmentProcessId=1181590563","Chemical Treatment"]
["Chloramine (Ammonia Feed)","https://iaspub.epa.gov/tdb/pages/treatment/treatmentOverview.do?treatmentProcessId=-30174904","Chloramine"]
["Chlorine Gas","https://iaspub.epa.gov/tdb/pages/treatment/treatmentOverview.do?treatmentProcessId=-1118142891","Chlorine"]
["Hypochlorite","https://iaspub.epa.gov/tdb/pages/treatment/treatmentOverview.do?treatmentProcessId=-1118142891","Chlorine"]
["Chlorine Dioxide","https://iaspub.epa.gov/tdb/pages/treatment/treatmentOverview.do?treatmentProcessId=-1277754943","Chlorine Dioxide"]
["Confilt","https://iaspub.epa.gov/tdb/pages/treatment/treatmentOverview.do?treatmentProcessId=1934681921","Conventional Treatment"]
["RCF for Cr(VI) Removal","https://iaspub.epa.gov/tdb/pages/treatment/treatmentOverview.do?treatmentProcessId=1934681921","Conventional Treatment"]
["None","https://iaspub.epa.gov/tdb/pages/treatment/treatmentOverview.do?treatmentProcessId=1942020127","Diatomaceous Earth Filtration"]
["Dirfilt","https://iaspub.epa.gov/tdb/pages/treatment/treatmentOverview.do?treatmentProcessId=1667135053","Direct Filtration"]
["GAC Isotherm","https://iaspub.epa.gov/tdb/pages/treatment/treatmentOverview.do?treatmentProcessId=-979193564","GAC Isotherm"]
["GAC","https://iaspub.epa.gov/tdb/pages/treatment/treatmentOverview.do?treatmentProcessId=2074826383","Granular Activated Carbon"]
["None","https://iaspub.epa.gov/tdb/pages/treatment/treatmentOverview.do?treatmentProcessId=-1234021623","Hydrogen Peroxide"]
["AX","https://iaspub.epa.gov/tdb/pages/treatment/treatmentOverview.do?treatmentProcessId=263654386","Ion Exchange"]
["CX","https://iaspub.epa.gov/tdb/pages/treatment/treatmentOverview.do?treatmentProcessId=263654386","Ion Exchange"]
["GF","https://iaspub.epa.gov/tdb/pages/treatment/treatmentOverview.do?treatmentProcessId=263654386","Ion Exchange"]
["MIEX","https://iaspub.epa.gov/tdb/pages/treatment/treatmentOverview.do?treatmentProcessId=263654386","Ion Exchange"]
["WBA Exchange System for Cr","https://iaspub.epa.gov/tdb/pages/treatment/treatmentOverview.do?treatmentProcessId=263654386","Ion Exchange"]
["lpmem","https://iaspub.epa.gov/tdb/pages/treatment/treatmentOverview.do?treatmentProcessId=510273414","Membrane Filtration"]
["RONF","https://iaspub.epa.gov/tdb/pages/treatment/treatmentOverview.do?treatmentProcessId=-2103528007","Membrane Separation"]
["EDR","https://iaspub.epa.gov/tdb/pages/treatment/treatmentOverview.do?treatmentProcessId=-2103528007","Membrane Separation"]
["None","https://iaspub.epa.gov/tdb/pages/treatment/treatmentOverview.do?treatmentProcessId=2088586280","Other Treatment"]
["OZONE","https://iaspub.epa.gov/tdb/pages/treatment/treatmentOverview.do?treatmentProcessId=-1467636837","Ozone"]
["None","https://iaspub.epa.gov/tdb/pages/treatment/treatmentOverview.do?treatmentProcessId=372675748","Ozone + Hydrogen Peroxide"]
["Permanganate","https://iaspub.epa.gov/tdb/pages/treatment/treatmentOverview.do?treatmentProcessId=-1644188630","Permanganate"]
["PAC","https://iaspub.epa.gov/tdb/pages/treatment/treatmentOverview.do?treatmentProcessId=2109700949","Powdered Activated Carbon"]
["Lime Softening","https://iaspub.epa.gov/tdb/pages/treatment/treatmentOverview.do?treatmentProcessId=-2062922688","Precipitative Softening"]
["None","https://iaspub.epa.gov/tdb/pages/treatment/treatmentOverview.do?treatmentProcessId=548212009","Pressure Filtration"]
["None","https://iaspub.epa.gov/tdb/pages/treatment/treatmentOverview.do?treatmentProcessId=-1306063973","Slow Sand Filtration"]
["UV","https://iaspub.epa.gov/tdb/pages/treatment/treatmentOverview.do?treatmentProcessId=-2054608628","Ultraviolet Irradiation"]
["UVH2O2","https://iaspub.epa.gov/tdb/pages/treatment/treatmentOverview.do?treatmentProcessId=-300168699","Ultraviolet Irradiation + Hydrogen Peroxide"]
["None","https://iaspub.epa.gov/tdb/pages/treatment/treatmentOverview.do?treatmentProcessId=-1861125809","Ultraviolet Irradiation + Ozone"]
[]
[]
["Thrust Blocks for Yard Piping"]
["Pipe Diameter (inches)"," Thrust Force","Based on 90 degree angles"]
["Size Needed","kg","Size Selected"]
[0,347.63563037472028,2]
[2.1,681.91181843044774,3]
[3.1,1260.0087440508869,4]
[4.0999999999999996,2835.0196741144964,6]
[6.1,4990.7439767005962,8]
[8.1,7813.4106239126322,10]
[10.1,11192.326806056015,12]
[12.1,15314.284822868764,14]
[14.1,20002.331197216343,16]
[16.100000000000001,25315.450421476933,18]
[18.100000000000001,31130.717767160371,20]
[20.100000000000001,45064.326572600447,24]
[24.1,61050.596681665913,28]
[28.1,70505.385478216151,30]
[30.1,124768.59941751491,40]
[40.1,137828.56340581886,42]
[42.1,180257.30629040179,48]
[]
[]
["Commercial Pressure Vessel Dimensions"]
["Note: Models may specify a maximum height or diameter which is smaller than those tabulated here"]
["Dimensions tabulated based on commercially available tanks from Wendland Manufacturing, Hanson Tanks, Apyron Tech, Pabst Engineering Equipment, and Able Fab, and from case study data."]
["Diameter","Min Height","Max Height"]
["ft","ft","ft"]
[1.5,3,6]
[2,3.5,7.5]
[2.5,4,9]
[3,4,10]
[3.5,4.5,10]
[4,4.5,12]
[4.5,4.5,15]
[5,4.5,15]
[5.5,4.5,15]
[6,4.5,18]
[6.5,5.5,18]
[7,5.5,18]
[7.5,6,18]
[8,6,20]
[8.5,6,20]
[9,6,20]
[9.5,6,20]
[10,6,24]
[10.5,6,24]
[11,6,24]
[11.5,6,24]
[12,6,24]
[14,6,24]

{"sheet":"Lookup Tables","index":22,"n_rows":85,"n_cols":7,"rows_kept":85,"cut":false,"hidden":false,"merged":[]}
["Lookup Tables and Input Validation"]
["This sheet is used internally to perform certain reference calculations and support input sheet data validation"]
[]
["Temperature Dependence Coefficients for Calculating Equilibrium Constants"]
["From Table 2, Trussell 1998"]
["Range names are of the form \"ax_Kx\" (e.g., a1_Kw for first temperature coefficent for the equilbrium constant for water)"]
["Reaction","Constant","a1","a2","a3","a4","a5"]
["H2O <-> OH- + H+","Kw",-6.0880000000000001,4471,null,1.7059999999999999E-2]
["H2CO3 <-> HCO3- + H+","K1",356.30900000000003,-21834.400000000001,-126.834,6.0920000000000002E-2,1685915]
["HCO3- <-> CO32- + H+","K2",107.887,-5151.8,-38.926000000000002,3.2528000000000001E-2,563713.9]
[]
["backwash_pump_valid"]
["existing pumps"]
["new pumps"]
[]
["backwash_storage_valid"]
["existing storage"]
["new storage"]
[]
["comp_level_valid"]
["low cost"]
["mid cost"]
["high cost"]
[]
["system_automation_valid"]
["manual"]
["semi-automated"]
["fully automated"]
[]
["treated_water_corr_ctrl_valid"]
["yes"]
["no"]
[]
["Special input validation lists:"]
["Regenerant Delivery Method"]
[{"$f":"IF(OR(regen_type=2,AND(regen_type=1,regen_sol=2)),\"\",\"brine mixing tanks\")","v":""}]
[{"$f":"IF(OR(regen_type=2,AND(regen_type=1,regen_sol=2)),\"\",\"salt saturator\")","v":""}]
["Spent Regenerant/Backwash Discharge"]
["surface water"]
["POTW"]
["evaporation pond"]
["hazardous waste disposal"]
["Regenerant/backwash holding"]
[{"$f":"IF(res_s2_opt>2,\"\",\"holding tank\")","v":"holding tank"}]
[{"$f":"IF(res_s2_opt>2,\"\",\"no holding tank\")","v":"no holding tank"}]
["Resin Characteristic"]
["non-hazardous"]
["hazardous"]
["radioactive"]
["radioactive hazardous"]
["Holding Characteristic"]
[{"$f":"IF(AND(res_s1_opt=2,res_s2_opt<>3),\"\",IF(res_s2_opt=4,\"\",\"non-hazardous\"))","v":""}]
[{"$f":"IF(AND(res_s1_opt=2,res_s2_opt<>3),\"\",\"hazardous\")","v":""}]
[{"$f":"IF(AND(res_s1_opt=2,res_s2_opt<>3),\"\",IF(res_s2_opt=4,\"\",\"radioactive\"))","v":""}]
[{"$f":"IF(AND(res_s1_opt=2,res_s2_opt<>3),\"\",\"radioactive hazardous\")","v":""}]
["Resin Categories"]
[1,"Strong Base Polyacrylic"]
[2,"Strong Base Polystyrenic"]
[3,"Nitrate-selective"]
[4,"Perchlorate-selective"]
[5,"Alternative Resin (user defined)"]
[]
["Discount for Bulk Cartridge Filter Purchases"]
[null,"Number purchased","Percent Discount"]
["cart_filter_discount_table",0,0]
[null,3,0.05]
[null,5,0.125]
[null,7,0.2]
[null,9,0.3]
[]
["Cartridge Filter Weight (for disposal calculations)"]
[null,"Size Needed (mgd)","Size Selected (mgd)","Weight (lbs)","For Harmsco Hurricane filters, model HUR-90 (smaller): shipping weight 7 lb, assuming water fills 25% of the volume when they're thrown away, water weight is 9 lb, total weight at disposal is 16 lb.  Model HUR-170 (larger): shipping weight 10 lb, assuming water fills 25% of the volume when they're thrown away, water weight is 14 lb, total weight at disposal is 24 lb.\n"]
["cart_wt_table",0,0.05,16]
[null,5.0999999999999997E-2,0.1,16]
[null,0.10100000000000001,0.2,16]
[null,0.20100000000000001,0.5,24]
[null,0.501,1,24]
[null,1.0009999999999999,2,24]
[null,2.0009999999999999,5,24]
[]
["TDB_link"]
[{"$f":"VLOOKUP(tech_name,TDB_link_table_cl,2,FALSE)","v":"https://iaspub.epa.gov/tdb/pages/treatment/treatmentOverview.do?treatmentProcessId=263654386"}]
["yes_no_valid"]
["yes"]
["no"]