{"text_format":"1","workbook":"xlsx","n_sheets":23,"sheets":["Title Page","Index","INPUT","OUTPUT","Critical Design Assumptions","O&M Assumptions","Indirect Assumptions","Vessel Constraints","Backwash and Regeneration","pH Adjust","Pumps Pipe Structure","Instrumentation and Control","Residuals Management","O&M","HVAC","Indirect","Standard Inputs","AutoSize","Cost Equations","Cost Coefficients","Cost Data","Engineering Data","Lookup Tables"],"not_rendered":{"charts":0,"images":0,"macros":1,"external_links":0,"defined_names":1464,"comments":14,"pivot_tables":0},"unopened":[],"bounds":{"document_bytes":16777216,"sheet_cells":100000,"rows_first":2000,"rows_last":500,"rows_between":2000,"halvings":0,"cell_chars":16384,"cell_head_chars":4096},"cells_cut":0,"cells_raw":0,"read":"whole","date_system":"1900"}

{"sheet":"Title Page","index":0,"n_rows":15,"n_cols":1,"rows_kept":15,"cut":false,"hidden":false,"merged":[]}
["U.S. EPA Office of Ground Water and Drinking Water"]
["Work Breakdown Structure (WBS) Model for Ion Exchange Treatment of Perchlorate in Drinking Water"]
["Release Date: June 30, 2019"]
["· The primary purpose of this model is to assist EPA in estimating national compliance costs."]
["· As such, the costs are intended to be representative of typical facilities."]
["· The default settings, however, do not account for all of the site-specific factors that could affect the cost of any given individual facility or project."]
["· Still, other uses of the model might be reasonable if sufficient care is taken by the user to account for site- or project-specific factors."]
["· The model results are point estimates shown to the nearest $1, but this precision is not meant to imply that the results are accurate to $1."]
{"$rows_left_out":8}
{"sheet":"Index","index":1,"n_rows":360,"n_cols":2,"rows_kept":360,"cut":false,"hidden":false,"merged":[]}
["INDEX"]
["This page provides an index to all user-adjustable inputs and assumptions.  Click on a variable name to go directly to the adjustable cells."]
[]
["User-adjustable Input or Assumption","Variable Name and Link"]
["Access space for cartridge filters","space_other_equip"]
["Access space per pump for custom designed systems","space_pumps_cust"]
["Access space per pump for pre-engineered packages","space_pumps_pre"]
["Add a redundant unit per x parallel lines","redund_freq"]
{"$rows_left_out":353}
{"sheet":"INPUT","index":2,"n_rows":82,"n_cols":7,"rows_kept":82,"cut":false,"hidden":false,"merged":[[15,4,16,5],[15,6,16,6],[64,6,64,11]]}
["ANION EXCHANGE SYSTEM DESIGN AND COSTS INPUTS FOR PERCHLORATE"]
[]
[null,null,"STEP 1"]
[null,null,"Select Resin Type",null,null,{"$f":"IF(resin_type<>5,\"\",\"For alternative resin, the buttons shown in Step 2 will enter flows only, and clear all other inputs. Advanced users can change this behavior by entering inputs on the Standard Inputs sheet\")","v":""}]
[]
[null,null,"STEP 2:",null,null,{"$f":"IF(OR('Standard Inputs'!AE9,'Standard Inputs'!AE17,'Standard Inputs'!AE25,'Standard Inputs'!AE33),\"<- Using this design\",IF(OR('Standard Inputs'!AF9,'Standard Inputs'!AF17,'Standard Inputs'!AF25,'Standard Inputs'!AF33),\"<- You modified this design\",\"\"))","v":""},"The standard design buttons are for EPA's use in estimating national costs, but other users might find them useful as a starting point. See documentation for more information"]
[null,null,"Select one of the eight standard designs at right OR select \"CLEAR FOR MANUAL ENTRY\"",null,null,{"$f":"IF(OR('Standard Inputs'!AE10,'Standard Inputs'!AE18,'Standard Inputs'!AE26,'Standard Inputs'!AE34),\"<- Using this design\",IF(OR('Standard Inputs'!AF10,'Standard Inputs'!AF18,'Standard Inputs'!AF26,'Standard Inputs'!AF34),\"<- You modified this design\",\"\"))","v":""}]
[null,null,null,null,null,{"$f":"IF(OR('Standard Inputs'!AE11,'Standard Inputs'!AE19,'Standard Inputs'!AE27,'Standard Inputs'!AE35),\"<- Using this design\",IF(OR('Standard Inputs'!AF11,'Standard Inputs'!AF19,'Standard Inputs'!AF27,'Standard Inputs'!AF35),\"<- You modified this design\",\"\"))","v":""}]
{"$rows_left_out":75}
{"sheet":"OUTPUT","index":3,"n_rows":474,"n_cols":25,"rows_kept":474,"cut":false,"hidden":false,"merged":[[28,0,30,0],[28,1,30,1],[28,2,30,3],[28,13,28,21],[28,22,29,23],[28,12,30,12],[392,8,392,11],[388,2,388,3],[28,11,30,11],[388,4,388,5],[28,4,30,5],[28,6,30,7],[28,8,30,8],[28,9,30,9],[28,10,30,10]]}
["OUTPUT SUMMARY"]
[null,"Parameter","Value","Units"]
[null,"Technology Name","AX"]
[null,"System Size Category",{"$f":"IF(design_flow<1,\"small\",\"large\")","v":"large"}]
[null,"Resin type",{"$f":"VLOOKUP(resin_type,resin_type_table,2)","v":"Perchlorate-selective"}]
[null,"Design Flow",{"$f":"design_flow","v":75.072000000000003},"MGD (excludes bypass flow)"]
[null,"Average Flow",{"$f":"average_flow","v":37.536000000000001},"MGD (excludes bypass flow)"]
[null,"# of treatment trains",{"$f":"num_treat_lines","v":13},"trains"]
{"$rows_left_out":467}
{"sheet":"Critical Design Assumptions","index":4,"n_rows":314,"n_cols":8,"rows_kept":314,"cut":false,"hidden":false,"merged":[]}
["Default Critical Design Assumptions"]
["Users may change any of the cells in the Value column; cells in gold are most important and may vary based on contaminant treated and site-specific conditions"]
[]
["Assumption","Range Name","Value","Units","Guidance"]
["Cost estimating method","curve",1,"<-- enter 1 to use cost equations, leave blank to use lookup tables for component costs","Keeping this assumption with a value of 1 is strongly recommended; the cost equations method is more appropriate for national cost estimating and will be more accurate for nearly all user-specified designs"]
["Minimum average flow as percentage of design","min_avg_flow",0.1,null,"The minimum ratio of average flow to design flow. If the ratio falls below this value, it will trigger a warning on the INPUT sheet. If this value is zero, no minimum is enforced."]
[]
["Vessel Design"]
{"$rows_left_out":307}
{"sheet":"O&M Assumptions","index":5,"n_rows":70,"n_cols":5,"rows_kept":70,"cut":false,"hidden":false,"merged":[]}
["Default O&M Assumptions"]
["Users may change any of the cells in the Value column"]
[]
["Assumption","Range Name","Value","Units","Guidance"]
["Media Disposal"]
["Alternate media disposal cost (including transportation)","alt_media_disp",{"$f":"15*2000/media_density","v":697.67441860465112},"/ton","Leave blank to use cl.xls disposal cost.  Cost shown here is for incineration of perchlorate laden media.  From Frank Boodoo, Purolite, 12/7/04."]
[]
["Materials"]
{"$rows_left_out":63}
{"sheet":"Indirect Assumptions","index":6,"n_rows":128,"n_cols":5,"rows_kept":128,"cut":false,"hidden":false,"merged":[]}
["Default Assumptions for Indirect and Add-On Costs"]
["Users may change any of the cells in the Value column"]
[]
["Assumption","Range Name","Value","Units","Guidance"]
["Concrete Pad"]
["Include concrete pad in total capital cost?","include_pad",1,"<--- enter 1 for yes, 0 for no"]
[]
["Permits"]
{"$rows_left_out":121}
{"sheet":"Vessel Constraints","index":7,"n_rows":79,"n_cols":5,"rows_kept":79,"cut":false,"hidden":false,"merged":[]}
["Vessel Constraint Calculations"]
["This sheet performs calculations to confirm that the vessel design on the Input page meets engineering constraints"]
[]
["Calculation","Range Name","Value","Units","Guidance"]
["From Inputs"]
["Design Flow","design_flow",{"$f":"IF(df_units=\"gpm\",(1-bp_pct)*design_flow_I*24*60/1000000,(1-bp_pct)*design_flow_I)","v":75.072000000000003},"MGD","From Inputs, less bypass"]
["Average Flow","average_flow",{"$f":"(1-bp_pct)*IF(af_units=\"gpm\",average_flow_I*24*60/1000000,IF(af_units=\"fraction of design flow\",average_flow_I*design_flow,average_flow_I))","v":37.536000000000001},"MGD","From Inputs, less bypass"]
["Design Flow Rate","design_flow_rate",{"$f":"design_flow*1000000/(24*60)","v":52133.333333333336},"gpm","Design flow expressed in gpm"]
{"$rows_left_out":72}
{"sheet":"Backwash and Regeneration","index":8,"n_rows":139,"n_cols":5,"rows_kept":139,"cut":false,"hidden":false,"merged":[]}
["Backwash and Regeneration Calculations"]
[]
["Calculation","Range Name","Value","Units","Guidance"]
["From Input"]
["Media regeneration or throwaway operation?","regen_type",{"$f":"IF(throwaway_I=\"regeneration\",1,2)","v":2},"<-- 1 for regeneration, 2 for throwaway"]
["Number of bed volumes before regeneration/throwaway",null,{"$f":"BV_regen","v":250000},"For reference only"]
["No backwash","no_backwash",{"$f":"IF(no_backwash_I=\"existing pumps\",1,IF(no_backwash_I=\"new pumps\",\"\",IF(ss_cat2=1,1,\"\")))","v":""},"<-- 1 = backwash using existing supply or treated water pumps, blank = include backwash pumps in costs"]
["No backwash tanks","no_back_tank",{"$f":"IF(no_back_tank_I=\"existing storage\",1,IF(no_back_tank_I=\"new storage\",\"\",IF(ss_cat2=2,\"\",1)))","v":1},"<-- 1 = backwash from existing storage or supply, blank = include backwash tanks in costs"]
{"$rows_left_out":132}
{"sheet":"pH Adjust","index":9,"n_rows":86,"n_cols":5,"rows_kept":86,"cut":false,"hidden":false,"merged":[]}
["Adjusting pH and alkalinity of finished water"]
[]
["Calculation","Range Name","Value","Units","Guidance"]
["pH Adjustment Chemistry"]
["Ionic strength (I)","I_ion_str",{"$f":"TDS_I/40000","v":5.0000000000000001E-3},"mol/L","40,000 converts TDS to ionic strength, Equation 4, Trussell 1998"]
["Temperature variance from 25 degrees centigrade","t_minus25",{"$f":"t_I-25","v":-15},"degrees C","For use in Equation S14, Trussell 1998"]
["Dielectric constant (D)","D_dielectric",{"$f":"78.54*(1-0.004579*t_minus25+0.0000119*t_minus25^2+0.000000028*t_minus25^3)","v":84.137388720000004},null,"Equation S14, Trussell 1998"]
["Temperature in degrees Kelvin","T_K",{"$f":"t_I+273","v":283},"degrees K","273 converts degrees C to degrees K"]
{"$rows_left_out":79}
{"sheet":"Pumps Pipe Structure","index":10,"n_rows":100,"n_cols":5,"rows_kept":100,"cut":false,"hidden":false,"merged":[]}
["Pumps, Piping, and Structure Calculations"]
[]
["Calculation","Range Name","Value","Units","Guidance"]
["Pump Design"]
["Flow of each booster pump","pump_rating",{"$f":"IF(lines_pump_I=\"\",IF(ss_cat2=1,0,MIN(MAX(average_flow_rate+bp_flow_rate*average_flow_rate/design_flow_rate,(design_flow_rate+bp_flow_rate)/2)*(1+pump_safety_factor),max_pump_size)),IF(lines_pump_I=0,0,(design_flow_rate+bp_flow_rate)*(1+pump_safety_factor)/lines_pump_I))","v":10000},"gpm","Includes safety factor"]
["Maximum pump size","max_pump_size",{"$f":"VLOOKUP(10^6,pump_cost_cl,1)-1","v":10000},"gpm","The largest pump size for which costs are available.  For booster pumps, will override lines per pump input, if this input results in pumps that are too large."]
["Number of booster pumps","booster_pumps",{"$f":"IF(pump_rating=0,0,ROUNDUP((design_flow_rate+bp_flow_rate)*(1+pump_safety_factor)/pump_rating,0))","v":7},"units"]
["Total booster pumps","total_booster_pumps",{"$f":"IF(booster_pumps=0,0,booster_pumps+NRD_pumps)","v":7},"units"]
{"$rows_left_out":93}
{"sheet":"Instrumentation and Control","index":11,"n_rows":80,"n_cols":5,"rows_kept":80,"cut":false,"hidden":false,"merged":[]}
["Instrumentation and Control Calculations"]
[]
["Calculation","Range Name","Value","Units","Guidance"]
["From Inputs"]
["Component level","component_level",{"$f":"IF(component_level_I=\"high cost\",2,IF(component_level_I=\"mid cost\",1,\"\"))","v":""},"blank = low cost, 1 = mid cost, 2 = high cost"]
["Manual system controls","manual",{"$f":"IF(manual_I=\"manual\",1,IF(manual_I=\"semi-automated\",2,IF(manual_I=\"fully automated\",3,IF(component_level=\"\",1,IF(component_level=2,3,CHOOSE(ss_cat2,3,3,3))))))","v":3},"1 = fully manual system, 2 = semi-automated system, 3 = fully automated system.","Based on system size and component level (see cell comment), unless user overrides on input sheet"]
[]
["Valves and Instrumentation"]
{"$rows_left_out":73}
{"sheet":"Residuals Management","index":12,"n_rows":208,"n_cols":5,"rows_kept":208,"cut":false,"hidden":false,"merged":[]}
["Residuals Management Calculations"]
[]
["Calculation","Range Name","Value","Units","Guidance"]
["From Inputs"]
["Discharge option for spent regenerant/backwash","res_s2_opt",{"$f":"IF(res_s2_opt_I=\"\",\"\",IF(res_s2_opt_I=\"surface water\",1,IF(res_s2_opt_I=\"POTW\",2,IF(res_s2_opt_I=\"evaporation pond\",3,4))))","v":2},"<-- 1 for direct discharge to surface water, 2 for discharge to POTW, 3 for evaporation pond, 4 for hazardous waste disposal"]
["Holding tank for spent regenerant/backwash","res_s1_opt",{"$f":"IF(res_s1_opt_I=\"\",\"\",IF(res_s2_opt<>3,IF(OR(res_s1_opt_I=\"holding tank\",res_s2_opt=4),1,2),\"\"))","v":2},{"$f":"IF(res_s2_opt<>3,\"<-- 1 for holding tank, 2 for no holding tank (input ignored if continuous regeneration is required)\",\"\")","v":"<-- 1 for holding tank, 2 for no holding tank (input ignored if continuous regeneration is required)"}]
["Characteristics of spent resin","media_haz",{"$f":"IF(media_haz_I=\"hazardous\",2,IF(media_haz_I=\"radioactive\",3,IF(media_haz_I=\"radioactive hazardous\",4,1)))","v":1},"<-- 1 for non-hazardous, 2 for hazardous, 3 for radioactive, 4 for radioactive hazardous"]
[{"$f":"IF(res_s2_opt=3,\"Characteristics of evaporation pond solids\",\"Characteristics of holding tank solids\")","v":"Characteristics of holding tank solids"},"solids_haz",{"$f":"IF(solids_haz_I=\"hazardous\",2,IF(solids_haz_I=\"radioactive\",3,IF(solids_haz_I=\"radioactive hazardous\",4,1)))","v":1},"<-- 1 for non-hazardous, 2 for hazardous, 3 for radioactive, 4 for radioactive hazardous"]
{"$rows_left_out":201}
{"sheet":"O&M","index":13,"n_rows":88,"n_cols":5,"rows_kept":88,"cut":false,"hidden":false,"merged":[]}
["Operation and Maintenance Calculations"]
[]
["Calculation","Range Name","Value","Units","Guidance"]
["Labor and Materials"]
["Include backwash/rinse pump maintenance?","include_back_maint",{"$f":"IF(regen_days<=7,1,IF(AND(add_backwash_freq<=7,NOT(ISBLANK(add_backwash_freq))),1,0))","v":0},"0 = exclude, 1 = include","Explicitly include labor and materials for maintenance if regeneration and/or backwash/rinse occurs weekly or more frequently"]
[]
["Maintenance materials"]
["Booster pump materials","pump_mtl",{"$f":"OUTPUT!J202*booster_pump_maintenance","v":5770.2786575601294},"/yr"]
{"$rows_left_out":81}
{"sheet":"HVAC","index":14,"n_rows":135,"n_cols":12,"rows_kept":135,"cut":false,"hidden":false,"merged":[[80,1,80,4],[89,1,89,4]]}
["Building Heating, Ventilating, and Air Conditioning Calculations"]
[]
["Calculation","Range Name","Value","Units","Guidance"]
["General information",null,null,null,"ss_cat2 is used to select ventilation requirements and building type"]
["System size","ss_cat2",{"$f":"IF(design_flow<1,1,IF(design_flow<10,2,3))","v":3},"1 indicates small system, 2 indicates medium, 3 indicates large"]
["Building height","Building_height",{"$f":"IF(tank_geom=1,comm_height_length,comm_diam)+Top_bottom_Vessel_space","v":16},"ft"]
["Buiding 1 length and width","build1_side",{"$f":"build1_fp^0.5","v":149.53260514014994},"ft"]
["Building 2 length and width","build2_side",{"$f":"build2_fp^0.5","v":61.725197448043858},"ft"]
{"$rows_left_out":128}
{"sheet":"Indirect","index":15,"n_rows":92,"n_cols":5,"rows_kept":92,"cut":false,"hidden":false,"merged":[]}
["Indirect and Add-on Cost Calculations"]
[]
["Calculation","Range Name","Value","Units","Guidance"]
["Buildings and Land"]
["Include buildings?","include_buildings",{"$f":"IF(include_buildings_I=\"no\",0,1)","v":1},"1 = yes, 0 = no"]
["Include land?","include_land",{"$f":"IF(include_land_I=\"no\",0,1)","v":1},"1 = yes, 0 = no"]
[]
["Standby Power"]
{"$rows_left_out":85}
{"sheet":"Standard Inputs","index":16,"n_rows":51,"n_cols":32,"rows_kept":51,"cut":false,"hidden":false,"merged":[[5,0,5,1],[6,30,6,31],[5,19,5,28],[5,2,5,5],[5,6,5,7],[5,8,5,13],[5,14,5,18]]}
["Standard Designs"]
["Default inputs represent typical options used to generate national average compliance costs."]
[]
[]
[]
["Design Indices",null,"System Size",null,null,null,"Regen",null,"System Configuration and Vessel Design",null,null,null,null,null,"Residuals",null,null,null,null,"Optional"]
["Resin #","Design #","Design flow (mgd)","Design Flow Units",{"$f":"IF(COUNTIF(F9:F48,\"=1\")>0,\"Average flow (mgd)\",\"\")","v":""},"Average flow units","Regen or throwaway","# bed volumes","Number of Vessels in Series","EBCT","Bed depth","Vessel geometry","Height","Diameter","Brine delivery","Holding tank for spent regenerant","Discharge option for spent regenerant","Characteristics of spent resin","Characteristics of evaporation pond or holding tank solids","# booster pumps","# redundant vessels","Treated water corrosion control","Backwash pumping","Backwash storage","System Automation","Component level","Include buildings?","Include HVAC?","Include land?",null,"Internal Use"]
[null,null,"design_flow_I","df_units","average_flow_I","af_units","throwaway_I","BV_regen","num_tanks_I","EBCT_I","bed_depth","tank_geom_I","comm_height_length","comm_diam","brine_method_I","res_s1_opt_I","res_s2_opt_I","media_haz_I","solids_haz_I","lines_pump_I","NRD_I","pH_adj","no_backwash_I","no_back_tank_I","manual_I","component_level_I","include_buildings_I","include_HVAC_I","include_land_I"]
{"$rows_left_out":44}
{"sheet":"AutoSize","index":17,"n_rows":124,"n_cols":6,"rows_kept":124,"cut":false,"hidden":false,"merged":[[0,0,0,6]]}
["This sheet is used internally by the Auto Size macro to iteratively select the lowest capital cost design meeting engineering constraints.  This sheet is used only if the Auto Size button is clicked.  Advanced users may adjust the automated sizing procedure following the guidance below."]
["Bold blue cells are copied to the input sheet"]
["Bold gold cells are inputs to the sizing procedure"]
[]
["Input Parameters"]
["design flow rate",null,{"$f":"design_flow_rate","v":52133.333333333336},"gpm"]
["vessels per line",null,{"$f":"Num_tanks","v":2}]
["EBCT per line",null,{"$f":"EBCT","v":3},"min"]
{"$rows_left_out":117}
{"sheet":"Cost Equations","index":18,"n_rows":266,"n_cols":17,"rows_kept":266,"cut":false,"hidden":false,"merged":[]}
["Cost Equations"]
["This sheet is used internally to calculate component costs using the cost equations method; see model documentation for more details on the development of cost equations"]
[]
["Component",null,"Result","Variable",null,2,3,4,5,6,7,8,9,10,11,16,17]
["Pressure Vessels","Equation Name","Result","Variable","Equation Lookup Name",2,3,4,5,6,7,8,9,10,11,16,17]
["Stainless Steel","ss_pv_eq",{"$f":"IF(OR(D6>P6,D6<Q6),\"contact vendor\",F6*D6^G6+H6*LN(D6)+I6+J6*EXP(K6*D6)+L6*D6^3+M6*D6^2+N6*D6+O6)","v":278631.6185616781},{"$f":"comm_vol_gal","v":19974.246091523906},"ss_pv_eq",{"$f":"VLOOKUP($E6,eq_table_cl,F$5,FALSE)","v":0},0,0,0,0,0,0,-6.6983999999999994E-5,14.522866852,15272.942541242999,27101,0]
["Carbon Steel - Stainless Internals","cs_pv_eq",{"$f":"IF(OR(D7>P7,D7<Q7),\"contact vendor\",F7*D7^G7+H7*LN(D7)+I7+J7*EXP(K7*D7)+L7*D7^3+M7*D7^2+N7*D7+O7)","v":191016.79735363959},{"$f":"comm_vol_gal","v":19974.246091523906},"cs_pv_eq",0,0,0,0,0,0,0,-5.0831999999999997E-5,9.8575955700000009,14399.226375742999,27101,0]
["Carbon Steel - Plastic Internals","csp_pv_eq",{"$f":"IF(OR(D8>P8,D8<Q8),\"contact vendor\",F8*D8^G8+H8*LN(D8)+I8+J8*EXP(K8*D8)+L8*D8^3+M8*D8^2+N8*D8+O8)","v":108788.34939962468},{"$f":"comm_vol_gal","v":19974.246091523906},"csp_pv_eq",0,0,0,0,0,0,4.0000000000000002E-9,-1.38219E-4,6.1268369070000004,9678.1653989080005,27101,0]
{"$rows_left_out":259}
{"sheet":"Cost Coefficients","index":19,"n_rows":67,"n_cols":17,"rows_kept":67,"cut":false,"hidden":false,"merged":[]}
["Coefficients for Component Cost Equations"]
["This sheet is used internally to calculate component costs using the cost equations method; see model documentation for more details on the development of cost equations"]
[]
[null,"Power: C1*x^C2",null,"Logarithmic: C3*Ln(x) + C4",null,"Exponential: C5*e^(C6*x)",null,"Polynomial: C7*x^3 + C8*x^2 + C9*x + C10",null,null,null,"NOTES"]
["Equation Lookup Name","C1","C2","C3","C4","C5","C6","C7","C8","C9","C10","Pct deviation of fit equation","Modified by","Last modified","Rsq of fit equation","max size used to gen curve","min size for which curve fits are valid"]
["back_pump_eq",0,0,0,0,0,0,0,-4.77083E-4,12.333908155,6801.7707008589996,0.13368713398242682,null," 8/14/2018 11:44:39 AM",0.93196883970002076,10001,0]
["bldg_hi_eq",334.86430719700002,-0.13230006499999999,0,0,0,0,0,0,0,0,3.9891100445137453E-2,null," 8/14/2018 1:31:57 PM",0.95292288207253861,200000.1,0]
["bldg_lo_eq",155.424184946,-9.6925793999999996E-2,0,0,0,0,0,0,0,0,2.5518207619233447E-2,null," 8/14/2018 1:31:19 PM",0.96714729333932081,200000.1,0]
{"$rows_left_out":60}
{"sheet":"Cost Data","index":20,"n_rows":1761,"n_cols":7,"rows_kept":1761,"cut":false,"hidden":false,"merged":[]}
["Cost Data"]
["This sheet is used internally and contains component cost data extracted from the central cost database"]
["To maintain vendor confidentiality, the central cost database itself is not provided here"]
[]
["bls118","Alarms (High/Low Pressure Alarms, Level Switch/Alarms, Low Alarms)"]
[43,null,null,"Unit Cost","Useful Life (large)","Useful Life (small)"]
["alarm_cost_cl",0,0,592.57106898296445,15,14]
[]
{"$rows_left_out":1754}
{"sheet":"Engineering Data","index":21,"n_rows":331,"n_cols":8,"rows_kept":331,"cut":false,"hidden":false,"merged":[]}
["Engineering Data"]
["This sheet is used internally and contains engineering reference and indirect cost data extracted from the central cost database"]
[]
["Architectural Fee"]
["Building cost lookup","Corresponds to the range","Architectural fee"]
[0,"<$250,000",0.09]
[250000,"$250,000 to $500,000",0.08]
[500000,"$500,000 to $1,000,000",7.0000000000000007E-2]
{"$rows_left_out":324}
{"sheet":"Lookup Tables","index":22,"n_rows":85,"n_cols":7,"rows_kept":85,"cut":false,"hidden":false,"merged":[]}
["Lookup Tables and Input Validation"]
["This sheet is used internally to perform certain reference calculations and support input sheet data validation"]
[]
["Temperature Dependence Coefficients for Calculating Equilibrium Constants"]
["From Table 2, Trussell 1998"]
["Range names are of the form \"ax_Kx\" (e.g., a1_Kw for first temperature coefficent for the equilbrium constant for water)"]
["Reaction","Constant","a1","a2","a3","a4","a5"]
["H2O <-> OH- + H+","Kw",-6.0880000000000001,4471,null,1.7059999999999999E-2]
{"$rows_left_out":77}