{"text_format":"1","workbook":"xlsx","n_sheets":18,"sheets":["Title Page","Index","INPUT","OUTPUT","Critical Design Assumptions","O&M Assumptions","Indirect Assumptions","Well Design","Pumps Pipe Structure","Instrumentation and Control","O&M","Indirect","Standard Inputs","Cost Equations","Cost Coefficients","Cost Data","Engineering Data","Lookups"],"not_rendered":{"charts":0,"images":1,"macros":1,"external_links":0,"defined_names":381,"comments":10,"pivot_tables":0},"unopened":[],"bounds":{"document_bytes":16777216,"sheet_cells":100000,"rows_first":2000,"rows_last":500,"rows_between":2000,"halvings":0,"cell_chars":16384,"cell_head_chars":4096},"cells_cut":0,"cells_raw":0,"read":"whole","date_system":"1900"}

{"sheet":"Title Page","index":0,"n_rows":15,"n_cols":1,"rows_kept":15,"cut":false,"hidden":false,"merged":[]}
["U.S. EPA Office of Ground Water and Drinking Water"]
["Work Breakdown Structure (WBS) Model for Nontreatment Options for Drinking Water Compliance"]
["Release Date: June 30, 2019"]
["· The primary purpose of this model is to assist EPA in estimating national compliance costs."]
["· As such, the costs are intended to be representative of typical facilities."]
["· The default settings, however, do not account for all of the site-specific factors that could affect the cost of any given individual facility or project."]
["· Still, other uses of the model might be reasonable if sufficient care is taken by the user to account for site- or project-specific factors."]
["· The model results are point estimates shown to the nearest $1, but this precision is not meant to imply that the results are accurate to $1."]
["· Instead, users should review all documentation, modify inputs/assumptions as appropriate to their specific purpose, and form their own informed opinions about the accuracy and suitability of the results."]
["· Use of this model requires Excel 2007 or later."]
{"$rows_left_out":6}
{"sheet":"Index","index":1,"n_rows":88,"n_cols":2,"rows_kept":88,"cut":false,"hidden":false,"merged":[]}
["INDEX"]
["This page provides an index to all user-adjustable inputs and assumptions.  Click on a variable name to go directly to the adjustable cells."]
[]
["User-adjustable Input or Assumption","Variable Name and Link"]
["Access space for pumps and PRVs","space_pumps"]
["Administrative LOE as a percent of average technical labor ","Clerical_percent"]
["Asphalt thickness","asphalt_thickness"]
["Average Flow ","average_flow_I"]
["Builder's risk insurance percentage","br_ins_pct"]
["City index","city_index"]
{"$rows_left_out":79}
{"sheet":"INPUT","index":2,"n_rows":52,"n_cols":9,"rows_kept":52,"cut":false,"hidden":false,"merged":[[13,6,14,7]]}
["NONTREATMENT SYSTEM DESIGN AND COST INPUT"]
[]
[null,null,null,null,"STEP 1"]
[null,null,null,null,"Select Design Type"]
[]
[]
[null,null,null,null,"STEP 2:",null,null,{"$f":"IF(OR('Standard Inputs'!S9,'Standard Inputs'!S14),\"<- Using this design\",IF(OR('Standard Inputs'!T9,'Standard Inputs'!T14,),\"<- You modified this design\",\"\"))","v":"<- Using this design"},"The standard design buttons are for EPA's use in estimating national costs, but other users might find them useful as a starting point. See documentation for more information"]
[null,null,null,null,"Select one of the eight standard designs at right OR select \"CLEAR FOR MANUAL ENTRY\"",null,null,{"$f":"IF(OR('Standard Inputs'!S10,'Standard Inputs'!S15),\"<- Using this design\",IF(OR('Standard Inputs'!T10,'Standard Inputs'!T15,),\"<- You modified this design\",\"\"))","v":""}]
[null,null,null,null,null,null,null,{"$f":"IF(OR('Standard Inputs'!S11,'Standard Inputs'!S16),\"<- Using this design\",IF(OR('Standard Inputs'!T11,'Standard Inputs'!T16,),\"<- You modified this design\",\"\"))","v":""}]
[null,null,null,null,null,null,null,{"$f":"IF(OR('Standard Inputs'!S12,'Standard Inputs'!S17),\"<- Using this design\",IF(OR('Standard Inputs'!T12,'Standard Inputs'!T17,),\"<- You modified this design\",\"\"))","v":""}]
{"$rows_left_out":43}
{"sheet":"OUTPUT","index":3,"n_rows":202,"n_cols":25,"rows_kept":202,"cut":false,"hidden":false,"merged":[[24,12,26,12],[24,13,24,21],[24,22,25,23],[25,13,25,15],[25,16,25,18],[25,19,25,21],[151,8,151,11],[147,2,147,3],[147,4,147,5],[24,0,26,0],[24,1,26,1],[24,2,26,3],[24,4,26,5],[24,6,26,7],[24,8,26,8],[24,9,26,9],[24,10,26,10],[24,11,26,11]]}
["OUTPUT SUMMARY"]
[null,"Parameter","Value","Units"]
[null,"OUTPUT SUMMARY"]
[null,"Technology",{"$f":"\"Non-Treatment, \"& IF(design=1,\"interconection\", \"new well\")","v":"Non-Treatment, interconection"}]
[null,"System Size Category",{"$f":"IF(design_flow<1,\"small\",\"large\")","v":"small"}]
[null,"Design Flow",{"$f":"design_flow_I","v":0.03},{"$f":"df_units","v":"MGD"}]
[null,"Average Flow",{"$f":"average_flow_I","v":7.0000000000000001E-3},{"$f":"af_units","v":"MGD"}]
[null,{"$f":"\"Distance \"&IF(design=1,\"to interconnected supply\",\"to distribution system\")","v":"Distance to interconnected supply"},{"$f":"IF(design=1,pipe_length_I,well_distance_I)","v":10000},"feet"]
[null,{"$f":"IF(design=1,\"Pressure at supply source\",\"Pump hp\")","v":"Pressure at supply source"},{"$f":"IF(design=1,buyer_pressure_I,well_pump_hp)","v":"correct pressure"}]
[null,{"$f":"IF(design=1,\"\",\"Well depth\")","v":""},{"$f":"IF(design=1,\"\",well_depth_I)","v":""},{"$f":"IF(design=1,\"\",\"feet\")","v":""}]
{"$rows_left_out":193}
{"sheet":"Critical Design Assumptions","index":4,"n_rows":57,"n_cols":7,"rows_kept":57,"cut":false,"hidden":false,"merged":[]}
["Default Critical Design Assumptions"]
["Users may change any of the cells in the Value column; cells in gold are most important and may vary based on contaminant treated and site-specific conditions"]
[]
["Assumption","Range Name","Value","Units","Guidance"]
["Cost estimating method","curve",1,"<-- enter 1 to use cost equations, leave blank to use lookup tables for component costs","Keeping this assumption with a value of 1 is strongly recommended; the cost equations method is more appropriate for national cost estimating and will be more accurate for nearly all user-specified designs"]
[]
["Minimum Pipe size","min_pipe_size",2,"in"]
["Minimum average flow as percentage of design","min_avg_flow",0.1,null,"The minimum ratio of average flow to design flow. If the ratio falls below this value, it will trigger a warning on the INPUT sheet. If this value is zero, no minimum is enforced."]
[]
["Minimum number of valves  (isolation PRV, street)","min_valves",2,"each"]
{"$rows_left_out":48}
{"sheet":"O&M Assumptions","index":5,"n_rows":21,"n_cols":5,"rows_kept":21,"cut":false,"hidden":false,"merged":[]}
["Default O&M Assumptions"]
["Users may change any of the cells in the Value column"]
[]
["Assumption","Range Name","Value","Units","Guidance"]
["Labor"]
["Mangerial LOE as a percent of average technical labor ","Manager_percent",0.1,"fraction"]
["Administrative LOE as a percent of average technical labor ","Clerical_percent",0.1,"fraction"]
[]
["Operating LOE assumptions"]
["Minutes per valve per week","uloe_valve",5,"min/week","For manual and semiautomated systems"]
{"$rows_left_out":12}
{"sheet":"Indirect Assumptions","index":6,"n_rows":64,"n_cols":5,"rows_kept":64,"cut":false,"hidden":false,"merged":[]}
["Default Assumptions for Indirect and Add-On Costs"]
["Users may change any of the cells in the Value column"]
[]
["Assumption","Range Name","Value","Units","Guidance"]
["Mobilization and Demobilization"]
["Mobilization percentage for small systems","mob_pct_small",0.05,"of direct capital cost","Typically 2-5% of the estimated construction cost.  Enter 0% to exclude."]
["Mobilization percentage for medium systems","mob_pct_medium",0.04,"of direct capital cost"]
["Mobilization percentage for large systems","mob_pct_large",0.02,"of direct capital cost"]
[]
["Architectural Fees for Treatment Building"]
{"$rows_left_out":55}
{"sheet":"Well Design","index":7,"n_rows":31,"n_cols":5,"rows_kept":31,"cut":false,"hidden":false,"merged":[]}
["Well Design Module"]
[]
["Calculation","Range Name","Value","Units","Guidance"]
["From Inputs"]
["Design Type","design",1,"1 for interconnection, 2 for new well construction "]
["Design Flow","design_flow",{"$f":"IF(df_units=\"gpm\",design_flow_I*24*60/1000000,design_flow_I)","v":0.03},"MGD"]
["Average Flow","average_flow",{"$f":"IF(af_units=\"gpm\",average_flow_I*24*60/1000000,IF(af_units=\"fraction of design flow\",average_flow_I*design_flow,average_flow_I))","v":7.0000000000000001E-3},"MGD"]
["Design Flow Rate","design_flow_rate",{"$f":"design_flow*1000000/(24*60)","v":20.833333333333332},"gpm","Design flow expressed in gpm"]
["Average Flow Rate","average_flow_rate",{"$f":"average_flow*1000000/(24*60)","v":4.8611111111111107},"gpm","Average flow expressed in gpm"]
[]
{"$rows_left_out":22}
{"sheet":"Pumps Pipe Structure","index":8,"n_rows":106,"n_cols":5,"rows_kept":106,"cut":false,"hidden":false,"merged":[]}
["Pumps, Piping, and Structure Calculations"]
[]
["Calculation","Range Name","Value","Units","Guidance"]
["Interconnection Booster Pump Design"]
["Pressure at Supply Source (from inputs)","buyer_pressure",{"$f":"IF(buyer_pressure_I=\"correct pressure\",0,IF(buyer_pressure_I=\"pressure greater than required\",1,2))","v":0},null,"0 for correct pressure, 1 for excess pressure, 2 for insufficient pressure"]
["Elevation Difference from Supply Source","elevation_head",{"$f":"elevation_diff_I","v":0},"head in feet","From Inputs, Booster pump pressure must account for this difference"]
["Hazen-Williams friction loss","HW_friction_loss",{"$f":"IF(design=2,\"\",0.2083*(100/IF(OUTPUT!L55=1,130,140))^1.852*design_flow_rate^1.852/interconnect_pipe_diameter^4.8655)","v":1.2171552199254672},"head loss in feet per 100 ft pipe"]
["Total pressure needed to overcome friction losses","friction_head",{"$f":"IF(design=2,\"\",interconnect_pipe_length/100*HW_friction_loss)","v":121.71552199254671},"head loss in feet"]
["Total head needed for booster pump","booster_additional_head",{"$f":"IF(design=2,\"\",elevation_head+friction_head)","v":121.71552199254671},"head in feet"]
["Booster pump pressure rating","booster_psi",{"$f":"IF(design=2,0,0.434*booster_additional_head)","v":52.824536544765273},"psi","0.434 converts head in feet to psi"]
{"$rows_left_out":97}
{"sheet":"Instrumentation and Control","index":9,"n_rows":28,"n_cols":5,"rows_kept":28,"cut":false,"hidden":false,"merged":[]}
["Instrumentation and Control Calculations"]
[]
["Calculation","Range Name","Value","Units","Guidance"]
["From Inputs"]
["Component level","component_level",{"$f":"IF(component_level_I=\"high cost\",2,IF(component_level_I=\"mid cost\",1,\"\"))","v":""},"blank = low cost, 1 = mid cost, 2 = high cost"]
["Manual system controls","manual",{"$f":"IF(manual_I=\"manual\",1,IF(manual_I=\"semi-automated\",2,IF(manual_I=\"fully automated\",3,IF(component_level=\"\",1,IF(component_level=2,3,CHOOSE(ss_cat2,1,3,3))))))","v":1},"1 = fully manual system, 2 = semi-automated system, 3 = fully automated system.","Based on system size and component level (see cell comment), unless user overrides on input sheet"]
[]
["Valves and Instrumentation"]
["Valve size","valve_size",{"$f":"IF(  design_flow_rate=0, 0, IF( design=2, well_pipe_diameter,interconnect_pipe_diameter))","v":2},"in"]
["Number of valves (isolation, street)","num_valves",{"$f":"IF(design= 2, 0, min_valves+  num_PRVs* valve_per_PRV  + ROUND(interconnect_pipe_length/valve_spacing,0)-1)","v":11},"units"]
{"$rows_left_out":19}
{"sheet":"O&M","index":10,"n_rows":49,"n_cols":5,"rows_kept":49,"cut":false,"hidden":false,"merged":[]}
["Operation and Maintenance Calculations"]
[]
["Calculation","Range Name","Value","Units","Guidance"]
["Labor and Materials"]
["Maintenance Materials"]
["Materials for booster pumps","pump_materials",{"$f":" IF( ISNUMBER(OUTPUT!J84), booster_pump_maintenance * OUTPUT!J84,0)","v":0},"/yr"]
["Materials for well pumps","well_pump_materials",{"$f":" IF( ISNUMBER(OUTPUT!J85), well_pump_maintenance * OUTPUT!J85,)","v":0}]
["Materials for PRVs"]
[]
["General Labor"]
{"$rows_left_out":40}
{"sheet":"Indirect","index":11,"n_rows":37,"n_cols":5,"rows_kept":37,"cut":false,"hidden":false,"merged":[]}
["Indirect and Add-on Cost Calculations"]
[]
["Calculation","Range Name","Value","Units","Guidance"]
["Buildings & Land"]
["Include buildings in total capital cost?","include_buildings",{"$f":"IF(OR(design=1,include_buildings_I=\"no\"),0,1)","v":0},"1 = yes, 0 = no"]
["Include land costs?","include_land",{"$f":"IF(OR(design=1,include_land_I=\"no\"),0,1)","v":0},"1 = yes, 0 = no"]
[]
["Standby Power"]
["Booster pumps",null,{"$f":"booster_pump_energy*design_flow/average_flow/day_per_year/24*1000","v":0},"kW"]
["Well pumps",null,{"$f":"well_pump_energy*design_flow/average_flow/day_per_year/24*1000","v":0},"kW"]
{"$rows_left_out":28}
{"sheet":"Standard Inputs","index":12,"n_rows":21,"n_cols":20,"rows_kept":21,"cut":false,"hidden":false,"merged":[[5,0,5,1],[6,18,6,19],[5,2,5,5],[5,13,5,16],[5,6,5,9],[5,11,5,12]]}
["Standard Designs"]
["Default inputs represent typical options used to generate national average compliance costs."]
[]
[]
[]
["Design Indices",null,"System Size",null,null,null,"Interconnection",null,null,null,null,"Well Inputs",null,"Optional"]
["Design Type","Design #","Design flow","Design Flow Units","Average Flow","Average flow units","Distance to Water Supply","Pressure at Supply Source","Elevation Difference from Supply Source","Cost of Purchased Water","Flow per Well","Well Depth","Distance to Distribution System","Component level","System Automation","Include Buildings?","Include Land?",null,"Internal Use"]
[null,null,"design_flow_I","df_units","average_flow_I","af_units","pipe_length_I","buyer_pressure_I","elevation_diff_I","water_cost_I","wells_I","well_depth_I","well_distance_I","component_level_I","manual_I","include_buildings_I","include_land_I"]
[1,1,0.03,"MGD",7.0000000000000001E-3,"MGD",10000,"correct pressure",0,2,null,null,null,null,null,null,null,null,{"$f":"AND(C9:Q9=inp_used,A9=inp_used_usersel)","v":true},{"$f":"AND(C9:F9=inp_used_minimal,A9=inp_used_usersel)","v":true}]
[1,2,0.124,"MGD",3.5000000000000003E-2,"MGD",10000,"correct pressure",0,2,null,null,null,null,null,null,null,null,{"$f":"AND(C10:Q10=inp_used,A10=inp_used_usersel)","v":false},{"$f":"AND(C10:F10=inp_used_minimal,A10=inp_used_usersel)","v":false}]
{"$rows_left_out":12}
{"sheet":"Cost Equations","index":13,"n_rows":80,"n_cols":17,"rows_kept":80,"cut":false,"hidden":false,"merged":[]}
["Cost Equations"]
["This sheet is used internally to calculate component costs using the cost equations method; see model documentation for more details on the development of cost equations"]
[]
["Component","Equation Name","Result","Variable","Equation Lookup Name",2,3,4,5,6,7,8,9,10,11,16,17]
["Well Items"]
["Well Casing"]
["PVC","casing_pvc_eq",{"$f":"IF(D7=0,0,IF(OR(D7>P7,D7<Q7),\"contact vendor\",F7*D7^G7+H7*LN(D7)+I7+J7*EXP(K7*D7)+L7*D7^3+M7*D7^2+N7*D7+O7))","v":0},{"$f":"casing_diam","v":0},"casing_pvc_eq",{"$f":"VLOOKUP($E7,eq_table_cl,F$4,FALSE)","v":0},0,0,0,0,0,5.7858936E-2,-1.0871604269999999,9.6162756930000004,5.8240852939999996,12.00001,0]
["Stainless Steel","casing_ss_eq",0,{"$f":"casing_diam","v":0},"casing_ss_eq",11.795355226,1.7609326249999999,0,0,0,0,0,0,0,0,12.00001,0]
["Well screen"]
["PVC Schedule 40","screen_pvc40_eq",{"$f":"IF(D10=0,0,IF(OR(D10>P10,D10<Q10),\"contact vendor\",F10*D10^G10+H10*LN(D10)+I10+J10*EXP(K10*D10)+L10*D10^3+M10*D10^2+N10*D10+O10))","v":0},{"$f":"screen_diam","v":0},"screen_pvc40_eq",{"$f":"VLOOKUP($E10,eq_table_cl,F$4,FALSE)","v":0},0,0,0,0,0,-3.2894459000000001E-2,0.38952086899999999,7.2372941969999998,13.241314249,12.00001,0]
{"$rows_left_out":71}
{"sheet":"Cost Coefficients","index":14,"n_rows":37,"n_cols":17,"rows_kept":37,"cut":false,"hidden":false,"merged":[]}
["Coefficients for Component Cost Equations"]
["This sheet is used internally to calculate component costs using the cost equations method; see model documentation for more details on the development of cost equations"]
[]
[null,"Power: C1*x^C2",null,"Logarithmic: C3*Ln(x) + C4",null,"Exponential: C5*e^(C6*x)",null,"Polynomial: C7*x^3 + C8*x^2 + C9*x + C10",null,null,null,"NOTES"]
["Equation Lookup Name","C1","C2","C3","C4","C5","C6","C7","C8","C9","C10","Pct deviation of fit equation","Modified by","Last modified","Rsq of fit equation","max size used to gen curve","min size for which curve fits are valid"]
["bldg_lo_eq",155.424184946,-9.6925793999999996E-2,0,0,0,0,0,0,0,0,2.5518207619233447E-2,null," 8/14/2018 1:31:19 PM",0.96714729333932081,200000.1,0]
["casing_pvc_eq",0,0,0,0,0,0,5.7858936E-2,-1.0871604269999999,9.6162756930000004,5.8240852939999996,5.0869679380043629E-2,null," 3/1/2019 12:52:09 PM",0.98278758939630184,12.00001,0]
["casing_ss_eq",11.795355226,1.7609326249999999,0,0,0,0,0,0,0,0,0.41539212874008191,null," 3/1/2019 12:52:44 PM",0.78887425427086044,12.00001,0]
["ci_bfv_eq_large",51.741944672999999,1.5887577429999999,0,0,0,0,0,0,0,0,6.0646037127800111E-2,null," 8/14/2018 11:18:25 AM",0.9890776861102849,48.1,14]
["ci_bfv_eq_small",0,0,0,0,0,0,-0.46051790100000001,13.155724568,123.18694075800001,30.689222062999999,4.4231092552301912E-2,null," 8/14/2018 11:17:48 AM",0.99015972795888274,12,1]
{"$rows_left_out":28}
{"sheet":"Cost Data","index":15,"n_rows":687,"n_cols":7,"rows_kept":687,"cut":false,"hidden":false,"merged":[]}
["Cost Data"]
["This sheet is used internally and contains component cost data extracted from the central cost database"]
["To maintain vendor confidentiality, the central cost database itself is not provided here"]
[]
["BCI","Asphalt Patch"]
[3,"Size needed (in thick)","Size selected (in thick)","Avg. Unit Cost (per sy)","Useful Life (large)","Useful Life (small)"]
["asphalt_patch_cost_cl",0,2,48.610079575596821,40,37]
[null,2.1,4,69.048408488063671,40,37]
[null,4.0999999999999996,6,93.353448275862078,40,37]
[null,6.1,"contact vendor","contact vendor",40,37]
{"$rows_left_out":678}
{"sheet":"Engineering Data","index":16,"n_rows":89,"n_cols":5,"rows_kept":89,"cut":false,"hidden":false,"merged":[]}
["Engineering Data"]
["This sheet is used internally and contains engineering reference and indirect cost data extracted from the central cost database"]
[]
["Architectural Fee"]
["Building cost lookup","Corresponds to the range","Architectural fee"]
[0,"<$250,000",0.09]
[250000,"$250,000 to $500,000",0.08]
[500000,"$500,000 to $1,000,000",7.0000000000000007E-2]
[1000000,"$1,000,000 to $5,000,000",6.2E-2]
[5000000,"$5,000,000 to $10,000,000",5.2999999999999999E-2]
{"$rows_left_out":80}
{"sheet":"Lookups","index":17,"n_rows":56,"n_cols":4,"rows_kept":56,"cut":false,"hidden":false,"merged":[]}
["Lookup Tables and Input Validation"]
["This sheet is used internally to perform certain reference calculations and support input sheet data validation"]
[]
["Well Pump Size Lookup"]
["pump_hp_table"]
["Horsepower Needed","Horsepower Selected","Pump Diameter (inches)"]
[0,7.5,4]
[7.6,50,6]
[51,250,8]
[]
{"$rows_left_out":46}