{"text_format":"1","workbook":"xlsx","n_sheets":8,"sheets":["Instructions","Section 1","Section 2","Summary","Reference List","Checks","Lists","OutputForCSV"],"not_rendered":{"charts":0,"images":0,"macros":1,"external_links":0,"defined_names":38,"comments":5,"pivot_tables":0},"unopened":[],"bounds":{"document_bytes":16777216,"sheet_cells":100000,"rows_first":2000,"rows_last":500,"rows_between":2000,"halvings":0,"cell_chars":16384,"cell_head_chars":4096},"cells_cut":0,"cells_raw":0,"read":"whole","date_system":"1900"}

{"sheet":"Instructions","index":0,"n_rows":21,"n_cols":3,"rows_kept":21,"cut":false,"hidden":false,"merged":[]}
[]
[null,null,"OMB Control Number: 2060-0170"]
[null,null,"Expiration Date: 4/30/2023"]
[null,null,"U.S. Environmental Protection Agency "]
[null,null,"Stratospheric Ozone Protection Program"]
[]
[null,null,"Class II Trades Report (Sec 82.23)"]
[null,null,"Version 4.1"]
[null,null,"Last Updated: July 2020"]
[]
{"$rows_left_out":12}
{"sheet":"Section 1","index":1,"n_rows":14,"n_cols":9,"rows_kept":14,"cut":false,"hidden":false,"merged":[[7,2,7,3],[2,2,2,3]]}
[]
[null,null,"U.S. Environmental Protection Agency"]
[null,null,"Class II Trades Report "]
[]
[null,null,"   Date Prepared:",{"$f":"TODAY()","v":"2020-07-15"}]
[]
[null,null,"Section 1: Transferor Identification Information "]
[null,null,"Complete all fields below.  No fields may be left blank."]
[null,null,"Company Name: ",null,null,{"$f":"IF(D9=0,1,0)","v":1}]
[null,null,"Submission Type:",null,null,{"$f":"IF(D10=0,1,0)","v":1}]
{"$rows_left_out":5}
{"sheet":"Section 2","index":2,"n_rows":234,"n_cols":25,"rows_kept":234,"cut":false,"hidden":false,"merged":[[17,12,17,14],[9,3,10,3],[9,4,10,4],[9,5,10,5],[9,6,10,6],[9,7,10,7],[9,8,10,8],[9,9,10,9],[9,10,10,10],[16,3,16,14],[17,3,18,3],[17,4,17,6],[17,10,17,11],[17,7,17,9]]}
[]
[null,null,null,"U.S. Environmental Protection Agency"]
[null,null,{"$f":"IFERROR(VLOOKUP($A3,'Section 2'!E$22:$O$31,COLUMNS('Section 2'!$D$18:D$19),0),\"\")","v":""},"Class II Trades Report "]
[]
[null,null,null,"Company Name:",{"$f":"IF('Section 1'!D9=0,\"\",'Section 1'!D9)","v":""}]
[null,null,null,"Reporting Period:",{"$f":"IF('Section 1'!D11=0,\"\",'Section 1'!D11)","v":""}]
[]
[null,null,null,"Section 2: Transaction Data"]
[null,null,null,"In the table below, enter the contact information for the recipient of the trade.  If reporting on an inter-pollutant, intra-company trade, enter your company's name as the transferee company; the other fields may be left blank. "]
[null,null,null,"Transferee Company Name","Transferee Contact Name","Transferee Contact Phone Number","Transferee Street Address","Transferee City","Transferee State/Province","Transferee Country","Transferee Postal Code"]
{"$rows_left_out":225}
{"sheet":"Summary","index":3,"n_rows":18,"n_cols":7,"rows_kept":18,"cut":false,"hidden":false,"merged":[[8,3,8,6],[9,3,10,3],[9,4,9,6],[2,3,2,6]]}
[]
[null,null,null,"U.S. Environmental Protection Agency"]
[null,null,null,"Class II Trades Report "]
[]
[null,null,null,"Company Name:",{"$f":"IF('Section 1'!D9=0,\"\",'Section 1'!D9)","v":""}]
[null,null,null,"Reporting Period:",{"$f":"IF('Section 1'!D11=0,\"\",'Section 1'!D11)","v":""}]
[]
[null,null,null,"Allowance Summary"]
[null,null,null,"The values in the table below are calculated based on data entered in Section 2.  If the totals appear to be incorrect, please return to Section 2 to review your data."]
[null,null,null,"Chemical Name","Allowances Expended by Transferor (kg)"]
{"$rows_left_out":9}
{"sheet":"Reference List","index":4,"n_rows":78,"n_cols":9,"rows_kept":78,"cut":false,"hidden":false,"merged":[[71,7,72,7],[51,8,52,8],[64,8,65,8],[16,2,16,4],[5,2,5,8],[6,6,6,8],[8,6,8,8],[6,2,6,4],[13,2,14,4],[8,2,8,3]]}
[]
[null,null,"U.S. Environmental Protection Agency"]
[null,null,"Class II Trades Report "]
[null,null,"Reference List"]
[]
[null,null,"Copying and Pasting Data: If data is pasted into this reporting form from another spreadsheet, the formatting of specific cells must be consistent with the requirements of the form in order to be accepted into EPA’s ODS tracking system. When copying and pasting data into the form, please ensure consistency with the formatting of the lists provided below."]
[null,null,"Chemical Name List: The table below lists the valid chemical names that may be used when entering data into Section 2 of this form. ",null,null,null,"Country List: The table below lists the valid country names that may be used when entering data into Section 2 of this form. "]
[]
[null,null,"Class II Chemicals with Allowances",null,null,null,"Source Country "]
[null,null,"HCFC-123","HCFC-124",null,null,"Afghanistan","Greece","Papua New Guinea"]
{"$rows_left_out":69}
{"sheet":"Checks","index":5,"n_rows":18,"n_cols":5,"rows_kept":18,"cut":false,"hidden":true,"merged":[]}
[]
[null,"Section","Check Description","Status (1 = Incomplete, 0 = Complete)","Check Type"]
[null,"Section 1","All",{"$f":"IF(SUM('Section 1'!F9:F11)>0,1,0)","v":1},"Error"]
[null,"Section 2","Complete?",{"$f":"IF(SUM('Section 2'!$U$22:$U$31,'Section 2'!$T$14:$V$14)>0,1,0)","v":0},"Stopper"]
[null,"Section 2","Transferee Company?",{"$f":"IF('Section 2'!D14:K14<>\"\",0,1)","v":1},"Stopper"]
[null,"Section 2","Valid State if USA",{"$f":"IF('Section 2'!$U$14>0,1,0)","v":0},"Stopper"]
[null,"Section 2","Valid Country",{"$f":"IF('Section 2'!$V$14>0,1,0)","v":0},"Stopper"]
[null,"Section 2","Valid Chemical",{"$f":"IF(SUM('Section 2'!V22:W31)>0, 1, 0)","v":0},"Stopper"]
[null,"Section 2","Inter-pollutant check (Baseline)",{"$f":"IF(SUM('Section 2'!$X$22:$X$31)>0,1,0)","v":0},"Stopper"]
[null,"Section 2","Negative Numbers?",{"$f":"IF(SUM('Section 2'!Y22:Y31)>0,1,0)","v":0},"Stopper"]
{"$rows_left_out":9}
{"sheet":"Lists","index":6,"n_rows":204,"n_cols":22,"rows_kept":204,"cut":false,"hidden":true,"merged":[[0,14,0,15],[0,10,0,11]]}
[null,null,null,null,null,null,null,null,null,null,"ODP Table",null,null,null,"FOR REFERENCE ONLY"]
[null,"Country List","States","Submission Type","Reporting Year","Year Range","Class II Allownace Types","Allowance Type: Current or Baseline","Allowance Type: Domestic or International","Class II Chemicals w/ Allowances","Class II Chemicals","ODP","Date for CSV Title","Form Name for CSV Title","Form Type","Form Code",null,"Incorrect Capitalizations","Correct Capitalization",null,"Invalid Character","Replacement Character"]
[null,"Afghanistan","Alaska","Original Submission",2018,{"$f":"IF(ReportYr=Lists!$E$3,DATE(Lists!$E$3,1,1),IF(ReportYr=Lists!$E$4,DATE(Lists!$E$4,1,1),IF(ReportYr=Lists!$E$5,DATE(Lists!$E$5,1,1),0)))","v":"00:00:00"},"Production","Current","Domestic","HCFC-123","HCFC-123",0.02,{"$f":"MONTH('Section 1'!D5)&\"-\"&DAY('Section 1'!D5)&\"-\"&YEAR('Section 1'!D5)","v":"7-15-2020"},"Class II Trades","Class I Producer","PROD1",null,"hcfc","HCFC",null,"À","A"]
[null,"Albania","Alabama","Re-Submittal",2019,{"$f":"IF(ReportYr=Lists!$E$3,DATE(Lists!$E$3,12,31),IF(ReportYr=Lists!$E$4,DATE(Lists!$E$4,12,31),IF(ReportYr=Lists!$E$5,DATE(Lists!$E$5,12,31),0)))","v":"00:00:00"},"Consumption","Baseline",null,"HCFC-124","HCFC-124",2.1999999999999999E-2,null,null,"MeBr Producer","PROD3",null,null,null,null,"Á","A"]
[null,"Algeria","Arkansas",null,2020,null,null,null,null,null,null,null,null,null,"Class II Producer","PROD2",null,null,null,null,"Ã","A"]
[null,"Andorra","Arizona",null,2021,null,null,null,null,null,null,null,null,null,"Class I Importer","IMPT1",null,null,null,null,"Ä","A"]
[null,"Angola","California",null,2022,null,null,null,null,null,null,null,null,null,"MeBr Importer","IMPT3",null,null,null,null,"Â","A"]
[null,"Antigua and Barbuda","Colorado",null,2023,null,null,null,null,null,null,null,null,null,"Class II Importer","IMPT2",null,null,null,null,"Å","A"]
[null,"Argentina","Connecticut",null,2024,null,null,null,null,null,null,null,null,null,"Class I Exporter","EXPT1",null,null,null,null,"È","E"]
[null,"Armenia","District of Columbia",null,2025,null,null,null,null,null,null,null,null,null,"MeBr Exporter","EXPT3",null,null,null,null,"É","E"]
{"$rows_left_out":195}
{"sheet":"OutputForCSV","index":7,"n_rows":12,"n_cols":23,"rows_kept":12,"cut":false,"hidden":true,"merged":[]}
["Entry",1,"TRAD2",4,{"$f":"'Section 1'!D5","v":"2020-07-15"},{"$f":"'Section 1'!D9","v":0},{"$f":"'Section 1'!D10","v":0},{"$f":"'Section 1'!D11","v":0},"N/A",null,null,null,null,null,null,null,null,null,null,null,null,null,"LastColumn"]
[1,{"$f":"IF(C2=\"\",\"\",2)","v":""},{"$f":"IFERROR(VLOOKUP($A2,'Section 2'!$D$22:$O$31,COLUMNS('Section 2'!$D$18:D$19),0),\"\")","v":""},{"$f":"IF(C2=\"\",\"\",'Section 2'!$D$14)","v":""},{"$f":"IF('Section 2'!$E$14=0,\"\",'Section 2'!$E$14)","v":""},{"$f":"IF('Section 2'!$F$14=0,\"\",'Section 2'!$F$14)","v":""},{"$f":"IF('Section 2'!$G$14=0,\"\",'Section 2'!$G$14)","v":""},{"$f":"IF('Section 2'!$H$14=0,\"\",'Section 2'!$H$14)","v":""},{"$f":"IF('Section 2'!$I$14=0,\"\",'Section 2'!$I$14)","v":""},{"$f":"IF('Section 2'!$J$14=0,\"\",'Section 2'!$J$14)","v":""},{"$f":"IF('Section 2'!$K$14=0,\"\",'Section 2'!$K$14)","v":""},{"$f":"IFERROR(PROPER(VLOOKUP($A2,'Section 2'!$D$22:$O$31,COLUMNS('Section 2'!$D$18:E$19),0)),\"\")","v":""},{"$f":"IFERROR(PROPER(VLOOKUP($A2,'Section 2'!$D$22:$O$31,COLUMNS('Section 2'!$D$18:F$19),0)),\"\")","v":""},{"$f":"IFERROR(PROPER(VLOOKUP($A2,'Section 2'!$D$22:$O$31,COLUMNS('Section 2'!$D$18:G$19),0)),\"\")","v":""},{"$f":"IFERROR(VLOOKUP($A2,'Section 2'!$D$22:$O$31,COLUMNS('Section 2'!$D$18:H$19),0),\"\")","v":""},{"$f":"IFERROR(VLOOKUP($A2,'Section 2'!$D$22:$O$31,COLUMNS('Section 2'!$D$18:I$19),0),\"\")","v":""},{"$f":"IFERROR(VLOOKUP($A2,'Section 2'!$D$22:$O$31,COLUMNS('Section 2'!$D$18:J$19),0),\"\")","v":""},{"$f":"IFERROR(VLOOKUP($A2,'Section 2'!$D$22:$O$31,COLUMNS('Section 2'!$D$18:K$19),0),\"\")","v":""},{"$f":"IFERROR(VLOOKUP($A2,'Section 2'!$D$22:$O$31,COLUMNS('Section 2'!$D$18:L$19),0),\"\")","v":""},{"$f":"IFERROR(VLOOKUP($A2,'Section 2'!$D$22:$O$31,COLUMNS('Section 2'!$D$18:M$19),0),\"\")","v":""},{"$f":"IFERROR(VLOOKUP($A2,'Section 2'!$D$22:$O$31,COLUMNS('Section 2'!$D$18:N$19),0),\"\")","v":""},{"$f":"IFERROR(VLOOKUP($A2,'Section 2'!$D$22:$O$31,COLUMNS('Section 2'!$D$18:O$19),0),\"\")","v":""}]
[2,{"$f":"IF(C3=\"\",\"\",2)","v":""},{"$f":"IFERROR(VLOOKUP($A3,'Section 2'!$D$22:$O$31,COLUMNS('Section 2'!$D$18:D$19),0),\"\")","v":""},{"$f":"IF(C3=\"\",\"\",'Section 2'!$D$14)","v":""},{"$f":"IF(C3=\"\",\"\",IF('Section 2'!$E$14=0,\"\",'Section 2'!$E$14))","v":""},{"$f":"IF(C3=\"\",\"\",IF('Section 2'!$F$14=0,\"\",'Section 2'!$F$14))","v":""},{"$f":"IF(C3=\"\",\"\",IF('Section 2'!$G$14=0,\"\",'Section 2'!$G$14))","v":""},{"$f":"IF(C3=\"\",\"\",IF('Section 2'!$H$14=0,\"\",'Section 2'!$H$14))","v":""},{"$f":"IF(C3=\"\",\"\",IF('Section 2'!$I$14=0,\"\",'Section 2'!$I$14))","v":""},{"$f":"IF(C3=\"\",\"\",IF('Section 2'!$J$14=0,\"\",'Section 2'!$J$14))","v":""},{"$f":"IF(C3=\"\",\"\",IF('Section 2'!$K$14=0,\"\",'Section 2'!$K$14))","v":""},{"$f":"IFERROR(PROPER(VLOOKUP($A3,'Section 2'!$D$22:$O$31,COLUMNS('Section 2'!$D$18:E$19),0)),\"\")","v":""},{"$f":"IFERROR(PROPER(VLOOKUP($A3,'Section 2'!$D$22:$O$31,COLUMNS('Section 2'!$D$18:F$19),0)),\"\")","v":""},{"$f":"IFERROR(PROPER(VLOOKUP($A3,'Section 2'!$D$22:$O$31,COLUMNS('Section 2'!$D$18:G$19),0)),\"\")","v":""},{"$f":"IFERROR(VLOOKUP($A3,'Section 2'!$D$22:$O$31,COLUMNS('Section 2'!$D$18:H$19),0),\"\")","v":""},{"$f":"IFERROR(VLOOKUP($A3,'Section 2'!$D$22:$O$31,COLUMNS('Section 2'!$D$18:I$19),0),\"\")","v":""},{"$f":"IFERROR(VLOOKUP($A3,'Section 2'!$D$22:$O$31,COLUMNS('Section 2'!$D$18:J$19),0),\"\")","v":""},{"$f":"IFERROR(VLOOKUP($A3,'Section 2'!$D$22:$O$31,COLUMNS('Section 2'!$D$18:K$19),0),\"\")","v":""},{"$f":"IFERROR(VLOOKUP($A3,'Section 2'!$D$22:$O$31,COLUMNS('Section 2'!$D$18:L$19),0),\"\")","v":""},{"$f":"IFERROR(VLOOKUP($A3,'Section 2'!$D$22:$O$31,COLUMNS('Section 2'!$D$18:M$19),0),\"\")","v":""},{"$f":"IFERROR(VLOOKUP($A3,'Section 2'!$D$22:$O$31,COLUMNS('Section 2'!$D$18:N$19),0),\"\")","v":""},{"$f":"IFERROR(VLOOKUP($A3,'Section 2'!$D$22:$O$31,COLUMNS('Section 2'!$D$18:O$19),0),\"\")","v":""}]
[3,"",{"$f":"IFERROR(VLOOKUP($A4,'Section 2'!$D$22:$O$31,COLUMNS('Section 2'!$D$18:D$19),0),\"\")","v":""},{"$f":"IF(C4=\"\",\"\",'Section 2'!$D$14)","v":""},{"$f":"IF(C4=\"\",\"\",IF('Section 2'!$E$14=0,\"\",'Section 2'!$E$14))","v":""},{"$f":"IF(C4=\"\",\"\",IF('Section 2'!$F$14=0,\"\",'Section 2'!$F$14))","v":""},{"$f":"IF(C4=\"\",\"\",IF('Section 2'!$G$14=0,\"\",'Section 2'!$G$14))","v":""},{"$f":"IF(C4=\"\",\"\",IF('Section 2'!$H$14=0,\"\",'Section 2'!$H$14))","v":""},{"$f":"IF(C4=\"\",\"\",IF('Section 2'!$I$14=0,\"\",'Section 2'!$I$14))","v":""},{"$f":"IF(C4=\"\",\"\",IF('Section 2'!$J$14=0,\"\",'Section 2'!$J$14))","v":""},{"$f":"IF(C4=\"\",\"\",IF('Section 2'!$K$14=0,\"\",'Section 2'!$K$14))","v":""},{"$f":"IFERROR(PROPER(VLOOKUP($A4,'Section 2'!$D$22:$O$31,COLUMNS('Section 2'!$D$18:E$19),0)),\"\")","v":""},{"$f":"IFERROR(PROPER(VLOOKUP($A4,'Section 2'!$D$22:$O$31,COLUMNS('Section 2'!$D$18:F$19),0)),\"\")","v":""},{"$f":"IFERROR(PROPER(VLOOKUP($A4,'Section 2'!$D$22:$O$31,COLUMNS('Section 2'!$D$18:G$19),0)),\"\")","v":""},{"$f":"IFERROR(VLOOKUP($A4,'Section 2'!$D$22:$O$31,COLUMNS('Section 2'!$D$18:H$19),0),\"\")","v":""},{"$f":"IFERROR(VLOOKUP($A4,'Section 2'!$D$22:$O$31,COLUMNS('Section 2'!$D$18:I$19),0),\"\")","v":""},{"$f":"IFERROR(VLOOKUP($A4,'Section 2'!$D$22:$O$31,COLUMNS('Section 2'!$D$18:J$19),0),\"\")","v":""},{"$f":"IFERROR(VLOOKUP($A4,'Section 2'!$D$22:$O$31,COLUMNS('Section 2'!$D$18:K$19),0),\"\")","v":""},{"$f":"IFERROR(VLOOKUP($A4,'Section 2'!$D$22:$O$31,COLUMNS('Section 2'!$D$18:L$19),0),\"\")","v":""},{"$f":"IFERROR(VLOOKUP($A4,'Section 2'!$D$22:$O$31,COLUMNS('Section 2'!$D$18:M$19),0),\"\")","v":""},{"$f":"IFERROR(VLOOKUP($A4,'Section 2'!$D$22:$O$31,COLUMNS('Section 2'!$D$18:N$19),0),\"\")","v":""},{"$f":"IFERROR(VLOOKUP($A4,'Section 2'!$D$22:$O$31,COLUMNS('Section 2'!$D$18:O$19),0),\"\")","v":""}]
[4,"",{"$f":"IFERROR(VLOOKUP($A5,'Section 2'!$D$22:$O$31,COLUMNS('Section 2'!$D$18:D$19),0),\"\")","v":""},{"$f":"IF(C5=\"\",\"\",'Section 2'!$D$14)","v":""},{"$f":"IF(C5=\"\",\"\",IF('Section 2'!$E$14=0,\"\",'Section 2'!$E$14))","v":""},{"$f":"IF(C5=\"\",\"\",IF('Section 2'!$F$14=0,\"\",'Section 2'!$F$14))","v":""},{"$f":"IF(C5=\"\",\"\",IF('Section 2'!$G$14=0,\"\",'Section 2'!$G$14))","v":""},{"$f":"IF(C5=\"\",\"\",IF('Section 2'!$H$14=0,\"\",'Section 2'!$H$14))","v":""},{"$f":"IF(C5=\"\",\"\",IF('Section 2'!$I$14=0,\"\",'Section 2'!$I$14))","v":""},{"$f":"IF(C5=\"\",\"\",IF('Section 2'!$J$14=0,\"\",'Section 2'!$J$14))","v":""},{"$f":"IF(C5=\"\",\"\",IF('Section 2'!$K$14=0,\"\",'Section 2'!$K$14))","v":""},{"$f":"IFERROR(PROPER(VLOOKUP($A5,'Section 2'!$D$22:$O$31,COLUMNS('Section 2'!$D$18:E$19),0)),\"\")","v":""},{"$f":"IFERROR(PROPER(VLOOKUP($A5,'Section 2'!$D$22:$O$31,COLUMNS('Section 2'!$D$18:F$19),0)),\"\")","v":""},{"$f":"IFERROR(PROPER(VLOOKUP($A5,'Section 2'!$D$22:$O$31,COLUMNS('Section 2'!$D$18:G$19),0)),\"\")","v":""},{"$f":"IFERROR(VLOOKUP($A5,'Section 2'!$D$22:$O$31,COLUMNS('Section 2'!$D$18:H$19),0),\"\")","v":""},{"$f":"IFERROR(VLOOKUP($A5,'Section 2'!$D$22:$O$31,COLUMNS('Section 2'!$D$18:I$19),0),\"\")","v":""},{"$f":"IFERROR(VLOOKUP($A5,'Section 2'!$D$22:$O$31,COLUMNS('Section 2'!$D$18:J$19),0),\"\")","v":""},{"$f":"IFERROR(VLOOKUP($A5,'Section 2'!$D$22:$O$31,COLUMNS('Section 2'!$D$18:K$19),0),\"\")","v":""},{"$f":"IFERROR(VLOOKUP($A5,'Section 2'!$D$22:$O$31,COLUMNS('Section 2'!$D$18:L$19),0),\"\")","v":""},{"$f":"IFERROR(VLOOKUP($A5,'Section 2'!$D$22:$O$31,COLUMNS('Section 2'!$D$18:M$19),0),\"\")","v":""},{"$f":"IFERROR(VLOOKUP($A5,'Section 2'!$D$22:$O$31,COLUMNS('Section 2'!$D$18:N$19),0),\"\")","v":""},{"$f":"IFERROR(VLOOKUP($A5,'Section 2'!$D$22:$O$31,COLUMNS('Section 2'!$D$18:O$19),0),\"\")","v":""}]
[5,"",{"$f":"IFERROR(VLOOKUP($A6,'Section 2'!$D$22:$O$31,COLUMNS('Section 2'!$D$18:D$19),0),\"\")","v":""},{"$f":"IF(C6=\"\",\"\",'Section 2'!$D$14)","v":""},{"$f":"IF(C6=\"\",\"\",IF('Section 2'!$E$14=0,\"\",'Section 2'!$E$14))","v":""},{"$f":"IF(C6=\"\",\"\",IF('Section 2'!$F$14=0,\"\",'Section 2'!$F$14))","v":""},{"$f":"IF(C6=\"\",\"\",IF('Section 2'!$G$14=0,\"\",'Section 2'!$G$14))","v":""},{"$f":"IF(C6=\"\",\"\",IF('Section 2'!$H$14=0,\"\",'Section 2'!$H$14))","v":""},{"$f":"IF(C6=\"\",\"\",IF('Section 2'!$I$14=0,\"\",'Section 2'!$I$14))","v":""},{"$f":"IF(C6=\"\",\"\",IF('Section 2'!$J$14=0,\"\",'Section 2'!$J$14))","v":""},{"$f":"IF(C6=\"\",\"\",IF('Section 2'!$K$14=0,\"\",'Section 2'!$K$14))","v":""},{"$f":"IFERROR(PROPER(VLOOKUP($A6,'Section 2'!$D$22:$O$31,COLUMNS('Section 2'!$D$18:E$19),0)),\"\")","v":""},{"$f":"IFERROR(PROPER(VLOOKUP($A6,'Section 2'!$D$22:$O$31,COLUMNS('Section 2'!$D$18:F$19),0)),\"\")","v":""},{"$f":"IFERROR(PROPER(VLOOKUP($A6,'Section 2'!$D$22:$O$31,COLUMNS('Section 2'!$D$18:G$19),0)),\"\")","v":""},{"$f":"IFERROR(VLOOKUP($A6,'Section 2'!$D$22:$O$31,COLUMNS('Section 2'!$D$18:H$19),0),\"\")","v":""},{"$f":"IFERROR(VLOOKUP($A6,'Section 2'!$D$22:$O$31,COLUMNS('Section 2'!$D$18:I$19),0),\"\")","v":""},{"$f":"IFERROR(VLOOKUP($A6,'Section 2'!$D$22:$O$31,COLUMNS('Section 2'!$D$18:J$19),0),\"\")","v":""},{"$f":"IFERROR(VLOOKUP($A6,'Section 2'!$D$22:$O$31,COLUMNS('Section 2'!$D$18:K$19),0),\"\")","v":""},{"$f":"IFERROR(VLOOKUP($A6,'Section 2'!$D$22:$O$31,COLUMNS('Section 2'!$D$18:L$19),0),\"\")","v":""},{"$f":"IFERROR(VLOOKUP($A6,'Section 2'!$D$22:$O$31,COLUMNS('Section 2'!$D$18:M$19),0),\"\")","v":""},{"$f":"IFERROR(VLOOKUP($A6,'Section 2'!$D$22:$O$31,COLUMNS('Section 2'!$D$18:N$19),0),\"\")","v":""},{"$f":"IFERROR(VLOOKUP($A6,'Section 2'!$D$22:$O$31,COLUMNS('Section 2'!$D$18:O$19),0),\"\")","v":""}]
[6,"",{"$f":"IFERROR(VLOOKUP($A7,'Section 2'!$D$22:$O$31,COLUMNS('Section 2'!$D$18:D$19),0),\"\")","v":""},{"$f":"IF(C7=\"\",\"\",'Section 2'!$D$14)","v":""},{"$f":"IF(C7=\"\",\"\",IF('Section 2'!$E$14=0,\"\",'Section 2'!$E$14))","v":""},{"$f":"IF(C7=\"\",\"\",IF('Section 2'!$F$14=0,\"\",'Section 2'!$F$14))","v":""},{"$f":"IF(C7=\"\",\"\",IF('Section 2'!$G$14=0,\"\",'Section 2'!$G$14))","v":""},{"$f":"IF(C7=\"\",\"\",IF('Section 2'!$H$14=0,\"\",'Section 2'!$H$14))","v":""},{"$f":"IF(C7=\"\",\"\",IF('Section 2'!$I$14=0,\"\",'Section 2'!$I$14))","v":""},{"$f":"IF(C7=\"\",\"\",IF('Section 2'!$J$14=0,\"\",'Section 2'!$J$14))","v":""},{"$f":"IF(C7=\"\",\"\",IF('Section 2'!$K$14=0,\"\",'Section 2'!$K$14))","v":""},{"$f":"IFERROR(PROPER(VLOOKUP($A7,'Section 2'!$D$22:$O$31,COLUMNS('Section 2'!$D$18:E$19),0)),\"\")","v":""},{"$f":"IFERROR(PROPER(VLOOKUP($A7,'Section 2'!$D$22:$O$31,COLUMNS('Section 2'!$D$18:F$19),0)),\"\")","v":""},{"$f":"IFERROR(PROPER(VLOOKUP($A7,'Section 2'!$D$22:$O$31,COLUMNS('Section 2'!$D$18:G$19),0)),\"\")","v":""},{"$f":"IFERROR(VLOOKUP($A7,'Section 2'!$D$22:$O$31,COLUMNS('Section 2'!$D$18:H$19),0),\"\")","v":""},{"$f":"IFERROR(VLOOKUP($A7,'Section 2'!$D$22:$O$31,COLUMNS('Section 2'!$D$18:I$19),0),\"\")","v":""},{"$f":"IFERROR(VLOOKUP($A7,'Section 2'!$D$22:$O$31,COLUMNS('Section 2'!$D$18:J$19),0),\"\")","v":""},{"$f":"IFERROR(VLOOKUP($A7,'Section 2'!$D$22:$O$31,COLUMNS('Section 2'!$D$18:K$19),0),\"\")","v":""},{"$f":"IFERROR(VLOOKUP($A7,'Section 2'!$D$22:$O$31,COLUMNS('Section 2'!$D$18:L$19),0),\"\")","v":""},{"$f":"IFERROR(VLOOKUP($A7,'Section 2'!$D$22:$O$31,COLUMNS('Section 2'!$D$18:M$19),0),\"\")","v":""},{"$f":"IFERROR(VLOOKUP($A7,'Section 2'!$D$22:$O$31,COLUMNS('Section 2'!$D$18:N$19),0),\"\")","v":""},{"$f":"IFERROR(VLOOKUP($A7,'Section 2'!$D$22:$O$31,COLUMNS('Section 2'!$D$18:O$19),0),\"\")","v":""}]
[7,"",{"$f":"IFERROR(VLOOKUP($A8,'Section 2'!$D$22:$O$31,COLUMNS('Section 2'!$D$18:D$19),0),\"\")","v":""},{"$f":"IF(C8=\"\",\"\",'Section 2'!$D$14)","v":""},{"$f":"IF(C8=\"\",\"\",IF('Section 2'!$E$14=0,\"\",'Section 2'!$E$14))","v":""},{"$f":"IF(C8=\"\",\"\",IF('Section 2'!$F$14=0,\"\",'Section 2'!$F$14))","v":""},{"$f":"IF(C8=\"\",\"\",IF('Section 2'!$G$14=0,\"\",'Section 2'!$G$14))","v":""},{"$f":"IF(C8=\"\",\"\",IF('Section 2'!$H$14=0,\"\",'Section 2'!$H$14))","v":""},{"$f":"IF(C8=\"\",\"\",IF('Section 2'!$I$14=0,\"\",'Section 2'!$I$14))","v":""},{"$f":"IF(C8=\"\",\"\",IF('Section 2'!$J$14=0,\"\",'Section 2'!$J$14))","v":""},{"$f":"IF(C8=\"\",\"\",IF('Section 2'!$K$14=0,\"\",'Section 2'!$K$14))","v":""},{"$f":"IFERROR(PROPER(VLOOKUP($A8,'Section 2'!$D$22:$O$31,COLUMNS('Section 2'!$D$18:E$19),0)),\"\")","v":""},{"$f":"IFERROR(PROPER(VLOOKUP($A8,'Section 2'!$D$22:$O$31,COLUMNS('Section 2'!$D$18:F$19),0)),\"\")","v":""},{"$f":"IFERROR(PROPER(VLOOKUP($A8,'Section 2'!$D$22:$O$31,COLUMNS('Section 2'!$D$18:G$19),0)),\"\")","v":""},{"$f":"IFERROR(VLOOKUP($A8,'Section 2'!$D$22:$O$31,COLUMNS('Section 2'!$D$18:H$19),0),\"\")","v":""},{"$f":"IFERROR(VLOOKUP($A8,'Section 2'!$D$22:$O$31,COLUMNS('Section 2'!$D$18:I$19),0),\"\")","v":""},{"$f":"IFERROR(VLOOKUP($A8,'Section 2'!$D$22:$O$31,COLUMNS('Section 2'!$D$18:J$19),0),\"\")","v":""},{"$f":"IFERROR(VLOOKUP($A8,'Section 2'!$D$22:$O$31,COLUMNS('Section 2'!$D$18:K$19),0),\"\")","v":""},{"$f":"IFERROR(VLOOKUP($A8,'Section 2'!$D$22:$O$31,COLUMNS('Section 2'!$D$18:L$19),0),\"\")","v":""},{"$f":"IFERROR(VLOOKUP($A8,'Section 2'!$D$22:$O$31,COLUMNS('Section 2'!$D$18:M$19),0),\"\")","v":""},{"$f":"IFERROR(VLOOKUP($A8,'Section 2'!$D$22:$O$31,COLUMNS('Section 2'!$D$18:N$19),0),\"\")","v":""},{"$f":"IFERROR(VLOOKUP($A8,'Section 2'!$D$22:$O$31,COLUMNS('Section 2'!$D$18:O$19),0),\"\")","v":""}]
[8,"",{"$f":"IFERROR(VLOOKUP($A9,'Section 2'!$D$22:$O$31,COLUMNS('Section 2'!$D$18:D$19),0),\"\")","v":""},{"$f":"IF(C9=\"\",\"\",'Section 2'!$D$14)","v":""},{"$f":"IF(C9=\"\",\"\",IF('Section 2'!$E$14=0,\"\",'Section 2'!$E$14))","v":""},{"$f":"IF(C9=\"\",\"\",IF('Section 2'!$F$14=0,\"\",'Section 2'!$F$14))","v":""},{"$f":"IF(C9=\"\",\"\",IF('Section 2'!$G$14=0,\"\",'Section 2'!$G$14))","v":""},{"$f":"IF(C9=\"\",\"\",IF('Section 2'!$H$14=0,\"\",'Section 2'!$H$14))","v":""},{"$f":"IF(C9=\"\",\"\",IF('Section 2'!$I$14=0,\"\",'Section 2'!$I$14))","v":""},{"$f":"IF(C9=\"\",\"\",IF('Section 2'!$J$14=0,\"\",'Section 2'!$J$14))","v":""},{"$f":"IF(C9=\"\",\"\",IF('Section 2'!$K$14=0,\"\",'Section 2'!$K$14))","v":""},{"$f":"IFERROR(PROPER(VLOOKUP($A9,'Section 2'!$D$22:$O$31,COLUMNS('Section 2'!$D$18:E$19),0)),\"\")","v":""},{"$f":"IFERROR(PROPER(VLOOKUP($A9,'Section 2'!$D$22:$O$31,COLUMNS('Section 2'!$D$18:F$19),0)),\"\")","v":""},{"$f":"IFERROR(PROPER(VLOOKUP($A9,'Section 2'!$D$22:$O$31,COLUMNS('Section 2'!$D$18:G$19),0)),\"\")","v":""},{"$f":"IFERROR(VLOOKUP($A9,'Section 2'!$D$22:$O$31,COLUMNS('Section 2'!$D$18:H$19),0),\"\")","v":""},{"$f":"IFERROR(VLOOKUP($A9,'Section 2'!$D$22:$O$31,COLUMNS('Section 2'!$D$18:I$19),0),\"\")","v":""},{"$f":"IFERROR(VLOOKUP($A9,'Section 2'!$D$22:$O$31,COLUMNS('Section 2'!$D$18:J$19),0),\"\")","v":""},{"$f":"IFERROR(VLOOKUP($A9,'Section 2'!$D$22:$O$31,COLUMNS('Section 2'!$D$18:K$19),0),\"\")","v":""},{"$f":"IFERROR(VLOOKUP($A9,'Section 2'!$D$22:$O$31,COLUMNS('Section 2'!$D$18:L$19),0),\"\")","v":""},{"$f":"IFERROR(VLOOKUP($A9,'Section 2'!$D$22:$O$31,COLUMNS('Section 2'!$D$18:M$19),0),\"\")","v":""},{"$f":"IFERROR(VLOOKUP($A9,'Section 2'!$D$22:$O$31,COLUMNS('Section 2'!$D$18:N$19),0),\"\")","v":""},{"$f":"IFERROR(VLOOKUP($A9,'Section 2'!$D$22:$O$31,COLUMNS('Section 2'!$D$18:O$19),0),\"\")","v":""}]
[9,"",{"$f":"IFERROR(VLOOKUP($A10,'Section 2'!$D$22:$O$31,COLUMNS('Section 2'!$D$18:D$19),0),\"\")","v":""},{"$f":"IF(C10=\"\",\"\",'Section 2'!$D$14)","v":""},{"$f":"IF(C10=\"\",\"\",IF('Section 2'!$E$14=0,\"\",'Section 2'!$E$14))","v":""},{"$f":"IF(C10=\"\",\"\",IF('Section 2'!$F$14=0,\"\",'Section 2'!$F$14))","v":""},{"$f":"IF(C10=\"\",\"\",IF('Section 2'!$G$14=0,\"\",'Section 2'!$G$14))","v":""},{"$f":"IF(C10=\"\",\"\",IF('Section 2'!$H$14=0,\"\",'Section 2'!$H$14))","v":""},{"$f":"IF(C10=\"\",\"\",IF('Section 2'!$I$14=0,\"\",'Section 2'!$I$14))","v":""},{"$f":"IF(C10=\"\",\"\",IF('Section 2'!$J$14=0,\"\",'Section 2'!$J$14))","v":""},{"$f":"IF(C10=\"\",\"\",IF('Section 2'!$K$14=0,\"\",'Section 2'!$K$14))","v":""},{"$f":"IFERROR(PROPER(VLOOKUP($A10,'Section 2'!$D$22:$O$31,COLUMNS('Section 2'!$D$18:E$19),0)),\"\")","v":""},{"$f":"IFERROR(PROPER(VLOOKUP($A10,'Section 2'!$D$22:$O$31,COLUMNS('Section 2'!$D$18:F$19),0)),\"\")","v":""},{"$f":"IFERROR(PROPER(VLOOKUP($A10,'Section 2'!$D$22:$O$31,COLUMNS('Section 2'!$D$18:G$19),0)),\"\")","v":""},{"$f":"IFERROR(VLOOKUP($A10,'Section 2'!$D$22:$O$31,COLUMNS('Section 2'!$D$18:H$19),0),\"\")","v":""},{"$f":"IFERROR(VLOOKUP($A10,'Section 2'!$D$22:$O$31,COLUMNS('Section 2'!$D$18:I$19),0),\"\")","v":""},{"$f":"IFERROR(VLOOKUP($A10,'Section 2'!$D$22:$O$31,COLUMNS('Section 2'!$D$18:J$19),0),\"\")","v":""},{"$f":"IFERROR(VLOOKUP($A10,'Section 2'!$D$22:$O$31,COLUMNS('Section 2'!$D$18:K$19),0),\"\")","v":""},{"$f":"IFERROR(VLOOKUP($A10,'Section 2'!$D$22:$O$31,COLUMNS('Section 2'!$D$18:L$19),0),\"\")","v":""},{"$f":"IFERROR(VLOOKUP($A10,'Section 2'!$D$22:$O$31,COLUMNS('Section 2'!$D$18:M$19),0),\"\")","v":""},{"$f":"IFERROR(VLOOKUP($A10,'Section 2'!$D$22:$O$31,COLUMNS('Section 2'!$D$18:N$19),0),\"\")","v":""},{"$f":"IFERROR(VLOOKUP($A10,'Section 2'!$D$22:$O$31,COLUMNS('Section 2'!$D$18:O$19),0),\"\")","v":""}]
{"$rows_left_out":2}