{"text_format":"1","workbook":"xlsx","n_sheets":12,"sheets":["Instructions","Section 1","Section 2","Section 3","Section 4","Summary","Reference List","Lists","Checks","OutputForCSV","TempOutput","Data for Summary"],"not_rendered":{"charts":0,"images":0,"macros":1,"external_links":0,"defined_names":66,"comments":8,"pivot_tables":0},"unopened":[],"bounds":{"document_bytes":16777216,"sheet_cells":100000,"rows_first":2000,"rows_last":500,"rows_between":2000,"halvings":0,"cell_chars":16384,"cell_head_chars":4096},"cells_cut":0,"cells_raw":0,"read":"whole","date_system":"1900"}

{"sheet":"Instructions","index":0,"n_rows":21,"n_cols":3,"rows_kept":21,"cut":false,"hidden":false,"merged":[]}
[]
[null,null,"OMB Control Number: 2060-0170"]
[null,null,"Expiration Date: 4/30/2023"]
[null,null,"U.S. Environmental Protection Agency "]
[null,null,"Stratospheric Ozone Protection Program"]
[]
{"$rows_left_out":16}
{"sheet":"Section 1","index":1,"n_rows":16,"n_cols":9,"rows_kept":16,"cut":false,"hidden":false,"merged":[[7,2,7,3]]}
[]
[null,null,"U.S. Environmental Protection Agency"]
[null,null,"Methyl Bromide Importer Quarterly Report"]
[]
[null,null,"   Date Prepared:",{"$f":"TODAY()","v":"2020-07-15"}]
[]
{"$rows_left_out":11}
{"sheet":"Section 2","index":2,"n_rows":312,"n_cols":30,"rows_kept":312,"cut":false,"hidden":false,"merged":[[6,2,6,3],[7,2,7,3],[10,2,10,12],[11,2,11,9]]}
[null,null,null,null,null,null,null,null,null,null,"ImporterCol"]
[null,null,null,null,null,null,null,null,null,null,{"$f":"IF('Section 1'!D13=0,\"\",'Section 1'!D13)","v":""}]
[]
[null,null,"U.S. Environmental Protection Agency"]
[null,null,"Methyl Bromide Importer Quarterly Report"]
[]
{"$rows_left_out":307}
{"sheet":"Section 3","index":3,"n_rows":32,"n_cols":18,"rows_kept":32,"cut":false,"hidden":false,"merged":[[23,3,23,4],[17,3,17,4],[18,3,18,4],[19,3,19,4],[20,3,20,4],[21,3,21,4],[13,3,13,4],[14,3,14,4],[15,3,15,4],[16,3,16,4],[22,3,22,4],[8,3,8,6],[10,3,10,6],[9,3,9,6],[11,3,11,4],[12,3,12,4]]}
[]
[null,null,null,"U.S. Environmental Protection Agency"]
[null,null,null,"Methyl Bromide Importer Quarterly Report"]
[]
[null,null,null,"Company Name:",{"$f":"IF('Section 1'!D9=0,\"\",'Section 1'!D9)","v":""}]
[null,null,null,"Reporting Period:",{"$f":"IF(OR('Section 1'!D11=0,'Section 1'!D12=0),\"\",\"Quarter \"&'Section 1'!D12&\", \"&'Section 1'!D11)","v":""}]
{"$rows_left_out":27}
{"sheet":"Section 4","index":4,"n_rows":17,"n_cols":13,"rows_kept":17,"cut":false,"hidden":true,"merged":[[16,3,16,4],[8,3,8,7],[11,3,11,7],[12,3,12,4],[13,3,13,4],[14,3,14,4],[15,3,15,4]]}
[]
[null,null,null,"U.S. Environmental Protection Agency"]
[null,null,null,"Methyl Bromide Importer Quarterly Report"]
[]
[null,null,null,"Company Name:",{"$f":"IF('Section 1'!D9=0,\"\",'Section 1'!D9)","v":""}]
[null,null,null,"Reporting Period:",{"$f":"IF(OR('Section 1'!D11=0,'Section 1'!D12=0),\"\",\"Quarter \"&'Section 1'!D12&\", \"&'Section 1'!D11)","v":""}]
{"$rows_left_out":12}
{"sheet":"Summary","index":5,"n_rows":18,"n_cols":15,"rows_kept":18,"cut":false,"hidden":false,"merged":[[17,6,17,7],[16,4,16,5],[17,4,17,5],[14,3,14,7],[8,3,8,14],[9,3,10,3],[9,14,10,14],[9,4,9,13],[15,3,16,3],[15,4,15,7],[16,6,16,7]]}
[]
[null,null,null,"U.S. Environmental Protection Agency"]
[null,null,null,"Methyl Bromide Importer Quarterly Report"]
[]
[null,null,null,"Company Name:",{"$f":"IF('Section 1'!D9=0,\"\",'Section 1'!D9)","v":""}]
[null,null,null,"Reporting Period:",{"$f":"IF(OR('Section 1'!D11=0,'Section 1'!D12=0),\"\",\"Quarter \"&'Section 1'!D12&\", \"&'Section 1'!D11)","v":""}]
{"$rows_left_out":13}
{"sheet":"Reference List","index":6,"n_rows":78,"n_cols":10,"rows_kept":78,"cut":false,"hidden":false,"merged":[[71,8,72,8],[51,9,52,9],[64,9,65,9],[5,2,5,9],[6,2,6,5],[8,7,8,9],[18,2,18,5],[6,7,6,9],[8,2,8,3],[11,2,12,5],[21,2,24,4],[26,2,26,4],[27,3,27,4],[28,3,28,4],[14,2,14,5]]}
[]
[null,null,"U.S. Environmental Protection Agency"]
[null,null,"Methyl Bromide Importer Quarterly Report"]
[null,null,"Reference List"]
[]
[null,null,"Copying and Pasting Data: If data is pasted into this reporting form from another spreadsheet, the formatting of specific cells must be consistent with the requirements of the form in order to be accepted into EPA’s ODS tracking system. When copying and pasting data into the form, please ensure consistency with the formatting of the lists provided below."]
{"$rows_left_out":73}
{"sheet":"Lists","index":7,"n_rows":203,"n_cols":25,"rows_kept":203,"cut":false,"hidden":true,"merged":[[0,20,0,21]]}
[null,null,null,null,null,null,null,null,null,null,null,null,null,null,null,null,null,null,null,null,"FOR REFERENCE ONLY",null,null,"Variables for Data Submission"]
[null,"Country List","Submission Type","Reporting Year","Reporting Quarter","Quarter Start Month","Date Range","MeBr Purpose","MeBr Transaction Type","MeBr Intended Uses_New ","Intended Uses_Heels ","Date for CSV Title","Form Name for CSV Title",null,"Incorrect Capitalizations","Correct Spelling",null,"Invalid Character","Replacement Character",null,"Form Type","Form Code",null,null,"Row #"]
[null,"Afghanistan","Original Submission",2018,1,1,{"$f":"IF(SUM('Section 1'!$F$11:$F$12)>0,DATE(2018,1,1),DATE('Section 1'!$D$11,VLOOKUP('Section 1'!D12,Lists!$E$3:$F$6,2,0),1))","v":"2018-01-01"},"Global Lab","New","New","Heels",{"$f":"MONTH('Section 1'!D5)&\"-\"&DAY('Section 1'!D5)&\"-\"&YEAR('Section 1'!D5)","v":"7-15-2020"},"MeBr Importer",null,"cfc","CFC",null,"À","A",null,"Class I Producer","PROD1",null,"Sec2End",{"$f":"IF(MAX(OutputForCSV!A2:A101)=0,1,MAX(OutputForCSV!A2:A101))","v":1}]
[null,"Albania","Re-Submittal",2019,2,4,{"$f":"IF(SUM('Section 1'!$F$11:$F$12)>0,DATE(2030,1,1),IF('Section 1'!D12=4,DATE('Section 1'!D11+1,1,1)-1,DATE('Section 1'!$D$11,VLOOKUP('Section 1'!$D$12,Lists!$E$3:$F$6,2,0)+3,1)-1))","v":"2030-01-01"},"QPS","Heels","MeBrNewIntendedUses","HeelsIntendedUses",null,null,null,"CCl4","CCL4",null,"Á","A",null,"MeBr Producer","PROD3",null,"Sec3Start",{"$f":"OutputForCSV!A102","v":""}]
[null,"Algeria",null,2020,3,7,null,"Transformation",null,"In-House Trans","Future Shipment",null,null,null,"cbm","CBM",null,"Ã","A",null,"Class II Producer","PROD2",null,"Sec3End",{"$f":"MAX(OutputForCSV!A102:A111)","v":0}]
[null,"Andorra",null,2021,4,10,null,"Destruction",null,"2nd Party Trans","Transformation",null,null,null,"HBFCS","HBFCs",null,"Ä","A",null,"Class I Importer","IMPT1",null,"Sec4Start",{"$f":"OutputForCSV!A112","v":""}]
{"$rows_left_out":198}
{"sheet":"Checks","index":8,"n_rows":32,"n_cols":5,"rows_kept":32,"cut":false,"hidden":true,"merged":[]}
[]
[null,"Section","Check Description","Status (1 = Incomplete, 0 = Complete)","Check Type"]
[null,"Section 1","All",{"$f":"IF(SUM('Section 1'!F9:F13)>0,1,0)","v":1},"Error"]
[null,"Section 2","Date Range Check",{"$f":"IF(SUM('Section 2'!S16:S115)>0,1,0)","v":0},"Stopper"]
[null,"Section 2","Complete?",{"$f":"IF(SUM('Section 2'!T16:T115)>0,1,0)","v":0},"Stopper"]
[null,"Section 2","Valid Country",{"$f":"IF(SUM('Section 2'!U16:U115)>0,1,0)","v":0},"Stopper"]
{"$rows_left_out":27}
{"sheet":"OutputForCSV","index":9,"n_rows":116,"n_cols":21,"rows_kept":116,"cut":false,"hidden":true,"merged":[]}
["Row #","Entry",1,"IMPT3","4",{"$f":"'Section 1'!D5","v":"2020-07-15"},{"$f":"'Section 1'!D9","v":0},{"$f":"'Section 1'!D10","v":0},{"$f":"'Section 1'!D11","v":0},{"$f":"'Section 1'!D12","v":0},{"$f":"'Section 1'!D13","v":0},null,null,null,null,null,null,null,null,null,"LastColumn"]
[{"$f":"IF(D2=\"\",\"\",ROWS($A$1:A2))","v":""},1,{"$f":"IF(D2=\"\",\"\",2)","v":""},{"$f":"IFERROR(VLOOKUP($B2,'Section 2'!$C$16:$M$115,COLUMNS('Section 2'!$C$13:C$13),0),\"\")","v":""},{"$f":"IF($D2=\"\",\"\",IF(ISBLANK(VLOOKUP($B2,'Section 2'!$C$16:$M$115,COLUMNS('Section 2'!$C$13:D$13),0)),\"\",VLOOKUP($B2,'Section 2'!$C$16:$M$115,COLUMNS('Section 2'!$C$13:D$13),0)))","v":""},{"$f":"IF($D2=\"\",\"\",IF(ISBLANK(VLOOKUP($B2,'Section 2'!$C$16:$M$115,COLUMNS('Section 2'!$C$13:E$13),0)),\"\",VLOOKUP($B2,'Section 2'!$C$16:$M$115,COLUMNS('Section 2'!$C$13:E$13),0)))","v":""},{"$f":"IF($D2=\"\",\"\",IF(ISBLANK(VLOOKUP($B2,'Section 2'!$C$16:$M$115,COLUMNS('Section 2'!$C$13:F$13),0)),\"\",VLOOKUP($B2,'Section 2'!$C$16:$M$115,COLUMNS('Section 2'!$C$13:F$13),0)))","v":""},{"$f":"IF($D2=\"\",\"\",IF(ISBLANK(VLOOKUP($B2,'Section 2'!$C$16:$M$115,COLUMNS('Section 2'!$C$13:G$13),0)),\"\",VLOOKUP($B2,'Section 2'!$C$16:$M$115,COLUMNS('Section 2'!$C$13:G$13),0)))","v":""},{"$f":"IF($D2=\"\",\"\",IF(ISBLANK(VLOOKUP($B2,'Section 2'!$C$16:$M$115,COLUMNS('Section 2'!$C$13:H$13),0)),\"\",VLOOKUP($B2,'Section 2'!$C$16:$M$115,COLUMNS('Section 2'!$C$13:H$13),0)))","v":""},{"$f":"IF($D2=\"\",\"\",IF(ISBLANK(VLOOKUP($B2,'Section 2'!$C$16:$M$115,COLUMNS('Section 2'!$C$13:I$13),0)),\"\",VLOOKUP($B2,'Section 2'!$C$16:$M$115,COLUMNS('Section 2'!$C$13:I$13),0)))","v":""},{"$f":"IF($D2=\"\",\"\",IF(ISBLANK(VLOOKUP($B2,'Section 2'!$C$16:$M$115,COLUMNS('Section 2'!$C$13:J$13),0)),\"\",IF(VLOOKUP($B2,'Section 2'!$C$16:$M$115,COLUMNS('Section 2'!$C$13:J$13),0)=\"QPS\",\"QPS\",PROPER(VLOOKUP($B2,'Section 2'!$C$16:$M$115,COLUMNS('Section 2'!$C$13:J$13),0)))))","v":""},{"$f":"IF($D2=\"\",\"\",IF(ISBLANK(VLOOKUP($B2,'Section 2'!$C$16:$M$115,COLUMNS('Section 2'!$C$13:K$13),0)),\"\",VLOOKUP($B2,'Section 2'!$C$16:$M$115,COLUMNS('Section 2'!$C$13:K$13),0)))","v":""},{"$f":"IF($D2=\"\",\"\",IF(ISBLANK(VLOOKUP($B2,'Section 2'!$C$16:$M$115,COLUMNS('Section 2'!$C$13:L$13),0)),\"\",PROPER(VLOOKUP($B2,'Section 2'!$C$16:$M$115,COLUMNS('Section 2'!$C$13:L$13),0))))","v":""},{"$f":"IF($D2=\"\",\"\",IF(ISBLANK(VLOOKUP($B2,'Section 2'!$C$16:$M$115,COLUMNS('Section 2'!$C$13:M$13),0)),\"\",IF(VLOOKUP($B2,'Section 2'!$C$16:$M$115,COLUMNS('Section 2'!$C$13:M$13),0)=\"QPS\",\"QPS\",IF(VLOOKUP($B2,'Section 2'!$C$16:$M$115,COLUMNS('Section 2'!$C$13:M$13),0)=\"2nd Party Trans\",\"2nd Party Trans\",IF(VLOOKUP($B2,'Section 2'!$C$16:$M$115,COLUMNS('Section 2'!$C$13:M$13),0)=\"2nd Party Dest\",\"2nd Party Dest\",PROPER(VLOOKUP($B2,'Section 2'!$C$16:$M$115,COLUMNS('Section 2'!$C$13:M$13),0)))))))","v":""}]
[{"$f":"IF(D3=\"\",\"\",ROWS($A$1:A3))","v":""},2,{"$f":"IF(D3=\"\",\"\",2)","v":""},{"$f":"IFERROR(VLOOKUP($B3,'Section 2'!$C$16:$M$115,COLUMNS('Section 2'!$C$13:C$13),0),\"\")","v":""},{"$f":"IF($D3=\"\",\"\",IF(ISBLANK(VLOOKUP($B3,'Section 2'!$C$16:$M$115,COLUMNS('Section 2'!$C$13:D$13),0)),\"\",VLOOKUP($B3,'Section 2'!$C$16:$M$115,COLUMNS('Section 2'!$C$13:D$13),0)))","v":""},{"$f":"IF($D3=\"\",\"\",IF(ISBLANK(VLOOKUP($B3,'Section 2'!$C$16:$M$115,COLUMNS('Section 2'!$C$13:E$13),0)),\"\",VLOOKUP($B3,'Section 2'!$C$16:$M$115,COLUMNS('Section 2'!$C$13:E$13),0)))","v":""},{"$f":"IF($D3=\"\",\"\",IF(ISBLANK(VLOOKUP($B3,'Section 2'!$C$16:$M$115,COLUMNS('Section 2'!$C$13:F$13),0)),\"\",VLOOKUP($B3,'Section 2'!$C$16:$M$115,COLUMNS('Section 2'!$C$13:F$13),0)))","v":""},{"$f":"IF($D3=\"\",\"\",IF(ISBLANK(VLOOKUP($B3,'Section 2'!$C$16:$M$115,COLUMNS('Section 2'!$C$13:G$13),0)),\"\",VLOOKUP($B3,'Section 2'!$C$16:$M$115,COLUMNS('Section 2'!$C$13:G$13),0)))","v":""},{"$f":"IF($D3=\"\",\"\",IF(ISBLANK(VLOOKUP($B3,'Section 2'!$C$16:$M$115,COLUMNS('Section 2'!$C$13:H$13),0)),\"\",VLOOKUP($B3,'Section 2'!$C$16:$M$115,COLUMNS('Section 2'!$C$13:H$13),0)))","v":""},{"$f":"IF($D3=\"\",\"\",IF(ISBLANK(VLOOKUP($B3,'Section 2'!$C$16:$M$115,COLUMNS('Section 2'!$C$13:I$13),0)),\"\",VLOOKUP($B3,'Section 2'!$C$16:$M$115,COLUMNS('Section 2'!$C$13:I$13),0)))","v":""},{"$f":"IF($D3=\"\",\"\",IF(ISBLANK(VLOOKUP($B3,'Section 2'!$C$16:$M$115,COLUMNS('Section 2'!$C$13:J$13),0)),\"\",IF(VLOOKUP($B3,'Section 2'!$C$16:$M$115,COLUMNS('Section 2'!$C$13:J$13),0)=\"QPS\",\"QPS\",PROPER(VLOOKUP($B3,'Section 2'!$C$16:$M$115,COLUMNS('Section 2'!$C$13:J$13),0)))))","v":""},{"$f":"IF($D3=\"\",\"\",IF(ISBLANK(VLOOKUP($B3,'Section 2'!$C$16:$M$115,COLUMNS('Section 2'!$C$13:K$13),0)),\"\",VLOOKUP($B3,'Section 2'!$C$16:$M$115,COLUMNS('Section 2'!$C$13:K$13),0)))","v":""},{"$f":"IF($D3=\"\",\"\",IF(ISBLANK(VLOOKUP($B3,'Section 2'!$C$16:$M$115,COLUMNS('Section 2'!$C$13:L$13),0)),\"\",PROPER(VLOOKUP($B3,'Section 2'!$C$16:$M$115,COLUMNS('Section 2'!$C$13:L$13),0))))","v":""},{"$f":"IF($D3=\"\",\"\",IF(ISBLANK(VLOOKUP($B3,'Section 2'!$C$16:$M$115,COLUMNS('Section 2'!$C$13:M$13),0)),\"\",IF(VLOOKUP($B3,'Section 2'!$C$16:$M$115,COLUMNS('Section 2'!$C$13:M$13),0)=\"QPS\",\"QPS\",IF(VLOOKUP($B3,'Section 2'!$C$16:$M$115,COLUMNS('Section 2'!$C$13:M$13),0)=\"2nd Party Trans\",\"2nd Party Trans\",IF(VLOOKUP($B3,'Section 2'!$C$16:$M$115,COLUMNS('Section 2'!$C$13:M$13),0)=\"2nd Party Dest\",\"2nd Party Dest\",PROPER(VLOOKUP($B3,'Section 2'!$C$16:$M$115,COLUMNS('Section 2'!$C$13:M$13),0)))))))","v":""}]
[{"$f":"IF(D4=\"\",\"\",ROWS($A$1:A4))","v":""},3,"",{"$f":"IFERROR(VLOOKUP($B4,'Section 2'!$C$16:$M$115,COLUMNS('Section 2'!$C$13:C$13),0),\"\")","v":""},{"$f":"IF($D4=\"\",\"\",IF(ISBLANK(VLOOKUP($B4,'Section 2'!$C$16:$M$115,COLUMNS('Section 2'!$C$13:D$13),0)),\"\",VLOOKUP($B4,'Section 2'!$C$16:$M$115,COLUMNS('Section 2'!$C$13:D$13),0)))","v":""},{"$f":"IF($D4=\"\",\"\",IF(ISBLANK(VLOOKUP($B4,'Section 2'!$C$16:$M$115,COLUMNS('Section 2'!$C$13:E$13),0)),\"\",VLOOKUP($B4,'Section 2'!$C$16:$M$115,COLUMNS('Section 2'!$C$13:E$13),0)))","v":""},{"$f":"IF($D4=\"\",\"\",IF(ISBLANK(VLOOKUP($B4,'Section 2'!$C$16:$M$115,COLUMNS('Section 2'!$C$13:F$13),0)),\"\",VLOOKUP($B4,'Section 2'!$C$16:$M$115,COLUMNS('Section 2'!$C$13:F$13),0)))","v":""},{"$f":"IF($D4=\"\",\"\",IF(ISBLANK(VLOOKUP($B4,'Section 2'!$C$16:$M$115,COLUMNS('Section 2'!$C$13:G$13),0)),\"\",VLOOKUP($B4,'Section 2'!$C$16:$M$115,COLUMNS('Section 2'!$C$13:G$13),0)))","v":""},{"$f":"IF($D4=\"\",\"\",IF(ISBLANK(VLOOKUP($B4,'Section 2'!$C$16:$M$115,COLUMNS('Section 2'!$C$13:H$13),0)),\"\",VLOOKUP($B4,'Section 2'!$C$16:$M$115,COLUMNS('Section 2'!$C$13:H$13),0)))","v":""},{"$f":"IF($D4=\"\",\"\",IF(ISBLANK(VLOOKUP($B4,'Section 2'!$C$16:$M$115,COLUMNS('Section 2'!$C$13:I$13),0)),\"\",VLOOKUP($B4,'Section 2'!$C$16:$M$115,COLUMNS('Section 2'!$C$13:I$13),0)))","v":""},{"$f":"IF($D4=\"\",\"\",IF(ISBLANK(VLOOKUP($B4,'Section 2'!$C$16:$M$115,COLUMNS('Section 2'!$C$13:J$13),0)),\"\",IF(VLOOKUP($B4,'Section 2'!$C$16:$M$115,COLUMNS('Section 2'!$C$13:J$13),0)=\"QPS\",\"QPS\",PROPER(VLOOKUP($B4,'Section 2'!$C$16:$M$115,COLUMNS('Section 2'!$C$13:J$13),0)))))","v":""},{"$f":"IF($D4=\"\",\"\",IF(ISBLANK(VLOOKUP($B4,'Section 2'!$C$16:$M$115,COLUMNS('Section 2'!$C$13:K$13),0)),\"\",VLOOKUP($B4,'Section 2'!$C$16:$M$115,COLUMNS('Section 2'!$C$13:K$13),0)))","v":""},{"$f":"IF($D4=\"\",\"\",IF(ISBLANK(VLOOKUP($B4,'Section 2'!$C$16:$M$115,COLUMNS('Section 2'!$C$13:L$13),0)),\"\",PROPER(VLOOKUP($B4,'Section 2'!$C$16:$M$115,COLUMNS('Section 2'!$C$13:L$13),0))))","v":""},{"$f":"IF($D4=\"\",\"\",IF(ISBLANK(VLOOKUP($B4,'Section 2'!$C$16:$M$115,COLUMNS('Section 2'!$C$13:M$13),0)),\"\",IF(VLOOKUP($B4,'Section 2'!$C$16:$M$115,COLUMNS('Section 2'!$C$13:M$13),0)=\"QPS\",\"QPS\",IF(VLOOKUP($B4,'Section 2'!$C$16:$M$115,COLUMNS('Section 2'!$C$13:M$13),0)=\"2nd Party Trans\",\"2nd Party Trans\",IF(VLOOKUP($B4,'Section 2'!$C$16:$M$115,COLUMNS('Section 2'!$C$13:M$13),0)=\"2nd Party Dest\",\"2nd Party Dest\",PROPER(VLOOKUP($B4,'Section 2'!$C$16:$M$115,COLUMNS('Section 2'!$C$13:M$13),0)))))))","v":""}]
[{"$f":"IF(D5=\"\",\"\",ROWS($A$1:A5))","v":""},4,"",{"$f":"IFERROR(VLOOKUP($B5,'Section 2'!$C$16:$M$115,COLUMNS('Section 2'!$C$13:C$13),0),\"\")","v":""},{"$f":"IF($D5=\"\",\"\",IF(ISBLANK(VLOOKUP($B5,'Section 2'!$C$16:$M$115,COLUMNS('Section 2'!$C$13:D$13),0)),\"\",VLOOKUP($B5,'Section 2'!$C$16:$M$115,COLUMNS('Section 2'!$C$13:D$13),0)))","v":""},{"$f":"IF($D5=\"\",\"\",IF(ISBLANK(VLOOKUP($B5,'Section 2'!$C$16:$M$115,COLUMNS('Section 2'!$C$13:E$13),0)),\"\",VLOOKUP($B5,'Section 2'!$C$16:$M$115,COLUMNS('Section 2'!$C$13:E$13),0)))","v":""},{"$f":"IF($D5=\"\",\"\",IF(ISBLANK(VLOOKUP($B5,'Section 2'!$C$16:$M$115,COLUMNS('Section 2'!$C$13:F$13),0)),\"\",VLOOKUP($B5,'Section 2'!$C$16:$M$115,COLUMNS('Section 2'!$C$13:F$13),0)))","v":""},{"$f":"IF($D5=\"\",\"\",IF(ISBLANK(VLOOKUP($B5,'Section 2'!$C$16:$M$115,COLUMNS('Section 2'!$C$13:G$13),0)),\"\",VLOOKUP($B5,'Section 2'!$C$16:$M$115,COLUMNS('Section 2'!$C$13:G$13),0)))","v":""},{"$f":"IF($D5=\"\",\"\",IF(ISBLANK(VLOOKUP($B5,'Section 2'!$C$16:$M$115,COLUMNS('Section 2'!$C$13:H$13),0)),\"\",VLOOKUP($B5,'Section 2'!$C$16:$M$115,COLUMNS('Section 2'!$C$13:H$13),0)))","v":""},{"$f":"IF($D5=\"\",\"\",IF(ISBLANK(VLOOKUP($B5,'Section 2'!$C$16:$M$115,COLUMNS('Section 2'!$C$13:I$13),0)),\"\",VLOOKUP($B5,'Section 2'!$C$16:$M$115,COLUMNS('Section 2'!$C$13:I$13),0)))","v":""},{"$f":"IF($D5=\"\",\"\",IF(ISBLANK(VLOOKUP($B5,'Section 2'!$C$16:$M$115,COLUMNS('Section 2'!$C$13:J$13),0)),\"\",IF(VLOOKUP($B5,'Section 2'!$C$16:$M$115,COLUMNS('Section 2'!$C$13:J$13),0)=\"QPS\",\"QPS\",PROPER(VLOOKUP($B5,'Section 2'!$C$16:$M$115,COLUMNS('Section 2'!$C$13:J$13),0)))))","v":""},{"$f":"IF($D5=\"\",\"\",IF(ISBLANK(VLOOKUP($B5,'Section 2'!$C$16:$M$115,COLUMNS('Section 2'!$C$13:K$13),0)),\"\",VLOOKUP($B5,'Section 2'!$C$16:$M$115,COLUMNS('Section 2'!$C$13:K$13),0)))","v":""},{"$f":"IF($D5=\"\",\"\",IF(ISBLANK(VLOOKUP($B5,'Section 2'!$C$16:$M$115,COLUMNS('Section 2'!$C$13:L$13),0)),\"\",PROPER(VLOOKUP($B5,'Section 2'!$C$16:$M$115,COLUMNS('Section 2'!$C$13:L$13),0))))","v":""},{"$f":"IF($D5=\"\",\"\",IF(ISBLANK(VLOOKUP($B5,'Section 2'!$C$16:$M$115,COLUMNS('Section 2'!$C$13:M$13),0)),\"\",IF(VLOOKUP($B5,'Section 2'!$C$16:$M$115,COLUMNS('Section 2'!$C$13:M$13),0)=\"QPS\",\"QPS\",IF(VLOOKUP($B5,'Section 2'!$C$16:$M$115,COLUMNS('Section 2'!$C$13:M$13),0)=\"2nd Party Trans\",\"2nd Party Trans\",IF(VLOOKUP($B5,'Section 2'!$C$16:$M$115,COLUMNS('Section 2'!$C$13:M$13),0)=\"2nd Party Dest\",\"2nd Party Dest\",PROPER(VLOOKUP($B5,'Section 2'!$C$16:$M$115,COLUMNS('Section 2'!$C$13:M$13),0)))))))","v":""}]
[{"$f":"IF(D6=\"\",\"\",ROWS($A$1:A6))","v":""},5,"",{"$f":"IFERROR(VLOOKUP($B6,'Section 2'!$C$16:$M$115,COLUMNS('Section 2'!$C$13:C$13),0),\"\")","v":""},{"$f":"IF($D6=\"\",\"\",IF(ISBLANK(VLOOKUP($B6,'Section 2'!$C$16:$M$115,COLUMNS('Section 2'!$C$13:D$13),0)),\"\",VLOOKUP($B6,'Section 2'!$C$16:$M$115,COLUMNS('Section 2'!$C$13:D$13),0)))","v":""},{"$f":"IF($D6=\"\",\"\",IF(ISBLANK(VLOOKUP($B6,'Section 2'!$C$16:$M$115,COLUMNS('Section 2'!$C$13:E$13),0)),\"\",VLOOKUP($B6,'Section 2'!$C$16:$M$115,COLUMNS('Section 2'!$C$13:E$13),0)))","v":""},{"$f":"IF($D6=\"\",\"\",IF(ISBLANK(VLOOKUP($B6,'Section 2'!$C$16:$M$115,COLUMNS('Section 2'!$C$13:F$13),0)),\"\",VLOOKUP($B6,'Section 2'!$C$16:$M$115,COLUMNS('Section 2'!$C$13:F$13),0)))","v":""},{"$f":"IF($D6=\"\",\"\",IF(ISBLANK(VLOOKUP($B6,'Section 2'!$C$16:$M$115,COLUMNS('Section 2'!$C$13:G$13),0)),\"\",VLOOKUP($B6,'Section 2'!$C$16:$M$115,COLUMNS('Section 2'!$C$13:G$13),0)))","v":""},{"$f":"IF($D6=\"\",\"\",IF(ISBLANK(VLOOKUP($B6,'Section 2'!$C$16:$M$115,COLUMNS('Section 2'!$C$13:H$13),0)),\"\",VLOOKUP($B6,'Section 2'!$C$16:$M$115,COLUMNS('Section 2'!$C$13:H$13),0)))","v":""},{"$f":"IF($D6=\"\",\"\",IF(ISBLANK(VLOOKUP($B6,'Section 2'!$C$16:$M$115,COLUMNS('Section 2'!$C$13:I$13),0)),\"\",VLOOKUP($B6,'Section 2'!$C$16:$M$115,COLUMNS('Section 2'!$C$13:I$13),0)))","v":""},{"$f":"IF($D6=\"\",\"\",IF(ISBLANK(VLOOKUP($B6,'Section 2'!$C$16:$M$115,COLUMNS('Section 2'!$C$13:J$13),0)),\"\",IF(VLOOKUP($B6,'Section 2'!$C$16:$M$115,COLUMNS('Section 2'!$C$13:J$13),0)=\"QPS\",\"QPS\",PROPER(VLOOKUP($B6,'Section 2'!$C$16:$M$115,COLUMNS('Section 2'!$C$13:J$13),0)))))","v":""},{"$f":"IF($D6=\"\",\"\",IF(ISBLANK(VLOOKUP($B6,'Section 2'!$C$16:$M$115,COLUMNS('Section 2'!$C$13:K$13),0)),\"\",VLOOKUP($B6,'Section 2'!$C$16:$M$115,COLUMNS('Section 2'!$C$13:K$13),0)))","v":""},{"$f":"IF($D6=\"\",\"\",IF(ISBLANK(VLOOKUP($B6,'Section 2'!$C$16:$M$115,COLUMNS('Section 2'!$C$13:L$13),0)),\"\",PROPER(VLOOKUP($B6,'Section 2'!$C$16:$M$115,COLUMNS('Section 2'!$C$13:L$13),0))))","v":""},{"$f":"IF($D6=\"\",\"\",IF(ISBLANK(VLOOKUP($B6,'Section 2'!$C$16:$M$115,COLUMNS('Section 2'!$C$13:M$13),0)),\"\",IF(VLOOKUP($B6,'Section 2'!$C$16:$M$115,COLUMNS('Section 2'!$C$13:M$13),0)=\"QPS\",\"QPS\",IF(VLOOKUP($B6,'Section 2'!$C$16:$M$115,COLUMNS('Section 2'!$C$13:M$13),0)=\"2nd Party Trans\",\"2nd Party Trans\",IF(VLOOKUP($B6,'Section 2'!$C$16:$M$115,COLUMNS('Section 2'!$C$13:M$13),0)=\"2nd Party Dest\",\"2nd Party Dest\",PROPER(VLOOKUP($B6,'Section 2'!$C$16:$M$115,COLUMNS('Section 2'!$C$13:M$13),0)))))))","v":""}]
{"$rows_left_out":111}
{"sheet":"TempOutput","index":10,"n_rows":115,"n_cols":13,"rows_kept":115,"cut":false,"hidden":true,"merged":[]}
["MaxRow",1,"IMPT3","4","2020-06-18","blah","Original Submission",2019,1,"1234567890"]
[{"$f":"IF(OR(B2=\"\",B2=0),\"\",ROWS($A$1:A2))","v":2},2,1,"2019-01-15","Australia","ch3br",1,"2903.39.1520","Miami, FL","Abc123456789","1234567890","New","2nd Party Trans"]
[{"$f":"IF(OR(B3=\"\",B3=0),\"\",ROWS($A$1:A3))","v":3},3,"CH3Br","Company A",1,"Transformation"]
[{"$f":"IF(OR(B4=\"\",B4=0),\"\",ROWS($A$1:A4))","v":""}]
[{"$f":"IF(OR(B5=\"\",B5=0),\"\",ROWS($A$1:A5))","v":""}]
[{"$f":"IF(OR(B6=\"\",B6=0),\"\",ROWS($A$1:A6))","v":""}]
{"$rows_left_out":110}
{"sheet":"Data for Summary","index":11,"n_rows":103,"n_cols":10,"rows_kept":103,"cut":false,"hidden":true,"merged":[]}
[]
[null,"Column Set","Chemical","Quantity Imported","Transaction Type","Intended Use",null,null,null,"Chem List"]
[null,1,{"$f":"IF(ISBLANK('Section 2'!F16),\"\",'Section 2'!F16)","v":""},{"$f":"IF($C3=\"\",\"\",'Section 2'!G16)","v":""},{"$f":"IF($C3=\"\",\"\",'Section 2'!L16)","v":""},{"$f":"IF($C3=\"\",\"\",'Section 2'!M16)","v":""},null,null,{"$f":"IF(COUNTIF($C$3:$C$103,J3)>0,1,0)","v":0},"CH3Br"]
[null,1,{"$f":"IF(ISBLANK('Section 2'!F17),\"\",'Section 2'!F17)","v":""},{"$f":"IF($C4=\"\",\"\",'Section 2'!G17)","v":""},{"$f":"IF($C4=\"\",\"\",'Section 2'!L17)","v":""},{"$f":"IF($C4=\"\",\"\",'Section 2'!M17)","v":""}]
[null,1,{"$f":"IF(ISBLANK('Section 2'!F18),\"\",'Section 2'!F18)","v":""},{"$f":"IF($C5=\"\",\"\",'Section 2'!G18)","v":""},{"$f":"IF($C5=\"\",\"\",'Section 2'!L18)","v":""},{"$f":"IF($C5=\"\",\"\",'Section 2'!M18)","v":""}]
[null,1,{"$f":"IF(ISBLANK('Section 2'!F19),\"\",'Section 2'!F19)","v":""},{"$f":"IF($C6=\"\",\"\",'Section 2'!G19)","v":""},{"$f":"IF($C6=\"\",\"\",'Section 2'!L19)","v":""},{"$f":"IF($C6=\"\",\"\",'Section 2'!M19)","v":""}]
{"$rows_left_out":97}