{"text_format":"1","workbook":"xlsx","n_sheets":19,"sheets":["Control","CO2FFC","IndirectCO2","Stationary","Mobile Combustion","Coal","Gas and Oil","IP","Agriculture","Forest Management","Waste","Wastewater","Summary by Sector","Summary by Gas","Gas Intensity","Population","GSP from BEA","Factors","Notes"],"not_rendered":{"charts":36,"images":12,"macros":1,"external_links":1,"defined_names":216,"comments":1,"pivot_tables":0},"unopened":[],"bounds":{"document_bytes":16777216,"sheet_cells":100000,"rows_first":2000,"rows_last":500,"rows_between":2000,"halvings":0,"cell_chars":16384,"cell_head_chars":4096},"cells_cut":0,"cells_raw":0,"read":"whole","date_system":"1900"}

{"sheet":"Control","index":0,"n_rows":34,"n_cols":7,"rows_kept":34,"cut":false,"hidden":false,"merged":[[3,0,3,8],[18,3,18,5]]}
["State Inventory Tool - Synthesis Tool"]
[]
["This tool will collect data from the individual sector modules and combine them, the final step in conducting a GHG inventory for your state."]
["Before using this module, the user should conduct greenhouse gas inventories for all applicable sources using the individual sector modules. After completing each sector inventory, the user should export the data using the button provided in the final step of each sector module. The modules will then create an output file using a default file name. Please do not change the file names or alter the output files in any way. Once all ten output files have been generated, the user of this Synthesis module should then begin here by choosing a state. In step 2, when the user clicks on the buttons to get the data, the user will be prompted to locate the output files. This module will then open the specified file and copy the necessary data.  In order to attain correct results, please be sure to choose the proper files when prompted. Please see the User's Guide for the Synthesis Tool for additional information.\n\nNote: The default GWPs used in this module are from the IPCC Fourth Assessment Report (AR4) but can be adjusted in the Factors tab to reflect other sources."]
[]
[]
{"$rows_left_out":29}
{"sheet":"CO2FFC","index":1,"n_rows":41,"n_cols":33,"rows_kept":41,"cut":false,"hidden":false,"merged":[[0,0,0,4]]}
[{"$f":"\"Summary of CO2 Emissions from Fossil Fuel Combustion in \"&StateName&\" (MMTCO2E)\"","v":"Summary of CO2 Emissions from Fossil Fuel Combustion in Select a State . . . (MMTCO2E)"}]
[]
[null,"Emissions (MMTCO2 Eq.)",1990,1991,1992,1993,1994,1995,1996,1997,1998,1999,2000,2001,2002,2003,2004,2005,2006,2007,2008,2009,2010,2011,2012,2013,2014,2015,2016,2017,2018,2019,2020]
[null,"Residential",{"$f":"SUM(C5:C8)","v":0},{"$f":"SUM(D5:D8)","v":0},0,0,0,0,0,0,0,0,0,0,0,0,0,0,0,0,0,0,0,0,0,0,0,0,0,0,0,0,0]
[null,"Coal"]
[null,"Petroleum"]
{"$rows_left_out":36}
{"sheet":"IndirectCO2","index":2,"n_rows":58,"n_cols":33,"rows_kept":58,"cut":false,"hidden":false,"merged":[[0,0,0,14]]}
[{"$f":"\"Summary of Indirect CO2 Emissions from Electricity Consumption in \"&StateName&\" (MMTCO2E)\"","v":"Summary of Indirect CO2 Emissions from Electricity Consumption in Select a State . . . (MMTCO2E)"}]
[]
[null,"Emissions (MMTCO2 Eq.)",1990,1991,1992,1993,1994,1995,1996,1997,1998,1999,2000,2001,2002,2003,2004,2005,2006,2007,2008,2009,2010,2011,2012,2013,2014,2015,2016,2017,2018,2019,2020]
[null,"Residential",{"$f":"SUM(C5:C9)","v":0},0,0,0,0,0,0,0,0,0,{"$f":"SUM(M5:M9)","v":0},{"$f":"SUM(N5:N9)","v":0},0,0,0,0,0,0,0,0,0,0,0,0,0,0,0,0,0,0,0]
[null,"Space Heating"]
[null,"Air-conditioning"]
{"$rows_left_out":53}
{"sheet":"Stationary","index":3,"n_rows":27,"n_cols":33,"rows_kept":27,"cut":false,"hidden":false,"merged":[[0,0,0,7]]}
[{"$f":"\"Summary of CH4 and N2O Emissions from Stationary Combustion in \"&StateName&\" (MMTCO2E)\"","v":"Summary of CH4 and N2O Emissions from Stationary Combustion in Select a State . . . (MMTCO2E)"}]
[]
[null,"Emissions (MMTCO2 Eq.)",1990,1991,1992,1993,1994,1995,1996,1997,1998,1999,2000,2001,2002,2003,2004,2005,2006,2007,2008,2009,2010,2011,2012,2013,2014,2015,2016,2017,2018,2019,2020]
[null,"Residential",{"$f":"SUM(C5:C6)","v":0},0,0,0,0,0,0,0,0,0,{"$f":"SUM(M5:M6)","v":0},0,0,0,0,0,{"$f":"SUM(S5:S6)","v":0},0,0,0,0,0,0,0,0,0,0,0,0,0,0]
[null,"N2O"]
[null,"CH4"]
{"$rows_left_out":22}
{"sheet":"Mobile Combustion","index":4,"n_rows":107,"n_cols":61,"rows_kept":107,"cut":false,"hidden":false,"merged":[[0,0,0,6]]}
[{"$f":"\"Summary of CH4 and N2O Emissions from Mobile Combustion in \"&StateName&\" (MTCO2E)\"","v":"Summary of CH4 and N2O Emissions from Mobile Combustion in Select a State . . . (MTCO2E)"}]
[]
[null,"Total CH4 and N2O Emissions from Mobile Sources (MTCO2E)"]
[null,"Fuel Type/Vehicle Type",1990,1991,1992,1993,1994,1995,1996,1997,1998,1999,2000,2001,2002,2003,2004,2005,2006,2007,2008,2009,2010,2011,2012,2013,2014,2015,2016,2017,2018,2019,2020]
[null,"Gasoline Highway"]
[null,"Passenger Cars"]
{"$rows_left_out":102}
{"sheet":"Coal","index":5,"n_rows":32,"n_cols":33,"rows_kept":32,"cut":false,"hidden":false,"merged":[[1,2,1,12],[0,0,0,4]]}
[{"$f":"\"Summary of CH4 Emissions from Coal Mining Activities in \"&StateName&\" (MTCO2E)\"","v":"Summary of CH4 Emissions from Coal Mining Activities in Select a State . . . (MTCO2E)"}]
[]
[null,"Emissions (MTCO2E)"]
[null,null,1990,"1991*","1992*",1993,1994,1995,1996,1997,1998,1999,2000,2001,2002,2003,2004,2005,2006,2007,2008,2009,2010,2011,2012,2013,2014,2015,2016,2017,2018,2019,2020]
[null,"Coal Mining"]
[null,"Abandoned Coal Mines"]
{"$rows_left_out":27}
{"sheet":"Gas and Oil","index":6,"n_rows":34,"n_cols":33,"rows_kept":34,"cut":false,"hidden":false,"merged":[[1,2,1,12],[0,0,0,4]]}
[{"$f":"\"Summary of CH4 Emissions from Oil and Gas Activities in \"&StateName&\" (MMTCO2E)\"","v":"Summary of CH4 Emissions from Oil and Gas Activities in Select a State . . . (MMTCO2E)"}]
[]
[null,"Emissions (MMTCO2 Eq.)"]
[null,null,1990,1991,1992,1993,1994,1995,1996,1997,1998,1999,2000,2001,2002,2003,2004,2005,2006,2007,2008,2009,2010,2011,2012,2013,2014,2015,2016,2017,2018,2019,2020]
[null,"Natural Gas",{"$f":"(C19*CH4GWP*10^-6)+C26","v":0},0,0,0,0,0,0,0,0,0,0,0,0,0,0,0,{"$f":"(S19*CH4GWP*10^-6)+S26","v":0},0,0,0,0,0,0,0,0,0,0,0,0,0,0]
[null,"Oil",{"$f":"C23*CH4GWP*10^-6","v":0},0,0,0,0,0,0,0,0,0,0,0,0,0,0,0,{"$f":"S23*CH4GWP*10^-6","v":0},0,0,0,0,0,0,0,0,0,0,0,0,0,0]
{"$rows_left_out":29}
{"sheet":"IP","index":7,"n_rows":30,"n_cols":33,"rows_kept":30,"cut":false,"hidden":false,"merged":[[0,0,0,4]]}
[{"$f":"\"Summary of GHG Emissions from Industrial Processes in \"&StateName&\" (MTCO2E)\"","v":"Summary of GHG Emissions from Industrial Processes in Select a State . . . (MTCO2E)"}]
[]
[null,"Emissions (MTCO2 Eq.)",1990,1991,1992,1993,1994,1995,1996,1997,1998,1999,2000,2001,2002,2003,2004,2005,2006,2007,2008,2009,2010,2011,2012,2013,2014,2015,2016,2017,2018,2019,2020]
[null,"Carbon Dioxide Emissions",{"$f":"SUM(C5:C12)","v":0},{"$f":"SUM(D5:D12)","v":0},0,0,0,0,0,0,0,0,0,0,0,0,0,0,{"$f":"SUM(S5:S12)","v":0},0,0,0,0,0,0,0,{"$f":"SUM(AA5:AA12)","v":0},0,0,0,0,0,0]
[null,"Cement Manufacture"]
[null,"Lime Manufacture"]
{"$rows_left_out":25}
{"sheet":"Agriculture","index":8,"n_rows":61,"n_cols":33,"rows_kept":61,"cut":false,"hidden":false,"merged":[[2,1,2,12],[3,2,3,12],[0,0,0,5]]}
[{"$f":"\"Summary of GHG Emissions from Agriculture in \"&StateName&\" (MMTCO2E)\"","v":"Summary of GHG Emissions from Agriculture in Select a State . . . (MMTCO2E)"}]
[]
[]
[]
[]
[null,"Emissions (MMTCO2 Eq.)"]
{"$rows_left_out":56}
{"sheet":"Forest Management","index":9,"n_rows":59,"n_cols":52,"rows_kept":59,"cut":false,"hidden":false,"merged":[[0,0,0,6]]}
[{"$f":"\"Summary of Land-Use Change and Forest Emissions and Sequestration for \"&StateName","v":"Summary of Land-Use Change and Forest Emissions and Sequestration for Select a State . . ."}]
[null,null,null,null,null,null,null,null,null,null,null,null,null,null,null,null,null,null,null,null,null,null,null,null,null,null,null,null,null,null,null,null,null,null,null,null,null,null,null,null,null,null,null,null,null,null,null,null,null,null,null,"default"]
[]
[]
[]
[]
{"$rows_left_out":54}
{"sheet":"Waste","index":10,"n_rows":39,"n_cols":33,"rows_kept":39,"cut":false,"hidden":false,"merged":[[0,0,0,4]]}
[{"$f":"\"Summary of GHG Emissions from Solid Waste in \"&StateName&\" (MMTCO2E)\"","v":"Summary of GHG Emissions from Solid Waste in Select a State . . . (MMTCO2E)"}]
[]
[]
[]
[null,"Total Emissions from Landfills and Waste Combustion (MMTCO2E)"]
[null,null,1990,1991,1992,1993,1994,1995,1996,1997,1998,1999,2000,2001,2002,2003,2004,2005,2006,2007,2008,2009,2010,2011,2012,2013,2014,2015,2016,2017,2018,2019,2020]
{"$rows_left_out":34}
{"sheet":"Wastewater","index":11,"n_rows":26,"n_cols":33,"rows_kept":26,"cut":false,"hidden":false,"merged":[[0,0,0,7]]}
[{"$f":"\"Summary of CH4 and N2O Emissions from Wastewater in \"&StateName&\" (MMTCO2E)\"","v":"Summary of CH4 and N2O Emissions from Wastewater in Select a State . . . (MMTCO2E)"}]
[]
[]
[null,"Emissions (MMTCO2E)",1990,1991,1992,1993,1994,1995,1996,1997,1998,1999,2000,2001,2002,2003,2004,2005,2006,2007,2008,2009,2010,2011,2012,2013,2014,2015,2016,2017,2018,2019,2020]
[null,"Municipal CH4"]
[null,"Municipal N2O "]
{"$rows_left_out":21}
{"sheet":"Summary by Sector","index":12,"n_rows":115,"n_cols":33,"rows_kept":115,"cut":false,"hidden":false,"merged":[[0,0,0,4]]}
[{"$f":"\"Summary of GHG Emissions by Sector in \"&StateName&\" (\"&Units&\")\"","v":"Summary of GHG Emissions by Sector in Select a State . . . (MMTCO2E)"}]
[]
[]
[null,"Emissions (MMTCO2E)",1990,1991,1992,1993,1994,1995,1996,1997,1998,1999,2000,2001,2002,2003,2004,2005,2006,2007,2008,2009,2010,2011,2012,2013,2014,2015,2016,2017,2018,2019,2020]
[null,"Energy",{"$f":"SUM(C6:C10)","v":0},0,0,0,{"$f":"SUM(G6:G10)","v":0},0,0,0,0,0,{"$f":"SUM(M6:M10)","v":0},0,0,0,0,0,{"$f":"SUM(S6:S10)","v":0},0,0,0,0,0,0,0,0,0,0,0,0,0,0]
[null,"CO2 from Fossil Fuel Combustion",{"$f":"CO2FFC!C31*UFactor","v":0},{"$f":"CO2FFC!D31*UFactor","v":0},{"$f":"CO2FFC!E31*UFactor","v":0},{"$f":"CO2FFC!F31*UFactor","v":0},{"$f":"CO2FFC!G31*UFactor","v":0},{"$f":"CO2FFC!H31*UFactor","v":0},{"$f":"CO2FFC!I31*UFactor","v":0},{"$f":"CO2FFC!J31*UFactor","v":0},{"$f":"CO2FFC!K31*UFactor","v":0},{"$f":"CO2FFC!L31*UFactor","v":0},{"$f":"CO2FFC!M31*UFactor","v":0},{"$f":"CO2FFC!N31*UFactor","v":0},{"$f":"CO2FFC!O31*UFactor","v":0},{"$f":"CO2FFC!P31*UFactor","v":0},{"$f":"CO2FFC!Q31*UFactor","v":0},{"$f":"CO2FFC!R31*UFactor","v":0},{"$f":"CO2FFC!S31*UFactor","v":0},{"$f":"CO2FFC!T31*UFactor","v":0},{"$f":"CO2FFC!U31*UFactor","v":0},{"$f":"CO2FFC!V31*UFactor","v":0},{"$f":"CO2FFC!W31*UFactor","v":0},{"$f":"CO2FFC!X31*UFactor","v":0},{"$f":"CO2FFC!Y31*UFactor","v":0},{"$f":"CO2FFC!Z31*UFactor","v":0},{"$f":"CO2FFC!AA31*UFactor","v":0},{"$f":"CO2FFC!AB31*UFactor","v":0},{"$f":"CO2FFC!AC31*UFactor","v":0},{"$f":"CO2FFC!AD31*UFactor","v":0},{"$f":"CO2FFC!AE31*UFactor","v":0},{"$f":"CO2FFC!AF31*UFactor","v":0},{"$f":"CO2FFC!AG31*UFactor","v":0}]
{"$rows_left_out":110}
{"sheet":"Summary by Gas","index":13,"n_rows":176,"n_cols":33,"rows_kept":176,"cut":false,"hidden":false,"merged":[[0,0,0,4]]}
[{"$f":"\"Summary of GHG Emissions by Gas in \"&StateName&\" (\"&Units&\")\"","v":"Summary of GHG Emissions by Gas in Select a State . . . (MMTCO2E)"}]
[]
[]
[null,"Emissions (MMTCO2E)",1990,1991,1992,1993,1994,1995,1996,1997,1998,1999,2000,2001,2002,2003,2004,2005,2006,2007,2008,2009,2010,2011,2012,2013,2014,2015,2016,2017,2018,2019,2020]
[null,"Gross CO2",{"$f":"IF(C11<0,SUM(C7:C10),SUM(C7:C11))","v":0},{"$f":"IF(D11<0,SUM(D7:D10),SUM(D7:D11))","v":0},0,0,0,0,0,0,0,0,0,0,0,0,0,0,0,0,0,0,0,0,0,0,0,0,0,0,0,0,0]
[null,"Net CO2",{"$f":"SUM(C7:C11)","v":0},{"$f":"SUM(D7:D11)","v":0},0,0,0,0,0,0,0,0,{"$f":"SUM(M7:M11)","v":0},0,0,0,0,0,{"$f":"SUM(S7:S11)","v":0},0,0,0,0,0,0,0,0,0,0,0,0,0,0]
{"$rows_left_out":171}
{"sheet":"Gas Intensity","index":14,"n_rows":16,"n_cols":33,"rows_kept":16,"cut":false,"hidden":false,"merged":[[0,0,0,4]]}
[{"$f":"\"Summary of GHG Emissions by Population in \"&StateName","v":"Summary of GHG Emissions by Population in Select a State . . ."}]
[]
[]
[]
[null,"Emissions Per Capita  (MTCO2E)",1990,1991,1992,1993,1994,1995,1996,1997,1998,1999,2000,2001,2002,2003,2004,2005,2006,2007,2008,2009,2010,2011,2012,2013,2014,2015,2016,2017,2018,2019,2020]
[null,"Gross Emissions Intensity",{"$f":"IF(ISERROR(('Summary by Gas'!C38/VLOOKUP(StateID,Population!$A$3:$AF$54,'Gas Intensity'!C5-1988,FALSE))*1000),0,('Summary by Gas'!C38/VLOOKUP(StateID,Population!$A$3:$AF$54,'Gas Intensity'!C5-1988,FALSE))*1000)","v":0},{"$f":"IF(ISERROR(('Summary by Gas'!D38/VLOOKUP(StateID,Population!$A$3:$AF$54,'Gas Intensity'!D5-1988,FALSE))*1000),0,('Summary by Gas'!D38/VLOOKUP(StateID,Population!$A$3:$AF$54,'Gas Intensity'!D5-1988,FALSE))*1000)","v":0},{"$f":"IF(ISERROR(('Summary by Gas'!E38/VLOOKUP(StateID,Population!$A$3:$AF$54,'Gas Intensity'!E5-1988,FALSE))*1000),0,('Summary by Gas'!E38/VLOOKUP(StateID,Population!$A$3:$AF$54,'Gas Intensity'!E5-1988,FALSE))*1000)","v":0},{"$f":"IF(ISERROR(('Summary by Gas'!F38/VLOOKUP(StateID,Population!$A$3:$AF$54,'Gas Intensity'!F5-1988,FALSE))*1000),0,('Summary by Gas'!F38/VLOOKUP(StateID,Population!$A$3:$AF$54,'Gas Intensity'!F5-1988,FALSE))*1000)","v":0},{"$f":"IF(ISERROR(('Summary by Gas'!G38/VLOOKUP(StateID,Population!$A$3:$AF$54,'Gas Intensity'!G5-1988,FALSE))*1000),0,('Summary by Gas'!G38/VLOOKUP(StateID,Population!$A$3:$AF$54,'Gas Intensity'!G5-1988,FALSE))*1000)","v":0},{"$f":"IF(ISERROR(('Summary by Gas'!H38/VLOOKUP(StateID,Population!$A$3:$AF$54,'Gas Intensity'!H5-1988,FALSE))*1000),0,('Summary by Gas'!H38/VLOOKUP(StateID,Population!$A$3:$AF$54,'Gas Intensity'!H5-1988,FALSE))*1000)","v":0},{"$f":"IF(ISERROR(('Summary by Gas'!I38/VLOOKUP(StateID,Population!$A$3:$AF$54,'Gas Intensity'!I5-1988,FALSE))*1000),0,('Summary by Gas'!I38/VLOOKUP(StateID,Population!$A$3:$AF$54,'Gas Intensity'!I5-1988,FALSE))*1000)","v":0},{"$f":"IF(ISERROR(('Summary by Gas'!J38/VLOOKUP(StateID,Population!$A$3:$AF$54,'Gas Intensity'!J5-1988,FALSE))*1000),0,('Summary by Gas'!J38/VLOOKUP(StateID,Population!$A$3:$AF$54,'Gas Intensity'!J5-1988,FALSE))*1000)","v":0},{"$f":"IF(ISERROR(('Summary by Gas'!K38/VLOOKUP(StateID,Population!$A$3:$AF$54,'Gas Intensity'!K5-1988,FALSE))*1000),0,('Summary by Gas'!K38/VLOOKUP(StateID,Population!$A$3:$AF$54,'Gas Intensity'!K5-1988,FALSE))*1000)","v":0},{"$f":"IF(ISERROR(('Summary by Gas'!L38/VLOOKUP(StateID,Population!$A$3:$AF$54,'Gas Intensity'!L5-1988,FALSE))*1000),0,('Summary by Gas'!L38/VLOOKUP(StateID,Population!$A$3:$AF$54,'Gas Intensity'!L5-1988,FALSE))*1000)","v":0},{"$f":"IF(ISERROR(('Summary by Gas'!M38/VLOOKUP(StateID,Population!$A$3:$AF$54,'Gas Intensity'!M5-1988,FALSE))*1000),0,('Summary by Gas'!M38/VLOOKUP(StateID,Population!$A$3:$AF$54,'Gas Intensity'!M5-1988,FALSE))*1000)","v":0},{"$f":"IF(ISERROR(('Summary by Gas'!N38/VLOOKUP(StateID,Population!$A$3:$AF$54,'Gas Intensity'!N5-1988,FALSE))*1000),0,('Summary by Gas'!N38/VLOOKUP(StateID,Population!$A$3:$AF$54,'Gas Intensity'!N5-1988,FALSE))*1000)","v":0},{"$f":"IF(ISERROR(('Summary by Gas'!O38/VLOOKUP(StateID,Population!$A$3:$AF$54,'Gas Intensity'!O5-1988,FALSE))*1000),0,('Summary by Gas'!O38/VLOOKUP(StateID,Population!$A$3:$AF$54,'Gas Intensity'!O5-1988,FALSE))*1000)","v":0},{"$f":"IF(ISERROR(('Summary by Gas'!P38/VLOOKUP(StateID,Population!$A$3:$AF$54,'Gas Intensity'!P5-1988,FALSE))*1000),0,('Summary by Gas'!P38/VLOOKUP(StateID,Population!$A$3:$AF$54,'Gas Intensity'!P5-1988,FALSE))*1000)","v":0},{"$f":"IF(ISERROR(('Summary by Gas'!Q38/VLOOKUP(StateID,Population!$A$3:$AF$54,'Gas Intensity'!Q5-1988,FALSE))*1000),0,('Summary by Gas'!Q38/VLOOKUP(StateID,Population!$A$3:$AF$54,'Gas Intensity'!Q5-1988,FALSE))*1000)","v":0},{"$f":"IF(ISERROR(('Summary by Gas'!R38/VLOOKUP(StateID,Population!$A$3:$AF$54,'Gas Intensity'!R5-1988,FALSE))*1000),0,('Summary by Gas'!R38/VLOOKUP(StateID,Population!$A$3:$AF$54,'Gas Intensity'!R5-1988,FALSE))*1000)","v":0},{"$f":"IF(ISERROR(('Summary by Gas'!S38/VLOOKUP(StateID,Population!$A$3:$AF$54,'Gas Intensity'!S5-1988,FALSE))*1000),0,('Summary by Gas'!S38/VLOOKUP(StateID,Population!$A$3:$AF$54,'Gas Intensity'!S5-1988,FALSE))*1000)","v":0},{"$f":"IF(ISERROR(('Summary by Gas'!T38/VLOOKUP(StateID,Population!$A$3:$AF$54,'Gas Intensity'!T5-1988,FALSE))*1000),0,('Summary by Gas'!T38/VLOOKUP(StateID,Population!$A$3:$AF$54,'Gas Intensity'!T5-1988,FALSE))*1000)","v":0},{"$f":"IF(ISERROR(('Summary by Gas'!U38/VLOOKUP(StateID,Population!$A$3:$AF$54,'Gas Intensity'!U5-1988,FALSE))*1000),0,('Summary by Gas'!U38/VLOOKUP(StateID,Population!$A$3:$AF$54,'Gas Intensity'!U5-1988,FALSE))*1000)","v":0},{"$f":"IF(ISERROR(('Summary by Gas'!V38/VLOOKUP(StateID,Population!$A$3:$AF$54,'Gas Intensity'!V5-1988,FALSE))*1000),0,('Summary by Gas'!V38/VLOOKUP(StateID,Population!$A$3:$AF$54,'Gas Intensity'!V5-1988,FALSE))*1000)","v":0},{"$f":"IF(ISERROR(('Summary by Gas'!W38/VLOOKUP(StateID,Population!$A$3:$AF$54,'Gas Intensity'!W5-1988,FALSE))*1000),0,('Summary by Gas'!W38/VLOOKUP(StateID,Population!$A$3:$AF$54,'Gas Intensity'!W5-1988,FALSE))*1000)","v":0},{"$f":"IF(ISERROR(('Summary by Gas'!X38/VLOOKUP(StateID,Population!$A$3:$AF$54,'Gas Intensity'!X5-1988,FALSE))*1000),0,('Summary by Gas'!X38/VLOOKUP(StateID,Population!$A$3:$AF$54,'Gas Intensity'!X5-1988,FALSE))*1000)","v":0},{"$f":"IF(ISERROR(('Summary by Gas'!Y38/VLOOKUP(StateID,Population!$A$3:$AF$54,'Gas Intensity'!Y5-1988,FALSE))*1000),0,('Summary by Gas'!Y38/VLOOKUP(StateID,Population!$A$3:$AF$54,'Gas Intensity'!Y5-1988,FALSE))*1000)","v":0},{"$f":"IF(ISERROR(('Summary by Gas'!Z38/VLOOKUP(StateID,Population!$A$3:$AF$54,'Gas Intensity'!Z5-1988,FALSE))*1000),0,('Summary by Gas'!Z38/VLOOKUP(StateID,Population!$A$3:$AF$54,'Gas Intensity'!Z5-1988,FALSE))*1000)","v":0},{"$f":"IF(ISERROR(('Summary by Gas'!AA38/VLOOKUP(StateID,Population!$A$3:$AF$54,'Gas Intensity'!AA5-1988,FALSE))*1000),0,('Summary by Gas'!AA38/VLOOKUP(StateID,Population!$A$3:$AF$54,'Gas Intensity'!AA5-1988,FALSE))*1000)","v":0},{"$f":"IF(ISERROR(('Summary by Gas'!AB38/VLOOKUP(StateID,Population!$A$3:$AF$54,'Gas Intensity'!AB5-1988,FALSE))*1000),0,('Summary by Gas'!AB38/VLOOKUP(StateID,Population!$A$3:$AF$54,'Gas Intensity'!AB5-1988,FALSE))*1000)","v":0},{"$f":"IF(ISERROR(('Summary by Gas'!AC38/VLOOKUP(StateID,Population!$A$3:$AF$54,'Gas Intensity'!AC5-1988,FALSE))*1000),0,('Summary by Gas'!AC38/VLOOKUP(StateID,Population!$A$3:$AF$54,'Gas Intensity'!AC5-1988,FALSE))*1000)","v":0},{"$f":"IF(ISERROR(('Summary by Gas'!AD38/VLOOKUP(StateID,Population!$A$3:$AF$54,'Gas Intensity'!AD5-1988,FALSE))*1000),0,('Summary by Gas'!AD38/VLOOKUP(StateID,Population!$A$3:$AF$54,'Gas Intensity'!AD5-1988,FALSE))*1000)","v":0},{"$f":"IF(ISERROR(('Summary by Gas'!AE38/VLOOKUP(StateID,Population!$A$3:$AF$54,'Gas Intensity'!AE5-1988,FALSE))*1000),0,('Summary by Gas'!AE38/VLOOKUP(StateID,Population!$A$3:$AF$54,'Gas Intensity'!AE5-1988,FALSE))*1000)","v":0},{"$f":"IF(ISERROR(('Summary by Gas'!AF38/VLOOKUP(StateID,Population!$A$3:$AF$54,'Gas Intensity'!AF5-1988,FALSE))*1000),0,('Summary by Gas'!AF38/VLOOKUP(StateID,Population!$A$3:$AF$54,'Gas Intensity'!AF5-1988,FALSE))*1000)","v":0},{"$f":"IF(ISERROR(('Summary by Gas'!AG38/VLOOKUP(StateID,Population!$A$3:$AF$54,'Gas Intensity'!AG5-1988,FALSE))*1000),0,('Summary by Gas'!AG38/VLOOKUP(StateID,Population!$A$3:$AF$54,'Gas Intensity'!AG5-1988,FALSE))*1000)","v":0}]
{"$rows_left_out":11}
{"sheet":"Population","index":15,"n_rows":59,"n_cols":32,"rows_kept":59,"cut":false,"hidden":false,"merged":[]}
[null,"1990-1999: U.S. Census Data Archives"]
[null,"000 people","Source: U.S. Census American FactFinder https://factfinder.census.gov/"]
["State",1990,1991,1992,1993,1994,1995,1996,1997,1998,1999,2000,2001,2002,2003,2004,2005,2006,2007,2008,2009,2010,2011,2012,2013,2014,2015,2016,2017,2018,2019,2020]
["AL",4048.5079999999998,4091.0250000000001,4139.2690000000002,4193.1139999999996,4232.9650000000001,4262.7309999999998,4290.4030000000002,4320.2809999999999,4351.0370000000003,4369.8620000000001,4451.6869999999999,4462.8320000000003,4469.9059999999999,4486.598,4506.5739999999996,4537.299,4597.6880000000001,4637.9040000000005,4677.4639999999999,4708.7079999999996,4785.4369999999999,4799.0690000000004,4815.5879999999997,4830.0810000000001,4841.799,4852.3469999999998,4863.5249999999996,4874.4859999999999,4887.6809999999996,4903.1850000000004,4728.915]
["AK",553.12,569.27300000000002,587.07299999999998,596.99300000000005,600.62400000000002,601.34500000000003,604.91800000000001,608.846,615.20500000000004,619.5,627.428,633.16,642.39099999999996,650.42600000000004,660.97500000000002,668.625,677.32500000000005,682.29700000000003,688.125,698.47299999999996,713.91,722.12800000000004,730.44299999999998,737.06799999999998,736.28300000000002,737.49800000000005,741.45600000000002,739.7,735.13900000000001,731.54499999999996,774.42100000000005]
["AZ",3679.056,3762.3939999999998,3867.3330000000001,3993.39,4147.5609999999997,4306.9080000000004,4432.308,4552.2070000000003,4667.277,4778.3320000000003,5166.8100000000004,5303.6319999999996,5449.1949999999997,5585.5119999999997,5750.4750000000004,5961.2389999999996,6192.1,6362.241,6499.3770000000004,6595.7780000000002,6407.1719999999996,6472.643,6554.9780000000001,6632.7640000000001,6730.4129999999996,6829.6760000000004,6941.0720000000001,7044.0079999999998,7158.0240000000003,7278.7169999999996,8456.4480000000003]
{"$rows_left_out":54}
{"sheet":"GSP from BEA","index":16,"n_rows":57,"n_cols":32,"rows_kept":57,"cut":false,"hidden":false,"merged":[[56,0,56,23]]}
["Source: U.S. Department of Commerce, Bureau of Economic Analysis 1997-2019. Annual Gross Domestic Product (GDP) by State in current dollars <https://apps.bea.gov/itable/iTable.cfm?ReqID=70>"]
["Gross Domestic Product by State (millions of current dollars)"]
["State",1990,1991,1992,1993,1994,1995,1996,1997,1998,1999,2000,2001,2002,2003,2004,2005,2006,2007,2008,2009,2010,2011,2012,2013,2014,2015,2016,2017,2018,2019,2020]
["AL",71610,76043.3,81260.100000000006,84562.8,90098.5,95819.1,100145.9,104087.4,109404.3,115030.9,119242.4,122449.3,127792.3,133739.20000000001,146524.70000000001,155970.4,163853.6,169678.4,172686.8,168348,174753,181349.8,186299,191481,194211,200402.7,203829.8,210364.4,221735.5,230968.2]
["AK",25039.5,22282.5,22752.799999999999,23284.2,23604.7,25448.799999999999,26736.9,25744.799999999999,24170.400000000001,24732.6,26778.3,28420.400000000001,29605.3,31799.7,34970.699999999997,39774.800000000003,44435.3,48972.6,54752.4,49585.9,52882.5,56259.9,57670.1,56622.8,55523.4,50641.599999999999,49363.4,51803.1,54734.1,55406.1]
["AZ",70631.7,73358.3,82682.2,89299.8,100374.2,109905.7,119530.2,132418,143392.4,155344.5,164611.6,171474.2,179413.3,192751.2,205420.79999999999,228231.2,248230.7,262322,259366.7,243929.4,248210,257947.8,268288.8,275199.09999999998,284430,297141.2,311091,327495.8,348297.1,366189.9]
{"$rows_left_out":52}
{"sheet":"Factors","index":17,"n_rows":55,"n_cols":11,"rows_kept":55,"cut":false,"hidden":false,"merged":[]}
[]
[]
[null,null,null,null,null,null,null,null,1,{"$f":"VLOOKUP(StateChoice,$I$4:$K$55,2,FALSE)","v":"Select a State . . ."},{"$f":"VLOOKUP(StateChoice,$I$4:$K$55,3,FALSE)","v":"XX"}]
[null,null,null,null,null,null,null,null,1,"Select a State . . .","XX"]
[null,null,null,null,null,null,null,null,2,"Alabama","AL"]
[null,"CH4 GWP",25,null,null,null,null,null,3,"Alaska","AK"]
{"$rows_left_out":50}
{"sheet":"Notes","index":18,"n_rows":4,"n_cols":26,"rows_kept":4,"cut":false,"hidden":false,"merged":[]}
[null,null,null,null,null,null,null,null,null,null,null,null,null,null,null,null,null,null,null,null,null,null,null,null,null,"Wastewater"]
[null,null,null,null,null,null,null,null,null,null,null,null,null,null,null,null,null,null,null,null,null,null,null,null,null,"$B$4"]
["Notes and Comments"]
["Use this sheet to keep a record of data sources, edits, or any other useful notes about the use of this tool."]