{"text_format":"1","workbook":"xlsx","n_sheets":17,"sheets":["Control","Municipal WW, CH4","Municipal WW, N2O, direct","Municipal WW, N2O, effluent","Ind WW Fruit","Ind WW Meat","Ind WW Poultry","Ind WW P&P","Summary","Tracker","Uncertainty","Population","Vegetable Data","Red Meat Data","Data Sources","Lookups","Notes"],"not_rendered":{"charts":2,"images":77,"macros":1,"external_links":0,"defined_names":43,"comments":3,"pivot_tables":0},"unopened":[],"bounds":{"document_bytes":16777216,"sheet_cells":100000,"rows_first":2000,"rows_last":500,"rows_between":2000,"halvings":0,"cell_chars":16384,"cell_head_chars":4096},"cells_cut":0,"cells_raw":0,"read":"whole","date_system":"1900"}

{"sheet":"Control","index":0,"n_rows":108,"n_cols":7,"rows_kept":108,"cut":false,"hidden":false,"merged":[]}
["State Inventory Tool - Wastewater Module"]
[]
[]
[]
["1.  Select those sources you wish to analyze."]
[null,"CH4 from industrial wastewater"]
[null,"- Fruits and Vegetables"]
[null,"- Red Meat"]
{"$rows_left_out":101}
{"sheet":"Municipal WW, CH4","index":1,"n_rows":66,"n_cols":29,"rows_kept":66,"cut":false,"hidden":false,"merged":[]}
[null,{"$f":"\"4. \"&SelectedState & \" Municipal Wastewater Methane Emissions\"","v":"4. Select a state . . . Municipal Wastewater Methane Emissions"}]
[]
[null,null,"State Population",null,"Per Capita BOD5",null,"Days per Year",null,"Unit Conversion",null,"Emission Factor",null,"WW BOD5 anaerobically digested",null,"Emissions ",null,"CH4 GWP",null,"Unit Conversion",null,"C/CO2",null,"Emissions ",null,"Emissions ",null,null,null,"State Population"]
[null,null,null,null,"  (kg/day)",null,"(days)",null,"(metric tons/kg)",null,"(Gg CH4/Gg BOD5)",null,"(percent)",null,"(metric tons CH4)",null,"(CO2 Eq.)",null,"(MMT/MT)",null,null,null,"(MMTCE)",null,"(MMTCO2E)"]
[]
[2,1990,null,"x",{"$f":"Control!$F$19","v":0},"x",{"$f":"Control!$D$103","v":365},"x",{"$f":"Control!$D$105","v":1E-3},"x",{"$f":"Control!$F$21","v":0},"x",{"$f":"Control!$F$20","v":0},"=",{"$f":"C6*$E$6*$G$6*$M$6*$K$6*$I$6","v":0},"x",{"$f":"Control!$D$101","v":25},"x",{"$f":"Control!$D$104","v":9.9999999999999995E-7},"x",{"$f":"Control!$D$100","v":0.27272727272727271},"=",{"$f":"O6*Q$6*S$6*U$6","v":0},"=",{"$f":"W6*C_CO2","v":0},null,null,null,{"$f":"VLOOKUP(SelectedStateAbbr,Population!$A$6:$AF$57,$A6,FALSE)","v":{"$error":"#N/A"}}]
[null,null,null,null,null,null,null,null,null,null,null,null,null,null,null,null,null,null,null,null,null,null,null,null,null,null,null,null,{"$f":"\"\"","v":""}]
[3,{"$f":"B6+1","v":1991},null,"x",{"$f":"Control!$F$19","v":0},"x",{"$f":"Control!$D$103","v":365},"x",{"$f":"Control!$D$105","v":1E-3},"x",{"$f":"Control!$F$21","v":0},"x",{"$f":"Control!$F$20","v":0},"=",{"$f":"C8*$E$6*$G$6*$M$6*$K$6*$I$6","v":0},"x",{"$f":"Control!$D$101","v":25},"x",{"$f":"Control!$D$104","v":9.9999999999999995E-7},"x",{"$f":"Control!$D$100","v":0.27272727272727271},"=",{"$f":"O8*Q$6*S$6*U$6","v":0},"=",{"$f":"W8*C_CO2","v":0},null,null,null,{"$f":"VLOOKUP(SelectedStateAbbr,Population!$A$6:$AF$57,$A8,FALSE)","v":{"$error":"#N/A"}}]
{"$rows_left_out":59}
{"sheet":"Municipal WW, N2O, direct","index":2,"n_rows":66,"n_cols":21,"rows_kept":66,"cut":false,"hidden":false,"merged":[]}
[null,{"$f":"\"5. \"&SelectedState & \" Direct Nitrous Oxide Emissions from Municipal Wastewater Treatment\"","v":"5. Select a state . . . Direct Nitrous Oxide Emissions from Municipal Wastewater Treatment"}]
[]
[null,null,"State Population",null,"Fraction of Population not on Septic",null,"Direct N2O Emissions from Wastewater Treatment",null,"Unit Conversion",null,"Emissions",null,"N2O GWP",null,"Unit Conversion",null,"C/CO2",null,"Emissions ",null,"Emissions "]
[null,null,null,null,null,null," (g N2O/person/year)",null,"(g/metric ton)",null,"(Metric Tons N2O)",null,"(CO2 Eq.)",null,"(MMT/MT)",null,null,null,"(MMTCE)",null,"(MMTCO2E)"]
[]
[2,1990,{"$f":"'Municipal WW, CH4'!C6","v":0},"x",{"$f":"Control!$F$26","v":0},"x",{"$f":"Control!$F$27","v":0},"x",{"$f":"0.000001","v":9.9999999999999995E-7},"=",{"$f":"C6*E6*G6*I6","v":0},"x",{"$f":"Control!$D$102","v":298},"x",{"$f":"Control!$D$104","v":9.9999999999999995E-7},"x",{"$f":"Control!$D$100","v":0.27272727272727271},"=",{"$f":"K6*M6*O6*Q6","v":0},"=",{"$f":"S6*C_CO2","v":0}]
[]
[3,{"$f":"B6+1","v":1991},{"$f":"'Municipal WW, CH4'!C8","v":0},"x",{"$f":"Control!$F$26","v":0},"x",{"$f":"Control!$F$27","v":0},"x",{"$f":"0.000001","v":9.9999999999999995E-7},"=",{"$f":"C8*E8*G8*I8","v":0},"x",{"$f":"Control!$D$102","v":298},"x",{"$f":"Control!$D$104","v":9.9999999999999995E-7},"x",{"$f":"Control!$D$100","v":0.27272727272727271},"=",{"$f":"K8*M8*O8*Q8","v":0},"=",{"$f":"S8*C_CO2","v":0}]
{"$rows_left_out":59}
{"sheet":"Municipal WW, N2O, effluent","index":3,"n_rows":66,"n_cols":45,"rows_kept":66,"cut":false,"hidden":false,"merged":[]}
[null,{"$f":"\"6. \"&SelectedState & \" Municipal Wastewater Nitrous Oxide Emissions (formerly Human Sewage)\"","v":"6. Select a state . . . Municipal Wastewater Nitrous Oxide Emissions (formerly Human Sewage)"}]
[]
[null,null,"State Population",null,"Protein",null,"FracNPR ",null,"Fraction Non-Consumption N",null,"Unit Conversion",null,"N in Domestic Wastewater",null,"Direct N Emissions from Domestic Wastewater",null,"Biosolids Available N",null,"Percentage of Biosolids Used as Fertilizer",null,"Emission Factor",null,"N2O/N2",null,"Emissions ",null,"N2O GWP",null,"Unit Conversion",null,"C/CO2",null,"Emissions from Biosolids",null,"Direct Emissions",null,"Total Emissions",null,"Emissions ",null,null,null,null,null,"Protein"]
[null,null,null,null,"(kg/ person/ year)",null,"(kg N/kg protein) ",null,null,null,"(metric tons/kg)",null,"(metric tons)",null,"(metric tons)",null,"(metric tons)",null,null,null,"(kg N2O-N/ kg sewage N-produced) ",null,null,null,"(metric tons N2O)",null,"(CO2 Eq.)",null,"(MMT/MT)",null,null,null,"(MMTCE)",null,"(MMTCE)",null,"(MMTCE)",null,"(MMTCO2E)",null,null,null,null,null,"(Kg/person/year)"]
[]
[2,1990,{"$f":"'Municipal WW, CH4'!C6","v":0},"x",null,"x",{"$f":"Control!$F$33","v":0},"x",{"$f":"Control!$F$25","v":0},"x",{"$f":"Control!$D$105","v":1E-3},"=",{"$f":"C6*E6*G6*I6*K6","v":0},"-",{"$f":"'Municipal WW, N2O, direct'!K6*(1/Control!$D$99)","v":0},"=",{"$f":"M6-O6","v":0},"x (1 -",null,") x",{"$f":"Control!$F$32","v":0},"x",{"$f":"Control!$D$99","v":1.5714285714285714},"=",{"$f":"Q6*(1-S6)*U6*W6","v":0},"x",{"$f":"Control!$D$102","v":298},"x",{"$f":"Control!$D$104","v":9.9999999999999995E-7},"x",{"$f":"Control!$D$100","v":0.27272727272727271},"=",{"$f":"Y6*AA$6*AC$6*AE$6","v":0},"+",{"$f":"'Municipal WW, N2O, direct'!S6","v":0},"=",{"$f":"AG6+AI6","v":0},"=",{"$f":"AK6*C_CO2","v":0},null,null,null,null,null,43.099499999999999]
[]
[3,{"$f":"B6+1","v":1991},{"$f":"'Municipal WW, CH4'!C8","v":0},"x",null,"x",{"$f":"Control!$F$33","v":0},"x",{"$f":"Control!$F$25","v":0},"x",{"$f":"Control!$D$105","v":1E-3},"=",{"$f":"C8*E8*G8*I8*K8","v":0},"-",{"$f":"'Municipal WW, N2O, direct'!K8*(1/Control!$D$99)","v":0},"=",{"$f":"M8-O8","v":0},"x (1 -",null,") x",{"$f":"Control!$F$32","v":0},"x",{"$f":"Control!$D$99","v":1.5714285714285714},"=",{"$f":"Q8*(1-S8)*U8*W8","v":0},"x",{"$f":"Control!$D$102","v":298},"x",{"$f":"Control!$D$104","v":9.9999999999999995E-7},"x",{"$f":"Control!$D$100","v":0.27272727272727271},"=",{"$f":"Y8*AA$6*AC$6*AE$6","v":0},"+",{"$f":"'Municipal WW, N2O, direct'!S8","v":0},"=",{"$f":"AG8+AI8","v":0},"=",{"$f":"AK8*C_CO2","v":0},null,null,null,null,null,43.464750000000002]
{"$rows_left_out":59}
{"sheet":"Ind WW Fruit","index":4,"n_rows":66,"n_cols":27,"rows_kept":66,"cut":false,"hidden":false,"merged":[[1,0,1,7]]}
[null,{"$f":"\"7. \"&SelectedState & \" Industrial Wastewater Methane - Fruits and Vegetables\"","v":"7. Select a state . . . Industrial Wastewater Methane - Fruits and Vegetables"}]
[]
[null,null,"Production Processed",null,"WW Outflow ",null,"Unit Conversion",null,"COD ",null,"Emission Factor",null,"COD Degraded",null,"Emissions ",null,"Unit Conversion",null,"Emissions ",null,"CH4 GWP",null,"C/CO2",null,"Emissions ",null,"Emissions "]
[null,null,"(metric tons)",null,"(m3/metric ton)",null,"(l/m3)",null,"(g COD/l)",null,"(g CH4/g COD)",null,"(percent)",null,"(g CH4)",null,"(g/Tg)",null,"(Tg or MMT CH4)",null,"(CO2 Eq.)",null,null,null,"(MMTCE)",null,"(MMTCO2E)"]
[]
[null,1990,null,"x",{"$f":"Control!$F$37","v":0},"x",{"$f":"Control!$D$106","v":1000},"x",{"$f":"Control!$F$38","v":0},"x",{"$f":"Control!$F$40","v":0},"x",{"$f":"Control!$F$39","v":0},"=",{"$f":"C6*$E$6*$G$6*$I$6*$M$6*$K$6","v":0},"x",{"$f":"Control!$D$107","v":9.9999999999999998E-13},"=",{"$f":"O6*Q6","v":0},"x",{"$f":"Control!$D$101","v":25},"x",{"$f":"Control!$D$100","v":0.27272727272727271},"=",{"$f":"S6*U$6*W$6","v":0},"=",{"$f":"Y6*C_CO2","v":0}]
[]
[null,{"$f":"B6+1","v":1991},null,"x",{"$f":"Control!$F$37","v":0},"x",{"$f":"Control!$D$106","v":1000},"x",{"$f":"Control!$F$38","v":0},"x",{"$f":"Control!$F$40","v":0},"x",{"$f":"Control!$F$39","v":0},"=",{"$f":"C8*$E$6*$G$6*$I$6*$M$6*$K$6","v":0},"x",{"$f":"Control!$D$107","v":9.9999999999999998E-13},"=",{"$f":"O8*Q8","v":0},"x",{"$f":"Control!$D$101","v":25},"x",{"$f":"Control!$D$100","v":0.27272727272727271},"=",{"$f":"S8*U$6*W$6","v":0},"=",{"$f":"Y8*C_CO2","v":0}]
{"$rows_left_out":59}
{"sheet":"Ind WW Meat","index":5,"n_rows":66,"n_cols":27,"rows_kept":66,"cut":false,"hidden":false,"merged":[[1,0,1,7]]}
[null,{"$f":"\"8. \"&SelectedState & \" Industrial Wastewater Methane - Red Meat\"","v":"8. Select a state . . . Industrial Wastewater Methane - Red Meat"}]
[{"$f":"SelectedStateAbbr","v":"XX"}]
[null,null,"Production Processed",null,"WW Outflow ",null,"Unit Conversion",null,"COD ",null,"Emission Factor",null,"COD Degraded",null,"Emissions ",null,"Unit Conversion",null,"Emissions ",null,"CH4 GWP",null,"C/CO2",null,"Emissions ",null,"Emissions "]
[null,null,"(metric tons)",null,"(m3/metric ton)",null,"(l/m3)",null,"(g COD/l)",null,"(g CH4/g COD)",null,"(percent)",null,"(g CH4)",null,"(g/Tg)",null,"(Tg or MMT CH4)",null,"(CO2 Eq.)",null,null,null,"(MMTCE)",null,"(MMTCO2E)"]
[]
[2,1990,null,"x",{"$f":"Control!$F$44","v":0},"x",{"$f":"Control!$D$106","v":1000},"x",{"$f":"Control!$F$45","v":0},"x",{"$f":"Control!$F$47","v":0},"x",{"$f":"Control!$F$46","v":0},"=",{"$f":"C6*$E$6*$I$6*$M$6*$K$6*$G$6","v":0},"x",{"$f":"Control!$D$107","v":9.9999999999999998E-13},"=",{"$f":"O6*Q6","v":0},"x",{"$f":"Control!$D$101","v":25},"x",{"$f":"Control!$D$100","v":0.27272727272727271},"=",{"$f":"S6*U$6*W$6","v":0},"=",{"$f":"Y6*C_CO2","v":0}]
[]
[3,{"$f":"B6+1","v":1991},null,"x",{"$f":"Control!$F$44","v":0},"x",{"$f":"Control!$D$106","v":1000},"x",{"$f":"Control!$F$45","v":0},"x",{"$f":"Control!$F$47","v":0},"x",{"$f":"Control!$F$46","v":0},"=",{"$f":"C8*$E$6*$I$6*$M$6*$K$6*$G$6","v":0},"x",{"$f":"Control!$D$107","v":9.9999999999999998E-13},"=",{"$f":"O8*Q8","v":0},"x",{"$f":"Control!$D$101","v":25},"x",{"$f":"Control!$D$100","v":0.27272727272727271},"=",{"$f":"S8*U$6*W$6","v":0},"=",{"$f":"Y8*C_CO2","v":0}]
{"$rows_left_out":59}
{"sheet":"Ind WW Poultry","index":6,"n_rows":66,"n_cols":27,"rows_kept":66,"cut":false,"hidden":false,"merged":[[1,0,1,7]]}
[null,{"$f":"\"9. \"&SelectedState & \" Industrial Wastewater Methane - Poultry\"","v":"9. Select a state . . . Industrial Wastewater Methane - Poultry"}]
[]
[null,null,"Production Processed",null,"WW Outflow ",null,"Unit Conversion",null,"COD ",null,"Emission Factor",null,"COD Degraded",null,"Emissions ",null,"Unit Conversion",null,"Emissions ",null,"CH4 GWP",null,"C/CO2",null,"Emissions ",null,"Emissions "]
[null,null,"(metric tons)",null,"(m3/metric ton)",null,"(l/m3)",null,"(g COD/l)",null,"(g CH4/g COD)",null,"(percent)",null,"(g CH4)",null,"(g/Tg)",null,"(Tg or MMT CH4)",null,"(CO2 Eq.)",null,null,null,"(MMTCE)",null,"(MMTCO2E)"]
[]
[{"$f":"C6*1000","v":0},1990,null,"x",{"$f":"Control!$F$50","v":0},"x",{"$f":"Control!$D$106","v":1000},"x",{"$f":"Control!$F$51","v":0},"x",{"$f":"Control!$F$53","v":0},"x",{"$f":"Control!$F$52","v":0},"=",{"$f":"C6*$E$6*$I$6*$M$6*$K$6*$G$6","v":0},"x",{"$f":"Control!$D$107","v":9.9999999999999998E-13},"=",{"$f":"O6*Q6","v":0},"x",{"$f":"Control!$D$101","v":25},"x",{"$f":"Control!$D$100","v":0.27272727272727271},"=",{"$f":"S6*U$6*W$6","v":0},"=",{"$f":"Y6*C_CO2","v":0}]
[]
[{"$f":"C8*1000","v":0},{"$f":"B6+1","v":1991},null,"x",{"$f":"Control!$F$50","v":0},"x",{"$f":"Control!$D$106","v":1000},"x",{"$f":"Control!$F$51","v":0},"x",{"$f":"Control!$F$53","v":0},"x",{"$f":"Control!$F$52","v":0},"=",{"$f":"C8*$E$6*$I$6*$M$6*$K$6*$G$6","v":0},"x",{"$f":"Control!$D$107","v":9.9999999999999998E-13},"=",{"$f":"O8*Q8","v":0},"x",{"$f":"Control!$D$101","v":25},"x",{"$f":"Control!$D$100","v":0.27272727272727271},"=",{"$f":"S8*U$6*W$6","v":0},"=",{"$f":"Y8*C_CO2","v":0}]
{"$rows_left_out":59}
{"sheet":"Ind WW P&P","index":7,"n_rows":66,"n_cols":30,"rows_kept":66,"cut":false,"hidden":false,"merged":[[2,3,2,5],[1,0,1,7]]}
[null,{"$f":"\"10. \"&SelectedState & \" Industrial Wastewater Methane - Pulp & Paper\"","v":"10. Select a state . . . Industrial Wastewater Methane - Pulp & Paper"}]
[]
[null,null,null,"Production Processed \n(metric tons)",null,null,null,"WW Outflow ",null,"Unit Conversion",null,"BOD Degraded",null,"Emission Factor",null,"TA",null,"Emissions ",null,"Unit Conversion",null,"Emissions ",null,"CH4 GWP",null,"C/CO2",null,"Emissions ",null,"Emissions "]
[null,null,null,"Woodpulp",null,"Paper & Paperboard",null,"(m3/metric ton)",null,"(l/m3)",null,"(g BOD / l)",null,"(g CH4/g BOD)",null,"(percent)",null,"(g CH4)",null,"(g/Tg)",null,"(Tg or MMT CH4)",null,"(CO2 Eq.)",null,null,null,"(MMTCE)",null,"(MMTCO2E)"]
[]
[null,1990,"(",null,"+",null," )   x ",{"$f":"Control!$F$57","v":0},"x",{"$f":"Control!$D$106","v":1000},"x",{"$f":"Control!$F$58","v":0},"x",{"$f":"Control!$F$60","v":0},"x",{"$f":"Control!$F$59","v":0},"=",{"$f":"(D6+F6)*$H$6*$J$6*$L$6*$P$6*$N$6","v":0},"x",{"$f":"Control!$D$107","v":9.9999999999999998E-13},"=",{"$f":"R6*T6","v":0},"x",{"$f":"Control!$D$101","v":25},"x",{"$f":"Control!$D$100","v":0.27272727272727271},"=",{"$f":"V6*X$6*Z$6","v":0},"=",{"$f":"AB6*C_CO2","v":0}]
[]
[null,{"$f":"B6+1","v":1991},"(",null,"+",null," )   x ",{"$f":"Control!$F$57","v":0},"x",{"$f":"Control!$D$106","v":1000},"x",{"$f":"Control!$F$58","v":0},"x",{"$f":"Control!$F$60","v":0},"x",{"$f":"Control!$F$59","v":0},"=",{"$f":"(D8+F8)*$H$6*$J$6*$L$6*$P$6*$N$6","v":0},"x",{"$f":"Control!$D$107","v":9.9999999999999998E-13},"=",{"$f":"R8*T8","v":0},"x",{"$f":"Control!$D$101","v":25},"x",{"$f":"Control!$D$100","v":0.27272727272727271},"=",{"$f":"V8*X$6*Z$6","v":0},"=",{"$f":"AB8*C_CO2","v":0}]
{"$rows_left_out":59}
{"sheet":"Summary","index":8,"n_rows":23,"n_cols":33,"rows_kept":23,"cut":false,"hidden":false,"merged":[[2,1,2,13]]}
[null,{"$f":"\"11. \"&SelectedState & \" Emissions Summary\"","v":"11. Select a state . . . Emissions Summary"}]
[2018]
[null,{"$f":"Tracker!B14","v":"Emissions were not calculated for the following sources: Municipal methane, Municipal nitrous oxides, Industrial fruits & vegetables, Industrial red meat, Industrial poultry, and Industrial pulp & paper."}]
[]
[null,"Emissions (MMTCO2E)",1990,1991,1992,1993,1994,1995,1996,1997,1998,1999,2000,2001,2002,2003,2004,2005,2006,2007,2008,2009,2010,2011,2012,2013,2014,2015,2016,2017,2018,2019,2020]
[null,"Municipal CH4",{"$f":"C16*C_CO2","v":0},0,0,0,0,0,0,0,0,0,0,0,0,0,0,0,0,0,0,0,0,0,0,0,0,0,0,0,0,{"$f":"AF16*C_CO2","v":0},0]
[null,"Municipal N2O",{"$f":"C17*C_CO2","v":0},0,0,0,0,0,0,0,0,0,0,0,0,0,0,0,0,0,0,0,0,0,0,0,0,0,0,0,0,0,0]
[null,"Industrial CH4",{"$f":"C18*C_CO2","v":0},0,0,0,0,0,0,0,0,0,0,0,0,0,0,0,0,0,0,0,0,0,0,0,0,0,0,0,0,0,0]
{"$rows_left_out":16}
{"sheet":"Tracker","index":9,"n_rows":14,"n_cols":7,"rows_kept":14,"cut":false,"hidden":true,"merged":[]}
["Sector","Sum","Not included?","Text of missing sector","\"and\"?","Punctuation","Text used"]
["Municipal methane",{"$f":"SUM(Summary!C16:R16)","v":0},{"$f":"IF(ISERROR(B2),TRUE,IF(B2=0,TRUE,FALSE))","v":true},{"$f":"IF(C2=TRUE,\" \"&A2,\"\")","v":" Municipal methane"},{"$f":"IF(AND($C$10=A2,$C$9>1),\" and\",\"\")","v":""},{"$f":"IF(C2=TRUE,IF($C$10=A2,\".\",\",\"),\"\")","v":","},{"$f":"E2&D2&F2","v":" Municipal methane,"}]
["Municipal nitrous oxides",{"$f":"SUM(Summary!C17:R17)","v":0},true," Municipal nitrous oxides","",","," Municipal nitrous oxides,"]
["Industrial fruits & vegetables",{"$f":"SUM(Summary!C19:R19)","v":0},true," Industrial fruits & vegetables","",","," Industrial fruits & vegetables,"]
["Industrial red meat",{"$f":"SUM(Summary!C20:R20)","v":0},true," Industrial red meat","",","," Industrial red meat,"]
["Industrial poultry",{"$f":"SUM(Summary!C21:R21)","v":0},true,{"$f":"IF(C6=TRUE,\" \"&A6,\"\")","v":" Industrial poultry"},{"$f":"IF(AND($C$10=A6,$C$9>1),\" and\",\"\")","v":""},{"$f":"IF(C6=TRUE,IF($C$10=A6,\".\",\",\"),\"\")","v":","},{"$f":"E6&D6&F6","v":" Industrial poultry,"}]
["Industrial pulp & paper",{"$f":"SUM(Summary!C22:R22)","v":0},true," Industrial pulp & paper"," and","."," and Industrial pulp & paper."]
[]
{"$rows_left_out":7}
{"sheet":"Uncertainty","index":10,"n_rows":3,"n_cols":2,"rows_kept":3,"cut":false,"hidden":false,"merged":[]}
[]
["Uncertainty Associated With These Emissions Estimates"]
[null,"Excerpted from EIIP Guidance, Chapter 14."]

{"sheet":"Population","index":11,"n_rows":59,"n_cols":32,"rows_kept":59,"cut":false,"hidden":false,"merged":[]}
["SELECTED STATE:",null,{"$f":"VLOOKUP(SelectedState,Lookups!$B$4:$C$55,2,FALSE)","v":{"$error":"#N/A"}}]
[null,{"$f":"VLOOKUP($C$1,$A$6:$AF$57,B4-1988,FALSE)","v":{"$error":"#N/A"}},{"$f":"VLOOKUP($C$1,$A$6:$AF$57,C4-1988,FALSE)","v":{"$error":"#N/A"}},{"$f":"VLOOKUP($C$1,$A$6:$AF$57,D4-1988,FALSE)","v":{"$error":"#N/A"}},{"$error":"#N/A"},{"$error":"#N/A"},{"$error":"#N/A"},{"$error":"#N/A"},{"$error":"#N/A"},{"$error":"#N/A"},{"$error":"#N/A"},{"$error":"#N/A"},{"$error":"#N/A"},{"$error":"#N/A"},{"$error":"#N/A"},{"$error":"#N/A"},{"$error":"#N/A"},{"$error":"#N/A"},{"$error":"#N/A"},{"$error":"#N/A"},{"$error":"#N/A"},{"$error":"#N/A"},{"$f":"VLOOKUP($C$1,$A$6:$AF$57,W4-1988,FALSE)","v":{"$error":"#N/A"}},{"$error":"#N/A"},{"$f":"VLOOKUP($C$1,$A$6:$AF$57,Y4-1988,FALSE)","v":{"$error":"#N/A"}},{"$error":"#N/A"},{"$error":"#N/A"},{"$error":"#N/A"},{"$error":"#N/A"},{"$f":"VLOOKUP($C$1,$A$6:$AF$57,AD4-1988,FALSE)","v":{"$error":"#N/A"}},{"$f":"VLOOKUP($C$1,$A$6:$AF$57,AE4-1988,FALSE)","v":{"$error":"#N/A"}},{"$error":"#N/A"}]
[]
[null,1990,1991,1992,1993,1994,1995,1996,1997,1998,1999,2000,2001,2002,2003,2004,2005,2006,2007,2008,2009,2010,2011,2012,2013,2014,2015,2016,2017,2018,2019,2020]
[]
["AL",4048508,4091025,4139269,4193114,4232965,4262731,4290403,4320281,4351037,4369862,4451687,4462832,4469906,4486598,4506574,4537299,4597688,4637904,4677464,4708708,4785437,4799069,4815588,4830081,4841799,4852347,4863525,4874486,4887681,4903185]
["AK",553120,569273,587073,596993,600624,601345,604918,608846,615205,619500,627428,633160,642391,650426,660975,668625,677325,682297,688125,698473,713910,722128,730443,737068,736283,737498,741456,739700,735139,731545]
["AZ",3679056,3762394,3867333,3993390,4147561,4306908,4432308,4552207,4667277,4778332,5166810,5303632,5449195,5585512,5750475,5961239,6192100,6362241,6499377,6595778,6407172,6472643,6554978,6632764,6730413,6829676,6941072,7044008,7158024,7278717]
{"$rows_left_out":52}
{"sheet":"Vegetable Data","index":12,"n_rows":100,"n_cols":31,"rows_kept":100,"cut":false,"hidden":true,"merged":[]}
["Data on Vegetable Production were obtained from:"]
["USDA Quick Stats 2.0, Annual Vegetable Production. Available online by state: http://quickstats.nass.usda.gov/"]
["THIS DATASET IS NOT USED IN THE MODULE, DEFAULTS FOR VEGETABLE DATA ARE NOT PROVIDED IN THE STATE INVENTORY TOOL"]
["Vegetable Production, Metric Tons"]
["State",1998,1999,2000,2001,2002,2003,2004,2005,2006,2007,2008,2009,2010,2011]
["Alabama",{"$f":"B56/MT_Hundredweight+IF(ISERROR((VLOOKUP($A6,$Q$56:$Y$81,B$5-1996,FALSE)/MT_Ton)),0,(VLOOKUP($A6,$Q$56:$Y$81,B$5-1996,FALSE)/MT_Ton))","v":31.649860489142242},34.494791769065138,50.040309120072408,56.644613877036278,57.508253729870013,58.321091238419413,35.968059753310925,33.173930817672364,{"$f":"J56/MT_Hundredweight+IF(ISERROR((VLOOKUP($A6,$Q$56:$Y$81,J$5-1996,FALSE)/MT_Ton)),0,(VLOOKUP($A6,$Q$56:$Y$81,J$5-1996,FALSE)/MT_Ton))","v":39.321014476077202},41.505515280303712,43.842423117383234,45.366493445913356,46.331737987315769,42.877178575980821]
["Arizona",968.14027502661918,1180.9512952337088,1083.6648059292024,1052.7769806043254,1151.943156647352,2075.7329851137447,2103.2678557158556,2064.7088764040432,2067.7062147168194,1878.6706916347996,1680.5415489258835,{"$f":"M57/MT_Hundredweight+IF(ISERROR((VLOOKUP($A7,$Q$56:$Y$81,M$5-1996,FALSE)/MT_Ton)),0,(VLOOKUP($A7,$Q$56:$Y$81,M$5-1996,FALSE)/MT_Ton))","v":1605.4556840736327},1605.4048817293483,1687.7554818142594]
["Arkansas",34.088373014790442,32.310290964838629,28.195301077807294,41.099096526029008,40.591073083185634,37.034908983282016,24.740741666472346,29.160545619209707,34.342384736212125,28.804929209219345,31.243441734867542,17.476006433812088,26.671230749277171,27.839684667816933]
{"$rows_left_out":93}
{"sheet":"Red Meat Data","index":13,"n_rows":105,"n_cols":33,"rows_kept":105,"cut":false,"hidden":false,"merged":[]}
["Data on Red Meat Production were obtained from:"]
["USDA Quick Stats 2.0, Annual Red Meat Production. Available online by state: http://quickstats.nass.usda.gov/"]
[]
[]
["Red Meat Production, Metric Tons"]
["State",null,1990,1991,1992,1993,1994,1995,1996,1997,1998,1999,2000,2001,2002,2003,2004,2005,2006,2007,2008,2009,2010,2011,2012,2013,2014,2015,2016,2017,2018,2019,2020]
["Alabama","AL",{"$f":"(C58/MT_Lbs)*10^6","v":94802.400000000009},86909.760000000009,17917.2,18325.440000000002,18234.72,51846.48,62596.80000000001,60419.519999999997,69718.320000000007,42366.240000000005,19141.920000000002,20684.160000000003,22634.639999999999,18370.800000000003,15286.320000000003,14061.6,{"$f":"(S58/MT_Lbs)*10^6","v":13880.160000000002},12519.360000000002,10886.400000000001,10342.080000000002,9843.1200000000008,{"$f":"(X58/MT_Lbs)*10^6","v":9117.36},5171.0400000000009,{"$f":"(Z58/MT_Lbs)*10^6","v":5034.9600000000009},4173.12,{"$f":"(AB58/MT_Lbs)*10^6","v":3991.6800000000007},4581.3600000000006,{"$f":"(AD58/MT_Lbs)*10^6","v":6032.880000000001},6259.6800000000012,{"$f":"(AF58/MT_Lbs)*10^6","v":4263.84},0]
["Alaska","AK",{"$f":"(C59/MT_Lbs)*10^6","v":0},0,0,0,0,0,0,0,0,181.44000000000003,272.16000000000003,226.8,272.16000000000003,226.8,226.8,317.52,317.52,226.8,226.8,272.16000000000003,272.16000000000003,272.16000000000003,226.8,317.52,272.16000000000003,272.16000000000003,589.68000000000006,{"$f":"(AD59/MT_Lbs)*10^6","v":453.6},408.24,{"$f":"(AF59/MT_Lbs)*10^6","v":317.52},0]
{"$rows_left_out":98}
{"sheet":"Data Sources","index":14,"n_rows":24,"n_cols":14,"rows_kept":24,"cut":false,"hidden":false,"merged":[[15,2,15,9],[23,2,23,9],[1,1,1,9],[21,2,21,8]]}
[null,null,null,null,null,null,null,null,null,null,null,null,null,"Municipal WW, CH4"]
[null,"Recommended Data Sources for Wastewater Treatment Activity Data"]
[]
[]
[]
[null,"Methane Emissions from Municipal Wastewater Treatment"]
[]
[null,null,"- State agencies responsible for handling demographic or census information"]
{"$rows_left_out":17}
{"sheet":"Lookups","index":15,"n_rows":55,"n_cols":11,"rows_kept":55,"cut":false,"hidden":false,"merged":[]}
[null,"Select a state . . .",{"$f":"VLOOKUP(SelectedState,$B$3:$C$55,2,FALSE)","v":"XX"},{"$f":"VLOOKUP(SelectedState,$B$3:$D$55,3,FALSE)","v":0},null,1,null,{"$f":"VLOOKUP($F$1,$F$3:$H$18,3,FALSE)","v":"Control"}]
[null,"State","StateAbbr.","State ID",null,null,"SheetList","Sheet.name",null,"VersionNumber",0]
[null,"Select a State . . .","XX",0,null,1,"Control Panel","Control",null,"VersionDate","2020-10-06"]
[null,"Alabama","AL",1,null,2,"Domestic - Methane Emissions","Dom WW"]
[null,"Alaska","AK",2,null,3,"Domestic - Nitrous Oxide Emissions","Human Sewage"]
[null,"Arizona","AZ",3,null,4,"Industrial - Fruits and Vegetables (Methane)","Ind WW Fruit"]
[null,"Arkansas","AR",4,null,5,"Industrial - Red Meat and Poultry (Methane)","Ind WW Meat"]
[null,"California","CA",5,null,6,"Industrial - Pulp and Paper (Methane)","Ind WW P&P"]
{"$rows_left_out":48}
{"sheet":"Notes","index":16,"n_rows":4,"n_cols":26,"rows_kept":4,"cut":false,"hidden":false,"merged":[]}
[null,null,null,null,null,null,null,null,null,null,null,null,null,null,null,null,null,null,null,null,null,null,null,null,null,"Control"]
[null,null,null,null,null,null,null,null,null,null,null,null,null,null,null,null,null,null,null,null,null,null,null,null,null,"$E$12"]
["Notes and Comments"]
["Use this sheet to keep a record of data sources, edits, or any other useful notes about the use of this tool."]