{"text_format":"1","workbook":"xlsx","n_sheets":17,"sheets":["Control","Municipal WW, CH4","Municipal WW, N2O, direct","Municipal WW, N2O, effluent","Ind WW Fruit","Ind WW Meat","Ind WW Poultry","Ind WW P&P","Summary","Tracker","Uncertainty","Population","Vegetable Data","Red Meat Data","Data Sources","Lookups","Notes"],"not_rendered":{"charts":2,"images":77,"macros":1,"external_links":0,"defined_names":43,"comments":3,"pivot_tables":0},"unopened":[],"bounds":{"document_bytes":16777216,"sheet_cells":100000,"rows_first":2000,"rows_last":500,"rows_between":2000,"halvings":0,"cell_chars":16384,"cell_head_chars":4096},"cells_cut":0,"cells_raw":0,"read":"whole","date_system":"1900"}

{"sheet":"Control","index":0,"n_rows":108,"n_cols":7,"rows_kept":108,"cut":false,"hidden":false,"merged":[]}
["State Inventory Tool - Wastewater Module"]
[]
[]
[]
["1.  Select those sources you wish to analyze."]
[null,"CH4 from industrial wastewater"]
[null,"- Fruits and Vegetables"]
[null,"- Red Meat"]
[null,"- Poultry"]
[null,"- Pulp and Paper"]
[]
["2. Choose a State"]
["This is very important - it selects the correct default variables for your state."]
[]
["3. Fill in the variables used throughout this module:"]
[]
["Municipal Wastewater CH4 Emissions"]
[null,null,null,"Default Values",null,"Values Used","Use the Default? (Check for Yes)"]
[null,"Per capita 5-day Biochemical Oxygen Demand (BOD5) (kg/day)",null,0.09]
[null,"Fraction of wastewater BOD5 anaerobically digested",null,0.16250000000000001]
[null,"Emission Factor (Gg CH4/Gg BOD5)",null,0.6]
[]
["Municipal Wastewater Direct N2O Emissions"]
[]
[null,"Factor non-consumption nitrogen",null,1.75]
[null,"Fraction of population not on septic",null,0.81399999999999995]
[null,"Direct wastewater treatment plant emissions (g N2O/person/year)",null,4]
[]
[]
["Municipal Wastewater N2O Emissions from Biosolids"]
[]
[null,"Emission Factor (kg N2O-N/kg sewage N-produced) ",null,5.0000000000000001E-3]
[null,"Fraction of nitrogen in protein (FracNPR)",null,0.16]
[]
["Industrial Wastewater CH4 Emissions - Fruits and Vegetables"]
[]
[null,"Wastewater Outflow (m3/metric ton)",null,5.6]
[null,"WW Organic Content - Chemical Oxygen Demand (COD) (g/l)",null,5]
[null,"Fraction of COD anaerobically degraded",null,0.05]
[null,"Emission factor (g CH4/g COD)",null,0.25]
[]
["Industrial Wastewater CH4 Emissions - Red Meat"]
[]
[null,"Red Meat - Wastewater Outflow (m3/metric ton)",null,7.9]
[null,"WW Organic Content - Chemical Oxygen Demand (COD) (g/l)",null,4.0999999999999996]
[null,"Fraction of COD anaerobically degraded",null,0.33]
[null,"Emission factor (g CH4/g COD)",null,0.25]
[]
["Industrial Wastewater CH4 Emissions - Poultry"]
[null,"Poultry - Wastewater Outflow (m3/metric ton)",null,16.600000000000001]
[null,"WW Organic Content - Chemical Oxygen Demand (COD) (g/l)",null,4.0999999999999996]
[null,"Fraction of COD anaerobically degraded",null,0.25]
[null,"Emission factor (g CH4/g COD)",null,0.25]
[]
["Industrial Wastewater CH4 Emissions - Pulp and Paper"]
[]
[null,"Wastewater Outflow (m3/metric ton)",null,85]
[null,"WW Organic Content - Biochemical Oxygen Demand (BOD) (g/l)",null,0.4]
[null,"Fraction of BOD anaerobically degraded",null,0.10299999999999999]
[null,"Emission factor (g CH4/g BOD)",null,0.6]
[]
[]
[]
[]
[]
[]
[]
[]
[]
[]
[]
[]
[]
[]
[]
[]
["4.-10.  Complete sector worksheets . . ."]
[]
[]
[]
[]
["11. View Summary Data"]
[]
[]
[]
[]
[]
["12. Export the results for use in the Synthesis Tool."]
[]
[]
[]
[]
[]
["You should not find it necessary to change many of these constants, as they do not vary by state."]
["The default GWPs used in this module are from the IPCC Fourth Assessment Report (AR4) but can be adjusted in the cells below to reflect other sources."]
[]
[null,"Constants and/or Factors",null,"Default"]
[]
[null,"N2O/N2 (molecular weight ratio)",null,{"$f":"44/28","v":1.5714285714285714}]
[null,"C/CO2 (molecular weight ratio)",null,{"$f":"12/44","v":0.27272727272727271}]
[null,"Methane GWP*",null,25]
[null,"Nitrous Oxide GWP*",null,298]
[null,"Number of Days per Year",null,365]
[null,"Million Metric Tons / Metric Tons (MMT/MT)",null,9.9999999999999995E-7]
[null,"Metric Tons / Kg",null,1E-3]
[null,"Liters / Cubic Meter (l/m3)",null,1000]
[null,"Grams / Teragram (g/Tg)",null,{"$f":"10^-12","v":9.9999999999999998E-13}]
[null,"* As of January 2014, the UNFCCC approved the use of new (AR4) GWPs for GHG Inventories."]

{"sheet":"Municipal WW, CH4","index":1,"n_rows":66,"n_cols":29,"rows_kept":66,"cut":false,"hidden":false,"merged":[]}
[null,{"$f":"\"4. \"&SelectedState & \" Municipal Wastewater Methane Emissions\"","v":"4. Select a state . . . Municipal Wastewater Methane Emissions"}]
[]
[null,null,"State Population",null,"Per Capita BOD5",null,"Days per Year",null,"Unit Conversion",null,"Emission Factor",null,"WW BOD5 anaerobically digested",null,"Emissions ",null,"CH4 GWP",null,"Unit Conversion",null,"C/CO2",null,"Emissions ",null,"Emissions ",null,null,null,"State Population"]
[null,null,null,null,"  (kg/day)",null,"(days)",null,"(metric tons/kg)",null,"(Gg CH4/Gg BOD5)",null,"(percent)",null,"(metric tons CH4)",null,"(CO2 Eq.)",null,"(MMT/MT)",null,null,null,"(MMTCE)",null,"(MMTCO2E)"]
[]
[2,1990,null,"x",{"$f":"Control!$F$19","v":0},"x",{"$f":"Control!$D$103","v":365},"x",{"$f":"Control!$D$105","v":1E-3},"x",{"$f":"Control!$F$21","v":0},"x",{"$f":"Control!$F$20","v":0},"=",{"$f":"C6*$E$6*$G$6*$M$6*$K$6*$I$6","v":0},"x",{"$f":"Control!$D$101","v":25},"x",{"$f":"Control!$D$104","v":9.9999999999999995E-7},"x",{"$f":"Control!$D$100","v":0.27272727272727271},"=",{"$f":"O6*Q$6*S$6*U$6","v":0},"=",{"$f":"W6*C_CO2","v":0},null,null,null,{"$f":"VLOOKUP(SelectedStateAbbr,Population!$A$6:$AF$57,$A6,FALSE)","v":{"$error":"#N/A"}}]
[null,null,null,null,null,null,null,null,null,null,null,null,null,null,null,null,null,null,null,null,null,null,null,null,null,null,null,null,{"$f":"\"\"","v":""}]
[3,{"$f":"B6+1","v":1991},null,"x",{"$f":"Control!$F$19","v":0},"x",{"$f":"Control!$D$103","v":365},"x",{"$f":"Control!$D$105","v":1E-3},"x",{"$f":"Control!$F$21","v":0},"x",{"$f":"Control!$F$20","v":0},"=",{"$f":"C8*$E$6*$G$6*$M$6*$K$6*$I$6","v":0},"x",{"$f":"Control!$D$101","v":25},"x",{"$f":"Control!$D$104","v":9.9999999999999995E-7},"x",{"$f":"Control!$D$100","v":0.27272727272727271},"=",{"$f":"O8*Q$6*S$6*U$6","v":0},"=",{"$f":"W8*C_CO2","v":0},null,null,null,{"$f":"VLOOKUP(SelectedStateAbbr,Population!$A$6:$AF$57,$A8,FALSE)","v":{"$error":"#N/A"}}]
[null,null,null,null,null,null,null,null,null,null,null,null,null,null,null,null,null,null,null,null,null,null,null,null,null,null,null,null,{"$f":"\"\"","v":""}]
[4,{"$f":"B8+1","v":1992},null,"x",{"$f":"Control!$F$19","v":0},"x",{"$f":"Control!$D$103","v":365},"x",{"$f":"Control!$D$105","v":1E-3},"x",{"$f":"Control!$F$21","v":0},"x",{"$f":"Control!$F$20","v":0},"=",{"$f":"C10*$E$6*$G$6*$M$6*$K$6*$I$6","v":0},"x",{"$f":"Control!$D$101","v":25},"x",{"$f":"Control!$D$104","v":9.9999999999999995E-7},"x",{"$f":"Control!$D$100","v":0.27272727272727271},"=",{"$f":"O10*Q$6*S$6*U$6","v":0},"=",{"$f":"W10*C_CO2","v":0},null,null,null,{"$f":"VLOOKUP(SelectedStateAbbr,Population!$A$6:$AF$57,$A10,FALSE)","v":{"$error":"#N/A"}}]
[null,null,null,null,null,null,null,null,null,null,null,null,null,null,null,null,null,null,null,null,null,null,null,null,null,null,null,null,{"$f":"\"\"","v":""}]
[5,{"$f":"B10+1","v":1993},null,"x",{"$f":"Control!$F$19","v":0},"x",{"$f":"Control!$D$103","v":365},"x",{"$f":"Control!$D$105","v":1E-3},"x",{"$f":"Control!$F$21","v":0},"x",{"$f":"Control!$F$20","v":0},"=",{"$f":"C12*$E$6*$G$6*$M$6*$K$6*$I$6","v":0},"x",{"$f":"Control!$D$101","v":25},"x",{"$f":"Control!$D$104","v":9.9999999999999995E-7},"x",{"$f":"Control!$D$100","v":0.27272727272727271},"=",{"$f":"O12*Q$6*S$6*U$6","v":0},"=",{"$f":"W12*C_CO2","v":0},null,null,null,{"$f":"VLOOKUP(SelectedStateAbbr,Population!$A$6:$AF$57,$A12,FALSE)","v":{"$error":"#N/A"}}]
[null,null,null,null,null,null,null,null,null,null,null,null,null,null,null,null,null,null,null,null,null,null,null,null,null,null,null,null,{"$f":"\"\"","v":""}]
[6,{"$f":"B12+1","v":1994},null,"x",{"$f":"Control!$F$19","v":0},"x",{"$f":"Control!$D$103","v":365},"x",{"$f":"Control!$D$105","v":1E-3},"x",{"$f":"Control!$F$21","v":0},"x",{"$f":"Control!$F$20","v":0},"=",{"$f":"C14*$E$6*$G$6*$M$6*$K$6*$I$6","v":0},"x",{"$f":"Control!$D$101","v":25},"x",{"$f":"Control!$D$104","v":9.9999999999999995E-7},"x",{"$f":"Control!$D$100","v":0.27272727272727271},"=",{"$f":"O14*Q$6*S$6*U$6","v":0},"=",{"$f":"W14*C_CO2","v":0},null,null,null,{"$f":"VLOOKUP(SelectedStateAbbr,Population!$A$6:$AF$57,$A14,FALSE)","v":{"$error":"#N/A"}}]
[null,null,null,null,null,null,null,null,null,null,null,null,null,null,null,null,null,null,null,null,null,null,null,null,null,null,null,null,{"$f":"\"\"","v":""}]
[7,{"$f":"B14+1","v":1995},null,"x",{"$f":"Control!$F$19","v":0},"x",{"$f":"Control!$D$103","v":365},"x",{"$f":"Control!$D$105","v":1E-3},"x",{"$f":"Control!$F$21","v":0},"x",{"$f":"Control!$F$20","v":0},"=",{"$f":"C16*$E$6*$G$6*$M$6*$K$6*$I$6","v":0},"x",{"$f":"Control!$D$101","v":25},"x",{"$f":"Control!$D$104","v":9.9999999999999995E-7},"x",{"$f":"Control!$D$100","v":0.27272727272727271},"=",{"$f":"O16*Q$6*S$6*U$6","v":0},"=",{"$f":"W16*C_CO2","v":0},null,null,null,{"$f":"VLOOKUP(SelectedStateAbbr,Population!$A$6:$AF$57,$A16,FALSE)","v":{"$error":"#N/A"}}]
[null,null,null,null,null,null,null,null,null,null,null,null,null,null,null,null,null,null,null,null,null,null,null,null,null,null,null,null,{"$f":"\"\"","v":""}]
[8,{"$f":"B16+1","v":1996},null,"x",{"$f":"Control!$F$19","v":0},"x",{"$f":"Control!$D$103","v":365},"x",{"$f":"Control!$D$105","v":1E-3},"x",{"$f":"Control!$F$21","v":0},"x",{"$f":"Control!$F$20","v":0},"=",{"$f":"C18*$E$6*$G$6*$M$6*$K$6*$I$6","v":0},"x",{"$f":"Control!$D$101","v":25},"x",{"$f":"Control!$D$104","v":9.9999999999999995E-7},"x",{"$f":"Control!$D$100","v":0.27272727272727271},"=",{"$f":"O18*Q$6*S$6*U$6","v":0},"=",{"$f":"W18*C_CO2","v":0},null,null,null,{"$f":"VLOOKUP(SelectedStateAbbr,Population!$A$6:$AF$57,$A18,FALSE)","v":{"$error":"#N/A"}}]
[null,null,null,null,null,null,null,null,null,null,null,null,null,null,null,null,null,null,null,null,null,null,null,null,null,null,null,null,{"$f":"\"\"","v":""}]
[9,{"$f":"B18+1","v":1997},null,"x",{"$f":"Control!$F$19","v":0},"x",{"$f":"Control!$D$103","v":365},"x",{"$f":"Control!$D$105","v":1E-3},"x",{"$f":"Control!$F$21","v":0},"x",{"$f":"Control!$F$20","v":0},"=",{"$f":"C20*$E$6*$G$6*$M$6*$K$6*$I$6","v":0},"x",{"$f":"Control!$D$101","v":25},"x",{"$f":"Control!$D$104","v":9.9999999999999995E-7},"x",{"$f":"Control!$D$100","v":0.27272727272727271},"=",{"$f":"O20*Q$6*S$6*U$6","v":0},"=",{"$f":"W20*C_CO2","v":0},null,null,null,{"$f":"VLOOKUP(SelectedStateAbbr,Population!$A$6:$AF$57,$A20,FALSE)","v":{"$error":"#N/A"}}]
[null,null,null,null,null,null,null,null,null,null,null,null,null,null,null,null,null,null,null,null,null,null,null,null,null,null,null,null,{"$f":"\"\"","v":""}]
[10,{"$f":"B20+1","v":1998},null,"x",{"$f":"Control!$F$19","v":0},"x",{"$f":"Control!$D$103","v":365},"x",{"$f":"Control!$D$105","v":1E-3},"x",{"$f":"Control!$F$21","v":0},"x",{"$f":"Control!$F$20","v":0},"=",{"$f":"C22*$E$6*$G$6*$M$6*$K$6*$I$6","v":0},"x",{"$f":"Control!$D$101","v":25},"x",{"$f":"Control!$D$104","v":9.9999999999999995E-7},"x",{"$f":"Control!$D$100","v":0.27272727272727271},"=",{"$f":"O22*Q$6*S$6*U$6","v":0},"=",{"$f":"W22*C_CO2","v":0},null,null,null,{"$f":"VLOOKUP(SelectedStateAbbr,Population!$A$6:$AF$57,$A22,FALSE)","v":{"$error":"#N/A"}}]
[null,null,null,null,null,null,null,null,null,null,null,null,null,null,null,null,null,null,null,null,null,null,null,null,null,null,null,null,{"$f":"\"\"","v":""}]
[11,{"$f":"B22+1","v":1999},null,"x",{"$f":"Control!$F$19","v":0},"x",{"$f":"Control!$D$103","v":365},"x",{"$f":"Control!$D$105","v":1E-3},"x",{"$f":"Control!$F$21","v":0},"x",{"$f":"Control!$F$20","v":0},"=",{"$f":"C24*$E$6*$G$6*$M$6*$K$6*$I$6","v":0},"x",{"$f":"Control!$D$101","v":25},"x",{"$f":"Control!$D$104","v":9.9999999999999995E-7},"x",{"$f":"Control!$D$100","v":0.27272727272727271},"=",{"$f":"O24*Q$6*S$6*U$6","v":0},"=",{"$f":"W24*C_CO2","v":0},null,null,null,{"$f":"VLOOKUP(SelectedStateAbbr,Population!$A$6:$AF$57,$A24,FALSE)","v":{"$error":"#N/A"}}]
[null,null,null,null,null,null,null,null,null,null,null,null,null,null,null,null,null,null,null,null,null,null,null,null,null,null,null,null,{"$f":"\"\"","v":""}]
[12,{"$f":"B24+1","v":2000},null,"x",{"$f":"Control!$F$19","v":0},"x",{"$f":"Control!$D$103","v":365},"x",{"$f":"Control!$D$105","v":1E-3},"x",{"$f":"Control!$F$21","v":0},"x",{"$f":"Control!$F$20","v":0},"=",{"$f":"C26*$E$6*$G$6*$M$6*$K$6*$I$6","v":0},"x",{"$f":"Control!$D$101","v":25},"x",{"$f":"Control!$D$104","v":9.9999999999999995E-7},"x",{"$f":"Control!$D$100","v":0.27272727272727271},"=",{"$f":"O26*Q$6*S$6*U$6","v":0},"=",{"$f":"W26*C_CO2","v":0},null,null,null,{"$f":"VLOOKUP(SelectedStateAbbr,Population!$A$6:$AF$57,$A26,FALSE)","v":{"$error":"#N/A"}}]
[null,null,null,null,null,null,null,null,null,null,null,null,null,null,null,null,null,null,null,null,null,null,null,null,null,null,null,null,{"$f":"\"\"","v":""}]
[13,{"$f":"B26+1","v":2001},null,"x",{"$f":"Control!$F$19","v":0},"x",{"$f":"Control!$D$103","v":365},"x",{"$f":"Control!$D$105","v":1E-3},"x",{"$f":"Control!$F$21","v":0},"x",{"$f":"Control!$F$20","v":0},"=",{"$f":"C28*$E$6*$G$6*$M$6*$K$6*$I$6","v":0},"x",{"$f":"Control!$D$101","v":25},"x",{"$f":"Control!$D$104","v":9.9999999999999995E-7},"x",{"$f":"Control!$D$100","v":0.27272727272727271},"=",{"$f":"O28*Q$6*S$6*U$6","v":0},"=",{"$f":"W28*C_CO2","v":0},null,null,null,{"$f":"VLOOKUP(SelectedStateAbbr,Population!$A$6:$AF$57,$A28,FALSE)","v":{"$error":"#N/A"}}]
[null,null,null,null,null,null,null,null,null,null,null,null,null,null,null,null,null,null,null,null,null,null,null,null,null,null,null,null,{"$f":"\"\"","v":""}]
[14,{"$f":"B28+1","v":2002},null,"x",{"$f":"Control!$F$19","v":0},"x",{"$f":"Control!$D$103","v":365},"x",{"$f":"Control!$D$105","v":1E-3},"x",{"$f":"Control!$F$21","v":0},"x",{"$f":"Control!$F$20","v":0},"=",{"$f":"C30*$E$6*$G$6*$M$6*$K$6*$I$6","v":0},"x",{"$f":"Control!$D$101","v":25},"x",{"$f":"Control!$D$104","v":9.9999999999999995E-7},"x",{"$f":"Control!$D$100","v":0.27272727272727271},"=",{"$f":"O30*Q$6*S$6*U$6","v":0},"=",{"$f":"W30*C_CO2","v":0},null,null,null,{"$f":"VLOOKUP(SelectedStateAbbr,Population!$A$6:$AF$57,$A30,FALSE)","v":{"$error":"#N/A"}}]
[null,null,null,null,null,null,null,null,null,null,null,null,null,null,null,null,null,null,null,null,null,null,null,null,null,null,null,null,{"$f":"\"\"","v":""}]
[15,{"$f":"B30+1","v":2003},null,"x",{"$f":"Control!$F$19","v":0},"x",{"$f":"Control!$D$103","v":365},"x",{"$f":"Control!$D$105","v":1E-3},"x",{"$f":"Control!$F$21","v":0},"x",{"$f":"Control!$F$20","v":0},"=",{"$f":"C32*$E$6*$G$6*$M$6*$K$6*$I$6","v":0},"x",{"$f":"Control!$D$101","v":25},"x",{"$f":"Control!$D$104","v":9.9999999999999995E-7},"x",{"$f":"Control!$D$100","v":0.27272727272727271},"=",{"$f":"O32*Q$6*S$6*U$6","v":0},"=",{"$f":"W32*C_CO2","v":0},null,null,null,{"$f":"VLOOKUP(SelectedStateAbbr,Population!$A$6:$AF$57,$A32,FALSE)","v":{"$error":"#N/A"}}]
[null,null,null,null,null,null,null,null,null,null,null,null,null,null,null,null,null,null,null,null,null,null,null,null,null,null,null,null,{"$f":"\"\"","v":""}]
[16,{"$f":"B32+1","v":2004},null,"x",{"$f":"Control!$F$19","v":0},"x",{"$f":"Control!$D$103","v":365},"x",{"$f":"Control!$D$105","v":1E-3},"x",{"$f":"Control!$F$21","v":0},"x",{"$f":"Control!$F$20","v":0},"=",{"$f":"C34*$E$6*$G$6*$M$6*$K$6*$I$6","v":0},"x",{"$f":"Control!$D$101","v":25},"x",{"$f":"Control!$D$104","v":9.9999999999999995E-7},"x",{"$f":"Control!$D$100","v":0.27272727272727271},"=",{"$f":"O34*Q$6*S$6*U$6","v":0},"=",{"$f":"W34*C_CO2","v":0},null,null,null,{"$f":"VLOOKUP(SelectedStateAbbr,Population!$A$6:$AF$57,$A34,FALSE)","v":{"$error":"#N/A"}}]
[null,null,null,null,null,null,null,null,null,null,null,null,null,null,null,null,null,null,null,null,null,null,null,null,null,null,null,null,{"$f":"\"\"","v":""}]
[17,{"$f":"B34+1","v":2005},null,"x",{"$f":"Control!$F$19","v":0},"x",{"$f":"Control!$D$103","v":365},"x",{"$f":"Control!$D$105","v":1E-3},"x",{"$f":"Control!$F$21","v":0},"x",{"$f":"Control!$F$20","v":0},"=",{"$f":"C36*$E$6*$G$6*$M$6*$K$6*$I$6","v":0},"x",{"$f":"Control!$D$101","v":25},"x",{"$f":"Control!$D$104","v":9.9999999999999995E-7},"x",{"$f":"Control!$D$100","v":0.27272727272727271},"=",{"$f":"O36*Q$6*S$6*U$6","v":0},"=",{"$f":"W36*C_CO2","v":0},null,null,null,{"$f":"VLOOKUP(SelectedStateAbbr,Population!$A$6:$AF$57,$A36,FALSE)","v":{"$error":"#N/A"}}]
[null,null,null,null,null,null,null,null,null,null,null,null,null,null,null,null,null,null,null,null,null,null,null,null,null,null,null,null,{"$f":"\"\"","v":""}]
[18,{"$f":"B36+1","v":2006},null,"x",{"$f":"Control!$F$19","v":0},"x",{"$f":"Control!$D$103","v":365},"x",{"$f":"Control!$D$105","v":1E-3},"x",{"$f":"Control!$F$21","v":0},"x",{"$f":"Control!$F$20","v":0},"=",{"$f":"C38*$E$6*$G$6*$M$6*$K$6*$I$6","v":0},"x",{"$f":"Control!$D$101","v":25},"x",{"$f":"Control!$D$104","v":9.9999999999999995E-7},"x",{"$f":"Control!$D$100","v":0.27272727272727271},"=",{"$f":"O38*Q$6*S$6*U$6","v":0},"=",{"$f":"W38*C_CO2","v":0},null,null,null,{"$f":"VLOOKUP(SelectedStateAbbr,Population!$A$6:$AF$57,$A38,FALSE)","v":{"$error":"#N/A"}}]
[null,null,null,null,null,null,null,null,null,null,null,null,null,null,null,null,null,null,null,null,null,null,null,null,null,null,null,null,{"$f":"\"\"","v":""}]
[19,{"$f":"B38+1","v":2007},null,"x",{"$f":"Control!$F$19","v":0},"x",{"$f":"Control!$D$103","v":365},"x",{"$f":"Control!$D$105","v":1E-3},"x",{"$f":"Control!$F$21","v":0},"x",{"$f":"Control!$F$20","v":0},"=",{"$f":"C40*$E$6*$G$6*$M$6*$K$6*$I$6","v":0},"x",{"$f":"Control!$D$101","v":25},"x",{"$f":"Control!$D$104","v":9.9999999999999995E-7},"x",{"$f":"Control!$D$100","v":0.27272727272727271},"=",{"$f":"O40*Q$6*S$6*U$6","v":0},"=",{"$f":"W40*C_CO2","v":0},null,null,null,{"$f":"VLOOKUP(SelectedStateAbbr,Population!$A$6:$AF$57,$A40,FALSE)","v":{"$error":"#N/A"}}]
[null,null,null,null,null,null,null,null,null,null,null,null,null,null,null,null,null,null,null,null,null,null,null,null,null,null,null,null,{"$f":"\"\"","v":""}]
[20,{"$f":"B40+1","v":2008},null,"x",{"$f":"Control!$F$19","v":0},"x",{"$f":"Control!$D$103","v":365},"x",{"$f":"Control!$D$105","v":1E-3},"x",{"$f":"Control!$F$21","v":0},"x",{"$f":"Control!$F$20","v":0},"=",{"$f":"C42*$E$6*$G$6*$M$6*$K$6*$I$6","v":0},"x",{"$f":"Control!$D$101","v":25},"x",{"$f":"Control!$D$104","v":9.9999999999999995E-7},"x",{"$f":"Control!$D$100","v":0.27272727272727271},"=",{"$f":"O42*Q$6*S$6*U$6","v":0},"=",{"$f":"W42*C_CO2","v":0},null,null,null,{"$f":"VLOOKUP(SelectedStateAbbr,Population!$A$6:$AF$57,$A42,FALSE)","v":{"$error":"#N/A"}}]
[null,null,null,null,null,null,null,null,null,null,null,null,null,null,null,null,null,null,null,null,null,null,null,null,null,null,null,null,{"$f":"\"\"","v":""}]
[21,{"$f":"B42+1","v":2009},null,"x",{"$f":"Control!$F$19","v":0},"x",{"$f":"Control!$D$103","v":365},"x",{"$f":"Control!$D$105","v":1E-3},"x",{"$f":"Control!$F$21","v":0},"x",{"$f":"Control!$F$20","v":0},"=",{"$f":"C44*$E$6*$G$6*$M$6*$K$6*$I$6","v":0},"x",{"$f":"Control!$D$101","v":25},"x",{"$f":"Control!$D$104","v":9.9999999999999995E-7},"x",{"$f":"Control!$D$100","v":0.27272727272727271},"=",{"$f":"O44*Q$6*S$6*U$6","v":0},"=",{"$f":"W44*C_CO2","v":0},null,null,null,{"$f":"VLOOKUP(SelectedStateAbbr,Population!$A$6:$AF$57,$A44,FALSE)","v":{"$error":"#N/A"}}]
[null,null,null,null,null,null,null,null,null,null,null,null,null,null,null,null,null,null,null,null,null,null,null,null,null,null,null,null,{"$f":"\"\"","v":""}]
[22,{"$f":"B44+1","v":2010},null,"x",{"$f":"Control!$F$19","v":0},"x",{"$f":"Control!$D$103","v":365},"x",{"$f":"Control!$D$105","v":1E-3},"x",{"$f":"Control!$F$21","v":0},"x",{"$f":"Control!$F$20","v":0},"=",{"$f":"C46*$E$6*$G$6*$M$6*$K$6*$I$6","v":0},"x",{"$f":"Control!$D$101","v":25},"x",{"$f":"Control!$D$104","v":9.9999999999999995E-7},"x",{"$f":"Control!$D$100","v":0.27272727272727271},"=",{"$f":"O46*Q$6*S$6*U$6","v":0},"=",{"$f":"W46*C_CO2","v":0},null,null,null,{"$f":"VLOOKUP(SelectedStateAbbr,Population!$A$6:$AF$57,$A46,FALSE)","v":{"$error":"#N/A"}}]
[null,null,null,null,null,null,null,null,null,null,null,null,null,null,null,null,null,null,null,null,null,null,null,null,null,null,null,null,{"$f":"\"\"","v":""}]
[23,{"$f":"B46+1","v":2011},null,"x",{"$f":"Control!$F$19","v":0},"x",{"$f":"Control!$D$103","v":365},"x",{"$f":"Control!$D$105","v":1E-3},"x",{"$f":"Control!$F$21","v":0},"x",{"$f":"Control!$F$20","v":0},"=",{"$f":"C48*$E$6*$G$6*$M$6*$K$6*$I$6","v":0},"x",{"$f":"Control!$D$101","v":25},"x",{"$f":"Control!$D$104","v":9.9999999999999995E-7},"x",{"$f":"Control!$D$100","v":0.27272727272727271},"=",{"$f":"O48*Q$6*S$6*U$6","v":0},"=",{"$f":"W48*C_CO2","v":0},null,null,null,{"$f":"VLOOKUP(SelectedStateAbbr,Population!$A$6:$AF$57,$A48,FALSE)","v":{"$error":"#N/A"}}]
[null,null,null,null,null,null,null,null,null,null,null,null,null,null,null,null,null,null,null,null,null,null,null,null,null,null,null,null,{"$f":"\"\"","v":""}]
[24,{"$f":"B48+1","v":2012},null,"x",{"$f":"Control!$F$19","v":0},"x",{"$f":"Control!$D$103","v":365},"x",{"$f":"Control!$D$105","v":1E-3},"x",{"$f":"Control!$F$21","v":0},"x",{"$f":"Control!$F$20","v":0},"=",{"$f":"C50*$E$6*$G$6*$M$6*$K$6*$I$6","v":0},"x",{"$f":"Control!$D$101","v":25},"x",{"$f":"Control!$D$104","v":9.9999999999999995E-7},"x",{"$f":"Control!$D$100","v":0.27272727272727271},"=",{"$f":"O50*Q$6*S$6*U$6","v":0},"=",{"$f":"W50*C_CO2","v":0},null,null,null,{"$f":"VLOOKUP(SelectedStateAbbr,Population!$A$6:$AF$57,$A50,FALSE)","v":{"$error":"#N/A"}}]
[null,null,null,null,null,null,null,null,null,null,null,null,null,null,null,null,null,null,null,null,null,null,null,null,null,null,null,null,{"$f":"\"\"","v":""}]
[25,{"$f":"B50+1","v":2013},null,"x",{"$f":"Control!$F$19","v":0},"x",{"$f":"Control!$D$103","v":365},"x",{"$f":"Control!$D$105","v":1E-3},"x",{"$f":"Control!$F$21","v":0},"x",{"$f":"Control!$F$20","v":0},"=",{"$f":"C52*$E$6*$G$6*$M$6*$K$6*$I$6","v":0},"x",{"$f":"Control!$D$101","v":25},"x",{"$f":"Control!$D$104","v":9.9999999999999995E-7},"x",{"$f":"Control!$D$100","v":0.27272727272727271},"=",{"$f":"O52*Q$6*S$6*U$6","v":0},"=",{"$f":"W52*C_CO2","v":0},null,null,null,{"$f":"VLOOKUP(SelectedStateAbbr,Population!$A$6:$AF$57,$A52,FALSE)","v":{"$error":"#N/A"}}]
[null,null,null,null,null,null,null,null,null,null,null,null,null,null,null,null,null,null,null,null,null,null,null,null,null,null,null,null,{"$f":"\"\"","v":""}]
[26,{"$f":"B52+1","v":2014},null,"x",{"$f":"Control!$F$19","v":0},"x",{"$f":"Control!$D$103","v":365},"x",{"$f":"Control!$D$105","v":1E-3},"x",{"$f":"Control!$F$21","v":0},"x",{"$f":"Control!$F$20","v":0},"=",{"$f":"C54*$E$6*$G$6*$M$6*$K$6*$I$6","v":0},"x",{"$f":"Control!$D$101","v":25},"x",{"$f":"Control!$D$104","v":9.9999999999999995E-7},"x",{"$f":"Control!$D$100","v":0.27272727272727271},"=",{"$f":"O54*Q$6*S$6*U$6","v":0},"=",{"$f":"W54*C_CO2","v":0},null,null,null,{"$f":"VLOOKUP(SelectedStateAbbr,Population!$A$6:$AF$57,$A54,FALSE)","v":{"$error":"#N/A"}}]
[null,null,null,null,null,null,null,null,null,null,null,null,null,null,null,null,null,null,null,null,null,null,null,null,null,null,null,null,{"$f":"\"\"","v":""}]
[27,{"$f":"B54+1","v":2015},null,"x",{"$f":"Control!$F$19","v":0},"x",{"$f":"Control!$D$103","v":365},"x",{"$f":"Control!$D$105","v":1E-3},"x",{"$f":"Control!$F$21","v":0},"x",{"$f":"Control!$F$20","v":0},"=",{"$f":"C56*$E$6*$G$6*$M$6*$K$6*$I$6","v":0},"x",{"$f":"Control!$D$101","v":25},"x",{"$f":"Control!$D$104","v":9.9999999999999995E-7},"x",{"$f":"Control!$D$100","v":0.27272727272727271},"=",{"$f":"O56*Q$6*S$6*U$6","v":0},"=",{"$f":"W56*C_CO2","v":0},null,null,null,{"$f":"VLOOKUP(SelectedStateAbbr,Population!$A$6:$AF$57,$A56,FALSE)","v":{"$error":"#N/A"}}]
[null,null,null,null,null,null,null,null,null,null,null,null,null,null,null,null,null,null,null,null,null,null,null,null,null,null,null,null,{"$f":"\"\"","v":""}]
[28,{"$f":"B56+1","v":2016},null,"x",{"$f":"Control!$F$19","v":0},"x",{"$f":"Control!$D$103","v":365},"x",{"$f":"Control!$D$105","v":1E-3},"x",{"$f":"Control!$F$21","v":0},"x",{"$f":"Control!$F$20","v":0},"=",{"$f":"C58*$E$6*$G$6*$M$6*$K$6*$I$6","v":0},"x",{"$f":"Control!$D$101","v":25},"x",{"$f":"Control!$D$104","v":9.9999999999999995E-7},"x",{"$f":"Control!$D$100","v":0.27272727272727271},"=",{"$f":"O58*Q$6*S$6*U$6","v":0},"=",{"$f":"W58*C_CO2","v":0},null,null,null,{"$f":"VLOOKUP(SelectedStateAbbr,Population!$A$6:$AF$57,$A58,FALSE)","v":{"$error":"#N/A"}}]
[null,null,null,null,null,null,null,null,null,null,null,null,null,null,null,null,null,null,null,null,null,null,null,null,null,null,null,null,{"$f":"\"\"","v":""}]
[29,{"$f":"B58+1","v":2017},null,"x",{"$f":"Control!$F$19","v":0},"x",{"$f":"Control!$D$103","v":365},"x",{"$f":"Control!$D$105","v":1E-3},"x",{"$f":"Control!$F$21","v":0},"x",{"$f":"Control!$F$20","v":0},"=",{"$f":"C60*$E$6*$G$6*$M$6*$K$6*$I$6","v":0},"x",{"$f":"Control!$D$101","v":25},"x",{"$f":"Control!$D$104","v":9.9999999999999995E-7},"x",{"$f":"Control!$D$100","v":0.27272727272727271},"=",{"$f":"O60*Q$6*S$6*U$6","v":0},"=",{"$f":"W60*C_CO2","v":0},null,null,null,{"$f":"VLOOKUP(SelectedStateAbbr,Population!$A$6:$AF$57,$A60,FALSE)","v":{"$error":"#N/A"}}]
[null,null,null,null,null,null,null,null,null,null,null,null,null,null,null,null,null,null,null,null,null,null,null,null,null,null,null,null,{"$f":"\"\"","v":""}]
[30,{"$f":"B60+1","v":2018},null,"x",{"$f":"Control!$F$19","v":0},"x",{"$f":"Control!$D$103","v":365},"x",{"$f":"Control!$D$105","v":1E-3},"x",{"$f":"Control!$F$21","v":0},"x",{"$f":"Control!$F$20","v":0},"=",{"$f":"C62*$E$6*$G$6*$M$6*$K$6*$I$6","v":0},"x",{"$f":"Control!$D$101","v":25},"x",{"$f":"Control!$D$104","v":9.9999999999999995E-7},"x",{"$f":"Control!$D$100","v":0.27272727272727271},"=",{"$f":"O62*Q$6*S$6*U$6","v":0},"=",{"$f":"W62*C_CO2","v":0},null,null,null,{"$f":"VLOOKUP(SelectedStateAbbr,Population!$A$6:$AF$57,$A62,FALSE)","v":{"$error":"#N/A"}}]
[null,null,null,null,null,null,null,null,null,null,null,null,null,null,null,null,null,null,null,null,null,null,null,null,null,null,null,null,{"$f":"\"\"","v":""}]
[31,{"$f":"B62+1","v":2019},null,"x",{"$f":"Control!$F$19","v":0},"x",{"$f":"Control!$D$103","v":365},"x",{"$f":"Control!$D$105","v":1E-3},"x",{"$f":"Control!$F$21","v":0},"x",{"$f":"Control!$F$20","v":0},"=",{"$f":"C64*$E$6*$G$6*$M$6*$K$6*$I$6","v":0},"x",{"$f":"Control!$D$101","v":25},"x",{"$f":"Control!$D$104","v":9.9999999999999995E-7},"x",{"$f":"Control!$D$100","v":0.27272727272727271},"=",{"$f":"O64*Q$6*S$6*U$6","v":0},"=",{"$f":"W64*C_CO2","v":0},null,null,null,{"$f":"VLOOKUP(SelectedStateAbbr,Population!$A$6:$AF$57,$A64,FALSE)","v":{"$error":"#N/A"}}]
[null,null,null,null,null,null,null,null,null,null,null,null,null,null,null,null,null,null,null,null,null,null,null,null,null,null,null,null,{"$f":"\"\"","v":""}]
[32,{"$f":"B64+1","v":2020},null,"x",{"$f":"Control!$F$19","v":0},"x",{"$f":"Control!$D$103","v":365},"x",{"$f":"Control!$D$105","v":1E-3},"x",{"$f":"Control!$F$21","v":0},"x",{"$f":"Control!$F$20","v":0},"=",{"$f":"C66*$E$6*$G$6*$M$6*$K$6*$I$6","v":0},"x",{"$f":"Control!$D$101","v":25},"x",{"$f":"Control!$D$104","v":9.9999999999999995E-7},"x",{"$f":"Control!$D$100","v":0.27272727272727271},"=",{"$f":"O66*Q$6*S$6*U$6","v":0},"=",{"$f":"W66*C_CO2","v":0},null,null,null,{"$f":"VLOOKUP(SelectedStateAbbr,Population!$A$6:$AF$57,$A66,FALSE)","v":{"$error":"#N/A"}}]

{"sheet":"Municipal WW, N2O, direct","index":2,"n_rows":66,"n_cols":21,"rows_kept":66,"cut":false,"hidden":false,"merged":[]}
[null,{"$f":"\"5. \"&SelectedState & \" Direct Nitrous Oxide Emissions from Municipal Wastewater Treatment\"","v":"5. Select a state . . . Direct Nitrous Oxide Emissions from Municipal Wastewater Treatment"}]
[]
[null,null,"State Population",null,"Fraction of Population not on Septic",null,"Direct N2O Emissions from Wastewater Treatment",null,"Unit Conversion",null,"Emissions",null,"N2O GWP",null,"Unit Conversion",null,"C/CO2",null,"Emissions ",null,"Emissions "]
[null,null,null,null,null,null," (g N2O/person/year)",null,"(g/metric ton)",null,"(Metric Tons N2O)",null,"(CO2 Eq.)",null,"(MMT/MT)",null,null,null,"(MMTCE)",null,"(MMTCO2E)"]
[]
[2,1990,{"$f":"'Municipal WW, CH4'!C6","v":0},"x",{"$f":"Control!$F$26","v":0},"x",{"$f":"Control!$F$27","v":0},"x",{"$f":"0.000001","v":9.9999999999999995E-7},"=",{"$f":"C6*E6*G6*I6","v":0},"x",{"$f":"Control!$D$102","v":298},"x",{"$f":"Control!$D$104","v":9.9999999999999995E-7},"x",{"$f":"Control!$D$100","v":0.27272727272727271},"=",{"$f":"K6*M6*O6*Q6","v":0},"=",{"$f":"S6*C_CO2","v":0}]
[]
[3,{"$f":"B6+1","v":1991},{"$f":"'Municipal WW, CH4'!C8","v":0},"x",{"$f":"Control!$F$26","v":0},"x",{"$f":"Control!$F$27","v":0},"x",{"$f":"0.000001","v":9.9999999999999995E-7},"=",{"$f":"C8*E8*G8*I8","v":0},"x",{"$f":"Control!$D$102","v":298},"x",{"$f":"Control!$D$104","v":9.9999999999999995E-7},"x",{"$f":"Control!$D$100","v":0.27272727272727271},"=",{"$f":"K8*M8*O8*Q8","v":0},"=",{"$f":"S8*C_CO2","v":0}]
[]
[4,{"$f":"B8+1","v":1992},{"$f":"'Municipal WW, CH4'!C10","v":0},"x",{"$f":"Control!$F$26","v":0},"x",{"$f":"Control!$F$27","v":0},"x",{"$f":"0.000001","v":9.9999999999999995E-7},"=",{"$f":"C10*E10*G10*I10","v":0},"x",{"$f":"Control!$D$102","v":298},"x",{"$f":"Control!$D$104","v":9.9999999999999995E-7},"x",{"$f":"Control!$D$100","v":0.27272727272727271},"=",{"$f":"K10*M10*O10*Q10","v":0},"=",{"$f":"S10*C_CO2","v":0}]
[]
[5,{"$f":"B10+1","v":1993},{"$f":"'Municipal WW, CH4'!C12","v":0},"x",{"$f":"Control!$F$26","v":0},"x",{"$f":"Control!$F$27","v":0},"x",{"$f":"0.000001","v":9.9999999999999995E-7},"=",{"$f":"C12*E12*G12*I12","v":0},"x",{"$f":"Control!$D$102","v":298},"x",{"$f":"Control!$D$104","v":9.9999999999999995E-7},"x",{"$f":"Control!$D$100","v":0.27272727272727271},"=",{"$f":"K12*M12*O12*Q12","v":0},"=",{"$f":"S12*C_CO2","v":0}]
[]
[6,{"$f":"B12+1","v":1994},{"$f":"'Municipal WW, CH4'!C14","v":0},"x",{"$f":"Control!$F$26","v":0},"x",{"$f":"Control!$F$27","v":0},"x",{"$f":"0.000001","v":9.9999999999999995E-7},"=",{"$f":"C14*E14*G14*I14","v":0},"x",{"$f":"Control!$D$102","v":298},"x",{"$f":"Control!$D$104","v":9.9999999999999995E-7},"x",{"$f":"Control!$D$100","v":0.27272727272727271},"=",{"$f":"K14*M14*O14*Q14","v":0},"=",{"$f":"S14*C_CO2","v":0}]
[]
[7,{"$f":"B14+1","v":1995},{"$f":"'Municipal WW, CH4'!C16","v":0},"x",{"$f":"Control!$F$26","v":0},"x",{"$f":"Control!$F$27","v":0},"x",{"$f":"0.000001","v":9.9999999999999995E-7},"=",{"$f":"C16*E16*G16*I16","v":0},"x",{"$f":"Control!$D$102","v":298},"x",{"$f":"Control!$D$104","v":9.9999999999999995E-7},"x",{"$f":"Control!$D$100","v":0.27272727272727271},"=",{"$f":"K16*M16*O16*Q16","v":0},"=",{"$f":"S16*C_CO2","v":0}]
[]
[8,{"$f":"B16+1","v":1996},{"$f":"'Municipal WW, CH4'!C18","v":0},"x",{"$f":"Control!$F$26","v":0},"x",{"$f":"Control!$F$27","v":0},"x",{"$f":"0.000001","v":9.9999999999999995E-7},"=",{"$f":"C18*E18*G18*I18","v":0},"x",{"$f":"Control!$D$102","v":298},"x",{"$f":"Control!$D$104","v":9.9999999999999995E-7},"x",{"$f":"Control!$D$100","v":0.27272727272727271},"=",{"$f":"K18*M18*O18*Q18","v":0},"=",{"$f":"S18*C_CO2","v":0}]
[]
[9,{"$f":"B18+1","v":1997},{"$f":"'Municipal WW, CH4'!C20","v":0},"x",{"$f":"Control!$F$26","v":0},"x",{"$f":"Control!$F$27","v":0},"x",{"$f":"0.000001","v":9.9999999999999995E-7},"=",{"$f":"C20*E20*G20*I20","v":0},"x",{"$f":"Control!$D$102","v":298},"x",{"$f":"Control!$D$104","v":9.9999999999999995E-7},"x",{"$f":"Control!$D$100","v":0.27272727272727271},"=",{"$f":"K20*M20*O20*Q20","v":0},"=",{"$f":"S20*C_CO2","v":0}]
[]
[10,{"$f":"B20+1","v":1998},{"$f":"'Municipal WW, CH4'!C22","v":0},"x",{"$f":"Control!$F$26","v":0},"x",{"$f":"Control!$F$27","v":0},"x",{"$f":"0.000001","v":9.9999999999999995E-7},"=",{"$f":"C22*E22*G22*I22","v":0},"x",{"$f":"Control!$D$102","v":298},"x",{"$f":"Control!$D$104","v":9.9999999999999995E-7},"x",{"$f":"Control!$D$100","v":0.27272727272727271},"=",{"$f":"K22*M22*O22*Q22","v":0},"=",{"$f":"S22*C_CO2","v":0}]
[]
[11,{"$f":"B22+1","v":1999},{"$f":"'Municipal WW, CH4'!C24","v":0},"x",{"$f":"Control!$F$26","v":0},"x",{"$f":"Control!$F$27","v":0},"x",{"$f":"0.000001","v":9.9999999999999995E-7},"=",{"$f":"C24*E24*G24*I24","v":0},"x",{"$f":"Control!$D$102","v":298},"x",{"$f":"Control!$D$104","v":9.9999999999999995E-7},"x",{"$f":"Control!$D$100","v":0.27272727272727271},"=",{"$f":"K24*M24*O24*Q24","v":0},"=",{"$f":"S24*C_CO2","v":0}]
[]
[12,{"$f":"B24+1","v":2000},{"$f":"'Municipal WW, CH4'!C26","v":0},"x",{"$f":"Control!$F$26","v":0},"x",{"$f":"Control!$F$27","v":0},"x",{"$f":"0.000001","v":9.9999999999999995E-7},"=",{"$f":"C26*E26*G26*I26","v":0},"x",{"$f":"Control!$D$102","v":298},"x",{"$f":"Control!$D$104","v":9.9999999999999995E-7},"x",{"$f":"Control!$D$100","v":0.27272727272727271},"=",{"$f":"K26*M26*O26*Q26","v":0},"=",{"$f":"S26*C_CO2","v":0}]
[]
[11,{"$f":"B26+1","v":2001},{"$f":"'Municipal WW, CH4'!C28","v":0},"x",{"$f":"Control!$F$26","v":0},"x",{"$f":"Control!$F$27","v":0},"x",{"$f":"0.000001","v":9.9999999999999995E-7},"=",{"$f":"C28*E28*G28*I28","v":0},"x",{"$f":"Control!$D$102","v":298},"x",{"$f":"Control!$D$104","v":9.9999999999999995E-7},"x",{"$f":"Control!$D$100","v":0.27272727272727271},"=",{"$f":"K28*M28*O28*Q28","v":0},"=",{"$f":"S28*C_CO2","v":0}]
[]
[12,{"$f":"B28+1","v":2002},{"$f":"'Municipal WW, CH4'!C30","v":0},"x",{"$f":"Control!$F$26","v":0},"x",{"$f":"Control!$F$27","v":0},"x",{"$f":"0.000001","v":9.9999999999999995E-7},"=",{"$f":"C30*E30*G30*I30","v":0},"x",{"$f":"Control!$D$102","v":298},"x",{"$f":"Control!$D$104","v":9.9999999999999995E-7},"x",{"$f":"Control!$D$100","v":0.27272727272727271},"=",{"$f":"K30*M30*O30*Q30","v":0},"=",{"$f":"S30*C_CO2","v":0}]
[]
[11,{"$f":"B30+1","v":2003},{"$f":"'Municipal WW, CH4'!C32","v":0},"x",{"$f":"Control!$F$26","v":0},"x",{"$f":"Control!$F$27","v":0},"x",{"$f":"0.000001","v":9.9999999999999995E-7},"=",{"$f":"C32*E32*G32*I32","v":0},"x",{"$f":"Control!$D$102","v":298},"x",{"$f":"Control!$D$104","v":9.9999999999999995E-7},"x",{"$f":"Control!$D$100","v":0.27272727272727271},"=",{"$f":"K32*M32*O32*Q32","v":0},"=",{"$f":"S32*C_CO2","v":0}]
[]
[12,{"$f":"B32+1","v":2004},{"$f":"'Municipal WW, CH4'!C34","v":0},"x",{"$f":"Control!$F$26","v":0},"x",{"$f":"Control!$F$27","v":0},"x",{"$f":"0.000001","v":9.9999999999999995E-7},"=",{"$f":"C34*E34*G34*I34","v":0},"x",{"$f":"Control!$D$102","v":298},"x",{"$f":"Control!$D$104","v":9.9999999999999995E-7},"x",{"$f":"Control!$D$100","v":0.27272727272727271},"=",{"$f":"K34*M34*O34*Q34","v":0},"=",{"$f":"S34*C_CO2","v":0}]
[]
[12,{"$f":"B34+1","v":2005},{"$f":"'Municipal WW, CH4'!C36","v":0},"x",{"$f":"Control!$F$26","v":0},"x",{"$f":"Control!$F$27","v":0},"x",{"$f":"0.000001","v":9.9999999999999995E-7},"=",{"$f":"C36*E36*G36*I36","v":0},"x",{"$f":"Control!$D$102","v":298},"x",{"$f":"Control!$D$104","v":9.9999999999999995E-7},"x",{"$f":"Control!$D$100","v":0.27272727272727271},"=",{"$f":"K36*M36*O36*Q36","v":0},"=",{"$f":"S36*C_CO2","v":0}]
[]
[12,{"$f":"B36+1","v":2006},{"$f":"'Municipal WW, CH4'!C38","v":0},"x",{"$f":"Control!$F$26","v":0},"x",{"$f":"Control!$F$27","v":0},"x",{"$f":"0.000001","v":9.9999999999999995E-7},"=",{"$f":"C38*E38*G38*I38","v":0},"x",{"$f":"Control!$D$102","v":298},"x",{"$f":"Control!$D$104","v":9.9999999999999995E-7},"x",{"$f":"Control!$D$100","v":0.27272727272727271},"=",{"$f":"K38*M38*O38*Q38","v":0},"=",{"$f":"S38*C_CO2","v":0}]
[]
[12,{"$f":"B38+1","v":2007},{"$f":"'Municipal WW, CH4'!C40","v":0},"x",{"$f":"Control!$F$26","v":0},"x",{"$f":"Control!$F$27","v":0},"x",{"$f":"0.000001","v":9.9999999999999995E-7},"=",{"$f":"C40*E40*G40*I40","v":0},"x",{"$f":"Control!$D$102","v":298},"x",{"$f":"Control!$D$104","v":9.9999999999999995E-7},"x",{"$f":"Control!$D$100","v":0.27272727272727271},"=",{"$f":"K40*M40*O40*Q40","v":0},"=",{"$f":"S40*C_CO2","v":0}]
[]
[12,{"$f":"B40+1","v":2008},{"$f":"'Municipal WW, CH4'!C42","v":0},"x",{"$f":"Control!$F$26","v":0},"x",{"$f":"Control!$F$27","v":0},"x",{"$f":"0.000001","v":9.9999999999999995E-7},"=",{"$f":"C42*E42*G42*I42","v":0},"x",{"$f":"Control!$D$102","v":298},"x",{"$f":"Control!$D$104","v":9.9999999999999995E-7},"x",{"$f":"Control!$D$100","v":0.27272727272727271},"=",{"$f":"K42*M42*O42*Q42","v":0},"=",{"$f":"S42*C_CO2","v":0}]
[]
[12,{"$f":"B42+1","v":2009},{"$f":"'Municipal WW, CH4'!C44","v":0},"x",{"$f":"Control!$F$26","v":0},"x",{"$f":"Control!$F$27","v":0},"x",{"$f":"0.000001","v":9.9999999999999995E-7},"=",{"$f":"C44*E44*G44*I44","v":0},"x",{"$f":"Control!$D$102","v":298},"x",{"$f":"Control!$D$104","v":9.9999999999999995E-7},"x",{"$f":"Control!$D$100","v":0.27272727272727271},"=",{"$f":"K44*M44*O44*Q44","v":0},"=",{"$f":"S44*C_CO2","v":0}]
[]
[12,{"$f":"B44+1","v":2010},{"$f":"'Municipal WW, CH4'!C46","v":0},"x",{"$f":"Control!$F$26","v":0},"x",{"$f":"Control!$F$27","v":0},"x",{"$f":"0.000001","v":9.9999999999999995E-7},"=",{"$f":"C46*E46*G46*I46","v":0},"x",{"$f":"Control!$D$102","v":298},"x",{"$f":"Control!$D$104","v":9.9999999999999995E-7},"x",{"$f":"Control!$D$100","v":0.27272727272727271},"=",{"$f":"K46*M46*O46*Q46","v":0},"=",{"$f":"S46*C_CO2","v":0}]
[]
[12,{"$f":"B46+1","v":2011},{"$f":"'Municipal WW, CH4'!C48","v":0},"x",{"$f":"Control!$F$26","v":0},"x",{"$f":"Control!$F$27","v":0},"x",{"$f":"0.000001","v":9.9999999999999995E-7},"=",{"$f":"C48*E48*G48*I48","v":0},"x",{"$f":"Control!$D$102","v":298},"x",{"$f":"Control!$D$104","v":9.9999999999999995E-7},"x",{"$f":"Control!$D$100","v":0.27272727272727271},"=",{"$f":"K48*M48*O48*Q48","v":0},"=",{"$f":"S48*C_CO2","v":0}]
[]
[12,{"$f":"B48+1","v":2012},{"$f":"'Municipal WW, CH4'!C50","v":0},"x",{"$f":"Control!$F$26","v":0},"x",{"$f":"Control!$F$27","v":0},"x",{"$f":"0.000001","v":9.9999999999999995E-7},"=",{"$f":"C50*E50*G50*I50","v":0},"x",{"$f":"Control!$D$102","v":298},"x",{"$f":"Control!$D$104","v":9.9999999999999995E-7},"x",{"$f":"Control!$D$100","v":0.27272727272727271},"=",{"$f":"K50*M50*O50*Q50","v":0},"=",{"$f":"S50*C_CO2","v":0}]
[]
[12,{"$f":"B50+1","v":2013},{"$f":"'Municipal WW, CH4'!C52","v":0},"x",{"$f":"Control!$F$26","v":0},"x",{"$f":"Control!$F$27","v":0},"x",{"$f":"0.000001","v":9.9999999999999995E-7},"=",{"$f":"C52*E52*G52*I52","v":0},"x",{"$f":"Control!$D$102","v":298},"x",{"$f":"Control!$D$104","v":9.9999999999999995E-7},"x",{"$f":"Control!$D$100","v":0.27272727272727271},"=",{"$f":"K52*M52*O52*Q52","v":0},"=",{"$f":"S52*C_CO2","v":0}]
[]
[12,{"$f":"B52+1","v":2014},{"$f":"'Municipal WW, CH4'!C54","v":0},"x",{"$f":"Control!$F$26","v":0},"x",{"$f":"Control!$F$27","v":0},"x",{"$f":"0.000001","v":9.9999999999999995E-7},"=",{"$f":"C54*E54*G54*I54","v":0},"x",{"$f":"Control!$D$102","v":298},"x",{"$f":"Control!$D$104","v":9.9999999999999995E-7},"x",{"$f":"Control!$D$100","v":0.27272727272727271},"=",{"$f":"K54*M54*O54*Q54","v":0},"=",{"$f":"S54*C_CO2","v":0}]
[]
[12,{"$f":"B54+1","v":2015},{"$f":"'Municipal WW, CH4'!C56","v":0},"x",{"$f":"Control!$F$26","v":0},"x",{"$f":"Control!$F$27","v":0},"x",{"$f":"0.000001","v":9.9999999999999995E-7},"=",{"$f":"C56*E56*G56*I56","v":0},"x",{"$f":"Control!$D$102","v":298},"x",{"$f":"Control!$D$104","v":9.9999999999999995E-7},"x",{"$f":"Control!$D$100","v":0.27272727272727271},"=",{"$f":"K56*M56*O56*Q56","v":0},"=",{"$f":"S56*C_CO2","v":0}]
[]
[12,{"$f":"B56+1","v":2016},{"$f":"'Municipal WW, CH4'!C58","v":0},"x",{"$f":"Control!$F$26","v":0},"x",{"$f":"Control!$F$27","v":0},"x",{"$f":"0.000001","v":9.9999999999999995E-7},"=",{"$f":"C58*E58*G58*I58","v":0},"x",{"$f":"Control!$D$102","v":298},"x",{"$f":"Control!$D$104","v":9.9999999999999995E-7},"x",{"$f":"Control!$D$100","v":0.27272727272727271},"=",{"$f":"K58*M58*O58*Q58","v":0},"=",{"$f":"S58*C_CO2","v":0}]
[]
[12,{"$f":"B58+1","v":2017},{"$f":"'Municipal WW, CH4'!C60","v":0},"x",{"$f":"Control!$F$26","v":0},"x",{"$f":"Control!$F$27","v":0},"x",{"$f":"0.000001","v":9.9999999999999995E-7},"=",{"$f":"C60*E60*G60*I60","v":0},"x",{"$f":"Control!$D$102","v":298},"x",{"$f":"Control!$D$104","v":9.9999999999999995E-7},"x",{"$f":"Control!$D$100","v":0.27272727272727271},"=",{"$f":"K60*M60*O60*Q60","v":0},"=",{"$f":"S60*C_CO2","v":0}]
[]
[12,{"$f":"B60+1","v":2018},{"$f":"'Municipal WW, CH4'!C62","v":0},"x",{"$f":"Control!$F$26","v":0},"x",{"$f":"Control!$F$27","v":0},"x",{"$f":"0.000001","v":9.9999999999999995E-7},"=",{"$f":"C62*E62*G62*I62","v":0},"x",{"$f":"Control!$D$102","v":298},"x",{"$f":"Control!$D$104","v":9.9999999999999995E-7},"x",{"$f":"Control!$D$100","v":0.27272727272727271},"=",{"$f":"K62*M62*O62*Q62","v":0},"=",{"$f":"S62*C_CO2","v":0}]
[]
[12,{"$f":"B62+1","v":2019},{"$f":"'Municipal WW, CH4'!C64","v":0},"x",{"$f":"Control!$F$26","v":0},"x",{"$f":"Control!$F$27","v":0},"x",{"$f":"0.000001","v":9.9999999999999995E-7},"=",{"$f":"C64*E64*G64*I64","v":0},"x",{"$f":"Control!$D$102","v":298},"x",{"$f":"Control!$D$104","v":9.9999999999999995E-7},"x",{"$f":"Control!$D$100","v":0.27272727272727271},"=",{"$f":"K64*M64*O64*Q64","v":0},"=",{"$f":"S64*C_CO2","v":0}]
[]
[12,{"$f":"B64+1","v":2020},{"$f":"'Municipal WW, CH4'!C66","v":0},"x",{"$f":"Control!$F$26","v":0},"x",{"$f":"Control!$F$27","v":0},"x",{"$f":"0.000001","v":9.9999999999999995E-7},"=",{"$f":"C66*E66*G66*I66","v":0},"x",{"$f":"Control!$D$102","v":298},"x",{"$f":"Control!$D$104","v":9.9999999999999995E-7},"x",{"$f":"Control!$D$100","v":0.27272727272727271},"=",{"$f":"K66*M66*O66*Q66","v":0},"=",{"$f":"S66*C_CO2","v":0}]

{"sheet":"Municipal WW, N2O, effluent","index":3,"n_rows":66,"n_cols":45,"rows_kept":66,"cut":false,"hidden":false,"merged":[]}
[null,{"$f":"\"6. \"&SelectedState & \" Municipal Wastewater Nitrous Oxide Emissions (formerly Human Sewage)\"","v":"6. Select a state . . . Municipal Wastewater Nitrous Oxide Emissions (formerly Human Sewage)"}]
[]
[null,null,"State Population",null,"Protein",null,"FracNPR ",null,"Fraction Non-Consumption N",null,"Unit Conversion",null,"N in Domestic Wastewater",null,"Direct N Emissions from Domestic Wastewater",null,"Biosolids Available N",null,"Percentage of Biosolids Used as Fertilizer",null,"Emission Factor",null,"N2O/N2",null,"Emissions ",null,"N2O GWP",null,"Unit Conversion",null,"C/CO2",null,"Emissions from Biosolids",null,"Direct Emissions",null,"Total Emissions",null,"Emissions ",null,null,null,null,null,"Protein"]
[null,null,null,null,"(kg/ person/ year)",null,"(kg N/kg protein) ",null,null,null,"(metric tons/kg)",null,"(metric tons)",null,"(metric tons)",null,"(metric tons)",null,null,null,"(kg N2O-N/ kg sewage N-produced) ",null,null,null,"(metric tons N2O)",null,"(CO2 Eq.)",null,"(MMT/MT)",null,null,null,"(MMTCE)",null,"(MMTCE)",null,"(MMTCE)",null,"(MMTCO2E)",null,null,null,null,null,"(Kg/person/year)"]
[]
[2,1990,{"$f":"'Municipal WW, CH4'!C6","v":0},"x",null,"x",{"$f":"Control!$F$33","v":0},"x",{"$f":"Control!$F$25","v":0},"x",{"$f":"Control!$D$105","v":1E-3},"=",{"$f":"C6*E6*G6*I6*K6","v":0},"-",{"$f":"'Municipal WW, N2O, direct'!K6*(1/Control!$D$99)","v":0},"=",{"$f":"M6-O6","v":0},"x (1 -",null,") x",{"$f":"Control!$F$32","v":0},"x",{"$f":"Control!$D$99","v":1.5714285714285714},"=",{"$f":"Q6*(1-S6)*U6*W6","v":0},"x",{"$f":"Control!$D$102","v":298},"x",{"$f":"Control!$D$104","v":9.9999999999999995E-7},"x",{"$f":"Control!$D$100","v":0.27272727272727271},"=",{"$f":"Y6*AA$6*AC$6*AE$6","v":0},"+",{"$f":"'Municipal WW, N2O, direct'!S6","v":0},"=",{"$f":"AG6+AI6","v":0},"=",{"$f":"AK6*C_CO2","v":0},null,null,null,null,null,43.099499999999999]
[]
[3,{"$f":"B6+1","v":1991},{"$f":"'Municipal WW, CH4'!C8","v":0},"x",null,"x",{"$f":"Control!$F$33","v":0},"x",{"$f":"Control!$F$25","v":0},"x",{"$f":"Control!$D$105","v":1E-3},"=",{"$f":"C8*E8*G8*I8*K8","v":0},"-",{"$f":"'Municipal WW, N2O, direct'!K8*(1/Control!$D$99)","v":0},"=",{"$f":"M8-O8","v":0},"x (1 -",null,") x",{"$f":"Control!$F$32","v":0},"x",{"$f":"Control!$D$99","v":1.5714285714285714},"=",{"$f":"Q8*(1-S8)*U8*W8","v":0},"x",{"$f":"Control!$D$102","v":298},"x",{"$f":"Control!$D$104","v":9.9999999999999995E-7},"x",{"$f":"Control!$D$100","v":0.27272727272727271},"=",{"$f":"Y8*AA$6*AC$6*AE$6","v":0},"+",{"$f":"'Municipal WW, N2O, direct'!S8","v":0},"=",{"$f":"AG8+AI8","v":0},"=",{"$f":"AK8*C_CO2","v":0},null,null,null,null,null,43.464750000000002]
[]
[4,{"$f":"B8+1","v":1992},{"$f":"'Municipal WW, CH4'!C10","v":0},"x",null,"x",{"$f":"Control!$F$33","v":0},"x",{"$f":"Control!$F$25","v":0},"x",{"$f":"Control!$D$105","v":1E-3},"=",{"$f":"C10*E10*G10*I10*K10","v":0},"-",{"$f":"'Municipal WW, N2O, direct'!K10*(1/Control!$D$99)","v":0},"=",{"$f":"M10-O10","v":0},"x (1 -",null,") x",{"$f":"Control!$F$32","v":0},"x",{"$f":"Control!$D$99","v":1.5714285714285714},"=",{"$f":"Q10*(1-S10)*U10*W10","v":0},"x",{"$f":"Control!$D$102","v":298},"x",{"$f":"Control!$D$104","v":9.9999999999999995E-7},"x",{"$f":"Control!$D$100","v":0.27272727272727271},"=",{"$f":"Y10*AA$6*AC$6*AE$6","v":0},"+",{"$f":"'Municipal WW, N2O, direct'!S10","v":0},"=",{"$f":"AG10+AI10","v":0},"=",{"$f":"AK10*C_CO2","v":0},null,null,null,null,null,43.83]
[]
[5,{"$f":"B10+1","v":1993},{"$f":"'Municipal WW, CH4'!C12","v":0},"x",null,"x",{"$f":"Control!$F$33","v":0},"x",{"$f":"Control!$F$25","v":0},"x",{"$f":"Control!$D$105","v":1E-3},"=",{"$f":"C12*E12*G12*I12*K12","v":0},"-",{"$f":"'Municipal WW, N2O, direct'!K12*(1/Control!$D$99)","v":0},"=",{"$f":"M12-O12","v":0},"x (1 -",null,") x",{"$f":"Control!$F$32","v":0},"x",{"$f":"Control!$D$99","v":1.5714285714285714},"=",{"$f":"Q12*(1-S12)*U12*W12","v":0},"x",{"$f":"Control!$D$102","v":298},"x",{"$f":"Control!$D$104","v":9.9999999999999995E-7},"x",{"$f":"Control!$D$100","v":0.27272727272727271},"=",{"$f":"Y12*AA$6*AC$6*AE$6","v":0},"+",{"$f":"'Municipal WW, N2O, direct'!S12","v":0},"=",{"$f":"AG12+AI12","v":0},"=",{"$f":"AK12*C_CO2","v":0},null,null,null,null,null,43.83]
[]
[6,{"$f":"B12+1","v":1994},{"$f":"'Municipal WW, CH4'!C14","v":0},"x",null,"x",{"$f":"Control!$F$33","v":0},"x",{"$f":"Control!$F$25","v":0},"x",{"$f":"Control!$D$105","v":1E-3},"=",{"$f":"C14*E14*G14*I14*K14","v":0},"-",{"$f":"'Municipal WW, N2O, direct'!K14*(1/Control!$D$99)","v":0},"=",{"$f":"M14-O14","v":0},"x (1 -",null,") x",{"$f":"Control!$F$32","v":0},"x",{"$f":"Control!$D$99","v":1.5714285714285714},"=",{"$f":"Q14*(1-S14)*U14*W14","v":0},"x",{"$f":"Control!$D$102","v":298},"x",{"$f":"Control!$D$104","v":9.9999999999999995E-7},"x",{"$f":"Control!$D$100","v":0.27272727272727271},"=",{"$f":"Y14*AA$6*AC$6*AE$6","v":0},"+",{"$f":"'Municipal WW, N2O, direct'!S14","v":0},"=",{"$f":"AG14+AI14","v":0},"=",{"$f":"AK14*C_CO2","v":0},null,null,null,null,null,44.560499999999998]
[]
[7,{"$f":"B14+1","v":1995},{"$f":"'Municipal WW, CH4'!C16","v":0},"x",null,"x",{"$f":"Control!$F$33","v":0},"x",{"$f":"Control!$F$25","v":0},"x",{"$f":"Control!$D$105","v":1E-3},"=",{"$f":"C16*E16*G16*I16*K16","v":0},"-",{"$f":"'Municipal WW, N2O, direct'!K16*(1/Control!$D$99)","v":0},"=",{"$f":"M16-O16","v":0},"x (1 -",null,") x",{"$f":"Control!$F$32","v":0},"x",{"$f":"Control!$D$99","v":1.5714285714285714},"=",{"$f":"Q16*(1-S16)*U16*W16","v":0},"x",{"$f":"Control!$D$102","v":298},"x",{"$f":"Control!$D$104","v":9.9999999999999995E-7},"x",{"$f":"Control!$D$100","v":0.27272727272727271},"=",{"$f":"Y16*AA$6*AC$6*AE$6","v":0},"+",{"$f":"'Municipal WW, N2O, direct'!S16","v":0},"=",{"$f":"AG16+AI16","v":0},"=",{"$f":"AK16*C_CO2","v":0},null,null,null,null,null,44.195250000000001]
[]
[8,{"$f":"B16+1","v":1996},{"$f":"'Municipal WW, CH4'!C18","v":0},"x",null,"x",{"$f":"Control!$F$33","v":0},"x",{"$f":"Control!$F$25","v":0},"x",{"$f":"Control!$D$105","v":1E-3},"=",{"$f":"C18*E18*G18*I18*K18","v":0},"-",{"$f":"'Municipal WW, N2O, direct'!K18*(1/Control!$D$99)","v":0},"=",{"$f":"M18-O18","v":0},"x (1 -",null,") x",{"$f":"Control!$F$32","v":0},"x",{"$f":"Control!$D$99","v":1.5714285714285714},"=",{"$f":"Q18*(1-S18)*U18*W18","v":0},"x",{"$f":"Control!$D$102","v":298},"x",{"$f":"Control!$D$104","v":9.9999999999999995E-7},"x",{"$f":"Control!$D$100","v":0.27272727272727271},"=",{"$f":"Y18*AA$6*AC$6*AE$6","v":0},"+",{"$f":"'Municipal WW, N2O, direct'!S18","v":0},"=",{"$f":"AG18+AI18","v":0},"=",{"$f":"AK18*C_CO2","v":0},null,null,null,null,null,44.560499999999998]
[]
[9,{"$f":"B18+1","v":1997},{"$f":"'Municipal WW, CH4'!C20","v":0},"x",null,"x",{"$f":"Control!$F$33","v":0},"x",{"$f":"Control!$F$25","v":0},"x",{"$f":"Control!$D$105","v":1E-3},"=",{"$f":"C20*E20*G20*I20*K20","v":0},"-",{"$f":"'Municipal WW, N2O, direct'!K20*(1/Control!$D$99)","v":0},"=",{"$f":"M20-O20","v":0},"x (1 -",null,") x",{"$f":"Control!$F$32","v":0},"x",{"$f":"Control!$D$99","v":1.5714285714285714},"=",{"$f":"Q20*U20*W20","v":0},"x",{"$f":"Control!$D$102","v":298},"x",{"$f":"Control!$D$104","v":9.9999999999999995E-7},"x",{"$f":"Control!$D$100","v":0.27272727272727271},"=",{"$f":"Y20*AA$6*AC$6*AE$6","v":0},"+",{"$f":"'Municipal WW, N2O, direct'!S20","v":0},"=",{"$f":"AG20+AI20","v":0},"=",{"$f":"AK20*C_CO2","v":0},null,null,null,null,null,44.195250000000001]
[]
[10,{"$f":"B20+1","v":1998},{"$f":"'Municipal WW, CH4'!C22","v":0},"x",null,"x",{"$f":"Control!$F$33","v":0},"x",{"$f":"Control!$F$25","v":0},"x",{"$f":"Control!$D$105","v":1E-3},"=",{"$f":"C22*E22*G22*I22*K22","v":0},"-",{"$f":"'Municipal WW, N2O, direct'!K22*(1/Control!$D$99)","v":0},"=",{"$f":"M22-O22","v":0},"x (1 -",null,") x",{"$f":"Control!$F$32","v":0},"x",{"$f":"Control!$D$99","v":1.5714285714285714},"=",{"$f":"Q22*(1-S22)*U22*W22","v":0},"x",{"$f":"Control!$D$102","v":298},"x",{"$f":"Control!$D$104","v":9.9999999999999995E-7},"x",{"$f":"Control!$D$100","v":0.27272727272727271},"=",{"$f":"Y22*AA$6*AC$6*AE$6","v":0},"+",{"$f":"'Municipal WW, N2O, direct'!S22","v":0},"=",{"$f":"AG22+AI22","v":0},"=",{"$f":"AK22*C_CO2","v":0},null,null,null,null,null,44.560499999999998]
[]
[11,{"$f":"B22+1","v":1999},{"$f":"'Municipal WW, CH4'!C24","v":0},"x",null,"x",{"$f":"Control!$F$33","v":0},"x",{"$f":"Control!$F$25","v":0},"x",{"$f":"Control!$D$105","v":1E-3},"=",{"$f":"C24*E24*G24*I24*K24","v":0},"-",{"$f":"'Municipal WW, N2O, direct'!K24*(1/Control!$D$99)","v":0},"=",{"$f":"M24-O24","v":0},"x (1 -",null,") x",{"$f":"Control!$F$32","v":0},"x",{"$f":"Control!$D$99","v":1.5714285714285714},"=",{"$f":"Q24*(1-S24)*U24*W24","v":0},"x",{"$f":"Control!$D$102","v":298},"x",{"$f":"Control!$D$104","v":9.9999999999999995E-7},"x",{"$f":"Control!$D$100","v":0.27272727272727271},"=",{"$f":"Y24*AA$6*AC$6*AE$6","v":0},"+",{"$f":"'Municipal WW, N2O, direct'!S24","v":0},"=",{"$f":"AG24+AI24","v":0},"=",{"$f":"AK24*C_CO2","v":0},null,null,null,null,null,45.291000000000004]
[]
[12,{"$f":"B24+1","v":2000},{"$f":"'Municipal WW, CH4'!C26","v":0},"x",null,"x",{"$f":"Control!$F$33","v":0},"x",{"$f":"Control!$F$25","v":0},"x",{"$f":"Control!$D$105","v":1E-3},"=",{"$f":"C26*E26*G26*I26*K26","v":0},"-",{"$f":"'Municipal WW, N2O, direct'!K26*(1/Control!$D$99)","v":0},"=",{"$f":"M26-O26","v":0},"x (1 -",null,") x",{"$f":"Control!$F$32","v":0},"x",{"$f":"Control!$D$99","v":1.5714285714285714},"=",{"$f":"Q26*(1-S26)*U26*W26","v":0},"x",{"$f":"Control!$D$102","v":298},"x",{"$f":"Control!$D$104","v":9.9999999999999995E-7},"x",{"$f":"Control!$D$100","v":0.27272727272727271},"=",{"$f":"Y26*AA$6*AC$6*AE$6","v":0},"+",{"$f":"'Municipal WW, N2O, direct'!S26","v":0},"=",{"$f":"AG26+AI26","v":0},"=",{"$f":"AK26*C_CO2","v":0},null,null,null,null,null,45.291000000000004]
[]
[12,{"$f":"B26+1","v":2001},{"$f":"'Municipal WW, CH4'!C28","v":0},"x",null,"x",{"$f":"Control!$F$33","v":0},"x",{"$f":"Control!$F$25","v":0},"x",{"$f":"Control!$D$105","v":1E-3},"=",{"$f":"C28*E28*G28*I28*K28","v":0},"-",{"$f":"'Municipal WW, N2O, direct'!K28*(1/Control!$D$99)","v":0},"=",{"$f":"M28-O28","v":0},"x (1 -",null,") x",{"$f":"Control!$F$32","v":0},"x",{"$f":"Control!$D$99","v":1.5714285714285714},"=",{"$f":"Q28*(1-S28)*U28*W28","v":0},"x",{"$f":"Control!$D$102","v":298},"x",{"$f":"Control!$D$104","v":9.9999999999999995E-7},"x",{"$f":"Control!$D$100","v":0.27272727272727271},"=",{"$f":"Y28*AA$6*AC$6*AE$6","v":0},"+",{"$f":"'Municipal WW, N2O, direct'!S28","v":0},"=",{"$f":"AG28+AI28","v":0},"=",{"$f":"AK28*C_CO2","v":0},null,null,null,null,null,44.560499999999998]
[]
[12,{"$f":"B28+1","v":2002},{"$f":"'Municipal WW, CH4'!C30","v":0},"x",null,"x",{"$f":"Control!$F$33","v":0},"x",{"$f":"Control!$F$25","v":0},"x",{"$f":"Control!$D$105","v":1E-3},"=",{"$f":"C30*E30*G30*I30*K30","v":0},"-",{"$f":"'Municipal WW, N2O, direct'!K30*(1/Control!$D$99)","v":0},"=",{"$f":"M30-O30","v":0},"x (1 -",null,") x",{"$f":"Control!$F$32","v":0},"x",{"$f":"Control!$D$99","v":1.5714285714285714},"=",{"$f":"Q30*(1-S30)*U30*W30","v":0},"x",{"$f":"Control!$D$102","v":298},"x",{"$f":"Control!$D$104","v":9.9999999999999995E-7},"x",{"$f":"Control!$D$100","v":0.27272727272727271},"=",{"$f":"Y30*AA$6*AC$6*AE$6","v":0},"+",{"$f":"'Municipal WW, N2O, direct'!S30","v":0},"=",{"$f":"AG30+AI30","v":0},"=",{"$f":"AK30*C_CO2","v":0},null,null,null,null,null,44.925750000000001]
[]
[12,{"$f":"B30+1","v":2003},{"$f":"'Municipal WW, CH4'!C32","v":0},"x",null,"x",{"$f":"Control!$F$33","v":0},"x",{"$f":"Control!$F$25","v":0},"x",{"$f":"Control!$D$105","v":1E-3},"=",{"$f":"C32*E32*G32*I32*K32","v":0},"-",{"$f":"'Municipal WW, N2O, direct'!K32*(1/Control!$D$99)","v":0},"=",{"$f":"M32-O32","v":0},"x (1 -",null,") x",{"$f":"Control!$F$32","v":0},"x",{"$f":"Control!$D$99","v":1.5714285714285714},"=",{"$f":"Q32*(1-S32)*U32*W32","v":0},"x",{"$f":"Control!$D$102","v":298},"x",{"$f":"Control!$D$104","v":9.9999999999999995E-7},"x",{"$f":"Control!$D$100","v":0.27272727272727271},"=",{"$f":"Y32*AA$6*AC$6*AE$6","v":0},"+",{"$f":"'Municipal WW, N2O, direct'!S32","v":0},"=",{"$f":"AG32+AI32","v":0},"=",{"$f":"AK32*C_CO2","v":0},null,null,null,null,null,45.291000000000004]
[]
[12,{"$f":"B32+1","v":2004},{"$f":"'Municipal WW, CH4'!C34","v":0},"x",null,"x",{"$f":"Control!$F$33","v":0},"x",{"$f":"Control!$F$25","v":0},"x",{"$f":"Control!$D$105","v":1E-3},"=",{"$f":"C34*E34*G34*I34*K34","v":0},"-",{"$f":"'Municipal WW, N2O, direct'!K34*(1/Control!$D$99)","v":0},"=",{"$f":"M34-O34","v":0},"x (1 -",null,") x",{"$f":"Control!$F$32","v":0},"x",{"$f":"Control!$D$99","v":1.5714285714285714},"=",{"$f":"Q34*(1-S34)*U34*W34","v":0},"x",{"$f":"Control!$D$102","v":298},"x",{"$f":"Control!$D$104","v":9.9999999999999995E-7},"x",{"$f":"Control!$D$100","v":0.27272727272727271},"=",{"$f":"Y34*AA$6*AC$6*AE$6","v":0},"+",{"$f":"'Municipal WW, N2O, direct'!S34","v":0},"=",{"$f":"AG34+AI34","v":0},"=",{"$f":"AK34*C_CO2","v":0},null,null,null,null,null,45.65625]
[]
[12,{"$f":"B34+1","v":2005},{"$f":"'Municipal WW, CH4'!C36","v":0},"x",null,"x",{"$f":"Control!$F$33","v":0},"x",{"$f":"Control!$F$25","v":0},"x",{"$f":"Control!$D$105","v":1E-3},"=",{"$f":"C36*E36*G36*I36*K36","v":0},"-",{"$f":"'Municipal WW, N2O, direct'!K36*(1/Control!$D$99)","v":0},"=",{"$f":"M36-O36","v":0},"x (1 -",null,") x",{"$f":"Control!$F$32","v":0},"x",{"$f":"Control!$D$99","v":1.5714285714285714},"=",{"$f":"Q36*(1-S36)*U36*W36","v":0},"x",{"$f":"Control!$D$102","v":298},"x",{"$f":"Control!$D$104","v":9.9999999999999995E-7},"x",{"$f":"Control!$D$100","v":0.27272727272727271},"=",{"$f":"Y36*AA$6*AC$6*AE$6","v":0},"+",{"$f":"'Municipal WW, N2O, direct'!S36","v":0},"=",{"$f":"AG36+AI36","v":0},"=",{"$f":"AK36*C_CO2","v":0},null,null,null,null,null,44.925750000000001]
[]
[12,{"$f":"B36+1","v":2006},{"$f":"'Municipal WW, CH4'!C38","v":0},"x",null,"x",{"$f":"Control!$F$33","v":0},"x",{"$f":"Control!$F$25","v":0},"x",{"$f":"Control!$D$105","v":1E-3},"=",{"$f":"C38*E38*G38*I38*K38","v":0},"-",{"$f":"'Municipal WW, N2O, direct'!K38*(1/Control!$D$99)","v":0},"=",{"$f":"M38-O38","v":0},"x (1 -",null,") x",{"$f":"Control!$F$32","v":0},"x",{"$f":"Control!$D$99","v":1.5714285714285714},"=",{"$f":"Q38*(1-S38)*U38*W38","v":0},"x",{"$f":"Control!$D$102","v":298},"x",{"$f":"Control!$D$104","v":9.9999999999999995E-7},"x",{"$f":"Control!$D$100","v":0.27272727272727271},"=",{"$f":"Y38*AA$6*AC$6*AE$6","v":0},"+",{"$f":"'Municipal WW, N2O, direct'!S38","v":0},"=",{"$f":"AG38+AI38","v":0},"=",{"$f":"AK38*C_CO2","v":0},null,null,null,null,null,45.291000000000004]
[]
[12,{"$f":"B38+1","v":2007},{"$f":"'Municipal WW, CH4'!C40","v":0},"x",null,"x",{"$f":"Control!$F$33","v":0},"x",{"$f":"Control!$F$25","v":0},"x",{"$f":"Control!$D$105","v":1E-3},"=",{"$f":"C40*E40*G40*I40*K40","v":0},"-",{"$f":"'Municipal WW, N2O, direct'!K40*(1/Control!$D$99)","v":0},"=",{"$f":"M40-O40","v":0},"x (1 -",null,") x",{"$f":"Control!$F$32","v":0},"x",{"$f":"Control!$D$99","v":1.5714285714285714},"=",{"$f":"Q40*(1-S40)*U40*W40","v":0},"x",{"$f":"Control!$D$102","v":298},"x",{"$f":"Control!$D$104","v":9.9999999999999995E-7},"x",{"$f":"Control!$D$100","v":0.27272727272727271},"=",{"$f":"Y40*AA$6*AC$6*AE$6","v":0},"+",{"$f":"'Municipal WW, N2O, direct'!S40","v":0},"=",{"$f":"AG40+AI40","v":0},"=",{"$f":"AK40*C_CO2","v":0},null,null,null,null,null,44.925750000000001]
[]
[12,{"$f":"B40+1","v":2008},{"$f":"'Municipal WW, CH4'!C42","v":0},"x",null,"x",{"$f":"Control!$F$33","v":0},"x",{"$f":"Control!$F$25","v":0},"x",{"$f":"Control!$D$105","v":1E-3},"=",{"$f":"C42*E42*G42*I42*K42","v":0},"-",{"$f":"'Municipal WW, N2O, direct'!K42*(1/Control!$D$99)","v":0},"=",{"$f":"M42-O42","v":0},"x (1 -",null,") x",{"$f":"Control!$F$32","v":0},"x",{"$f":"Control!$D$99","v":1.5714285714285714},"=",{"$f":"Q42*(1-S42)*U42*W42","v":0},"x",{"$f":"Control!$D$102","v":298},"x",{"$f":"Control!$D$104","v":9.9999999999999995E-7},"x",{"$f":"Control!$D$100","v":0.27272727272727271},"=",{"$f":"Y42*AA$6*AC$6*AE$6","v":0},"+",{"$f":"'Municipal WW, N2O, direct'!S42","v":0},"=",{"$f":"AG42+AI42","v":0},"=",{"$f":"AK42*C_CO2","v":0},null,null,null,null,null,44.195250000000001]
[]
[12,{"$f":"B42+1","v":2009},{"$f":"'Municipal WW, CH4'!C44","v":0},"x",null,"x",{"$f":"Control!$F$33","v":0},"x",{"$f":"Control!$F$25","v":0},"x",{"$f":"Control!$D$105","v":1E-3},"=",{"$f":"C44*E44*G44*I44*K44","v":0},"-",{"$f":"'Municipal WW, N2O, direct'!K44*(1/Control!$D$99)","v":0},"=",{"$f":"M44-O44","v":0},"x (1 -",null,") x",{"$f":"Control!$F$32","v":0},"x",{"$f":"Control!$D$99","v":1.5714285714285714},"=",{"$f":"Q44*(1-S44)*U44*W44","v":0},"x",{"$f":"Control!$D$102","v":298},"x",{"$f":"Control!$D$104","v":9.9999999999999995E-7},"x",{"$f":"Control!$D$100","v":0.27272727272727271},"=",{"$f":"Y44*AA$6*AC$6*AE$6","v":0},"+",{"$f":"'Municipal WW, N2O, direct'!S44","v":0},"=",{"$f":"AG44+AI44","v":0},"=",{"$f":"AK44*C_CO2","v":0},null,null,null,null,null,43.83]
[]
[12,{"$f":"B44+1","v":2010},{"$f":"'Municipal WW, CH4'!C46","v":0},"x",null,"x",{"$f":"Control!$F$33","v":0},"x",{"$f":"Control!$F$25","v":0},"x",{"$f":"Control!$D$105","v":1E-3},"=",{"$f":"C46*E46*G46*I46*K46","v":0},"-",{"$f":"'Municipal WW, N2O, direct'!K46*(1/Control!$D$99)","v":0},"=",{"$f":"M46-O46","v":0},"x (1 -",null,") x",{"$f":"Control!$F$32","v":0},"x",{"$f":"Control!$D$99","v":1.5714285714285714},"=",{"$f":"Q46*(1-S46)*U46*W46","v":0},"x",{"$f":"Control!$D$102","v":298},"x",{"$f":"Control!$D$104","v":9.9999999999999995E-7},"x",{"$f":"Control!$D$100","v":0.27272727272727271},"=",{"$f":"Y46*AA$6*AC$6*AE$6","v":0},"+",{"$f":"'Municipal WW, N2O, direct'!S46","v":0},"=",{"$f":"AG46+AI46","v":0},"=",{"$f":"AK46*C_CO2","v":0},null,null,null,null,null,43.83]
[]
[12,{"$f":"B46+1","v":2011},{"$f":"'Municipal WW, CH4'!C48","v":0},"x",null,"x",{"$f":"Control!$F$33","v":0},"x",{"$f":"Control!$F$25","v":0},"x",{"$f":"Control!$D$105","v":1E-3},"=",{"$f":"C48*E48*G48*I48*K48","v":0},"-",{"$f":"'Municipal WW, N2O, direct'!K48*(1/Control!$D$99)","v":0},"=",{"$f":"M48-O48","v":0},"x (1 -",null,") x",{"$f":"Control!$F$32","v":0},"x",{"$f":"Control!$D$99","v":1.5714285714285714},"=",{"$f":"Q48*(1-S48)*U48*W48","v":0},"x",{"$f":"Control!$D$102","v":298},"x",{"$f":"Control!$D$104","v":9.9999999999999995E-7},"x",{"$f":"Control!$D$100","v":0.27272727272727271},"=",{"$f":"Y48*AA$6*AC$6*AE$6","v":0},"+",{"$f":"'Municipal WW, N2O, direct'!S48","v":0},"=",{"$f":"AG48+AI48","v":0},"=",{"$f":"AK48*C_CO2","v":0},null,null,null,null,null,42.919371082348363]
[]
[12,{"$f":"B48+1","v":2012},{"$f":"'Municipal WW, CH4'!C50","v":0},"x",null,"x",{"$f":"Control!$F$33","v":0},"x",{"$f":"Control!$F$25","v":0},"x",{"$f":"Control!$D$105","v":1E-3},"=",{"$f":"C50*E50*G50*I50*K50","v":0},"-",{"$f":"'Municipal WW, N2O, direct'!K50*(1/Control!$D$99)","v":0},"=",{"$f":"M50-O50","v":0},"x (1 -",null,") x",{"$f":"Control!$F$32","v":0},"x",{"$f":"Control!$D$99","v":1.5714285714285714},"=",{"$f":"Q50*(1-S50)*U50*W50","v":0},"x",{"$f":"Control!$D$102","v":298},"x",{"$f":"Control!$D$104","v":9.9999999999999995E-7},"x",{"$f":"Control!$D$100","v":0.27272727272727271},"=",{"$f":"Y50*AA$6*AC$6*AE$6","v":0},"+",{"$f":"'Municipal WW, N2O, direct'!S50","v":0},"=",{"$f":"AG50+AI50","v":0},"=",{"$f":"AK50*C_CO2","v":0},null,null,null,null,null,43.338212302632748]
[]
[12,{"$f":"B50+1","v":2013},{"$f":"'Municipal WW, CH4'!C52","v":0},"x",null,"x",{"$f":"Control!$F$33","v":0},"x",{"$f":"Control!$F$25","v":0},"x",{"$f":"Control!$D$105","v":1E-3},"=",{"$f":"C52*E52*G52*I52*K52","v":0},"-",{"$f":"'Municipal WW, N2O, direct'!K52*(1/Control!$D$99)","v":0},"=",{"$f":"M52-O52","v":0},"x (1 -",null,") x",{"$f":"Control!$F$32","v":0},"x",{"$f":"Control!$D$99","v":1.5714285714285714},"=",{"$f":"Q52*(1-S52)*U52*W52","v":0},"x",{"$f":"Control!$D$102","v":298},"x",{"$f":"Control!$D$104","v":9.9999999999999995E-7},"x",{"$f":"Control!$D$100","v":0.27272727272727271},"=",{"$f":"Y52*AA$6*AC$6*AE$6","v":0},"+",{"$f":"'Municipal WW, N2O, direct'!S52","v":0},"=",{"$f":"AG52+AI52","v":0},"=",{"$f":"AK52*C_CO2","v":0},null,null,null,null,null,43.306601644498073]
[]
[12,{"$f":"B52+1","v":2014},{"$f":"'Municipal WW, CH4'!C54","v":0},"x",null,"x",{"$f":"Control!$F$33","v":0},"x",{"$f":"Control!$F$25","v":0},"x",{"$f":"Control!$D$105","v":1E-3},"=",{"$f":"C54*E54*G54*I54*K54","v":0},"-",{"$f":"'Municipal WW, N2O, direct'!K54*(1/Control!$D$99)","v":0},"=",{"$f":"M54-O54","v":0},"x (1 -",null,") x",{"$f":"Control!$F$32","v":0},"x",{"$f":"Control!$D$99","v":1.5714285714285714},"=",{"$f":"Q54*(1-S54)*U54*W54","v":0},"x",{"$f":"Control!$D$102","v":298},"x",{"$f":"Control!$D$104","v":9.9999999999999995E-7},"x",{"$f":"Control!$D$100","v":0.27272727272727271},"=",{"$f":"Y54*AA$6*AC$6*AE$6","v":0},"+",{"$f":"'Municipal WW, N2O, direct'!S54","v":0},"=",{"$f":"AG54+AI54","v":0},"=",{"$f":"AK54*C_CO2","v":0},null,null,null,null,null,44.287169920123382]
[]
[12,{"$f":"B54+1","v":2015},{"$f":"'Municipal WW, CH4'!C56","v":0},"x",null,"x",{"$f":"Control!$F$33","v":0},"x",{"$f":"Control!$F$25","v":0},"x",{"$f":"Control!$D$105","v":1E-3},"=",{"$f":"C56*E56*G56*I56*K56","v":0},"-",{"$f":"'Municipal WW, N2O, direct'!K56*(1/Control!$D$99)","v":0},"=",{"$f":"M56-O56","v":0},"x (1 -",null,") x",{"$f":"Control!$F$32","v":0},"x",{"$f":"Control!$D$99","v":1.5714285714285714},"=",{"$f":"Q56*(1-S56)*U56*W56","v":0},"x",{"$f":"Control!$D$102","v":298},"x",{"$f":"Control!$D$104","v":9.9999999999999995E-7},"x",{"$f":"Control!$D$100","v":0.27272727272727271},"=",{"$f":"Y56*AA$6*AC$6*AE$6","v":0},"+",{"$f":"'Municipal WW, N2O, direct'!S56","v":0},"=",{"$f":"AG56+AI56","v":0},"=",{"$f":"AK56*C_CO2","v":0},null,null,null,null,null,44.283897896968327]
[]
[12,{"$f":"B56+1","v":2016},{"$f":"'Municipal WW, CH4'!C58","v":0},"x",null,"x",{"$f":"Control!$F$33","v":0},"x",{"$f":"Control!$F$25","v":0},"x",{"$f":"Control!$D$105","v":1E-3},"=",{"$f":"C58*E58*G58*I58*K58","v":0},"-",{"$f":"'Municipal WW, N2O, direct'!K58*(1/Control!$D$99)","v":0},"=",{"$f":"M58-O58","v":0},"x (1 -",null,") x",{"$f":"Control!$F$32","v":0},"x",{"$f":"Control!$D$99","v":1.5714285714285714},"=",{"$f":"Q58*(1-S58)*U58*W58","v":0},"x",{"$f":"Control!$D$102","v":298},"x",{"$f":"Control!$D$104","v":9.9999999999999995E-7},"x",{"$f":"Control!$D$100","v":0.27272727272727271},"=",{"$f":"Y58*AA$6*AC$6*AE$6","v":0},"+",{"$f":"'Municipal WW, N2O, direct'!S58","v":0},"=",{"$f":"AG58+AI58","v":0},"=",{"$f":"AK58*C_CO2","v":0},null,null,null,null,null,44.280625873813257]
[]
[12,{"$f":"B58+1","v":2017},{"$f":"'Municipal WW, CH4'!C60","v":0},"x",null,"x",{"$f":"Control!$F$33","v":0},"x",{"$f":"Control!$F$25","v":0},"x",{"$f":"Control!$D$105","v":1E-3},"=",{"$f":"C60*E60*G60*I60*K60","v":0},"-",{"$f":"'Municipal WW, N2O, direct'!K60*(1/Control!$D$99)","v":0},"=",{"$f":"M60-O60","v":0},"x (1 -",null,") x",{"$f":"Control!$F$32","v":0},"x",{"$f":"Control!$D$99","v":1.5714285714285714},"=",{"$f":"Q60*(1-S60)*U60*W60","v":0},"x",{"$f":"Control!$D$102","v":298},"x",{"$f":"Control!$D$104","v":9.9999999999999995E-7},"x",{"$f":"Control!$D$100","v":0.27272727272727271},"=",{"$f":"Y60*AA$6*AC$6*AE$6","v":0},"+",{"$f":"'Municipal WW, N2O, direct'!S60","v":0},"=",{"$f":"AG60+AI60","v":0},"=",{"$f":"AK60*C_CO2","v":0},null,null,null,null,null,44.277353850658201]
[]
[12,{"$f":"B60+1","v":2018},{"$f":"'Municipal WW, CH4'!C62","v":0},"x",null,"x",{"$f":"Control!$F$33","v":0},"x",{"$f":"Control!$F$25","v":0},"x",{"$f":"Control!$D$105","v":1E-3},"=",{"$f":"C62*E62*G62*I62*K62","v":0},"-",{"$f":"'Municipal WW, N2O, direct'!K62*(1/Control!$D$99)","v":0},"=",{"$f":"M62-O62","v":0},"x (1 -",null,") x",{"$f":"Control!$F$32","v":0},"x",{"$f":"Control!$D$99","v":1.5714285714285714},"=",{"$f":"Q62*(1-S62)*U62*W62","v":0},"x",{"$f":"Control!$D$102","v":298},"x",{"$f":"Control!$D$104","v":9.9999999999999995E-7},"x",{"$f":"Control!$D$100","v":0.27272727272727271},"=",{"$f":"Y62*AA$6*AC$6*AE$6","v":0},"+",{"$f":"'Municipal WW, N2O, direct'!S62","v":0},"=",{"$f":"AG62+AI62","v":0},"=",{"$f":"AK62*C_CO2","v":0},null,null,null,null,null,44.274081827503139]
[]
[12,{"$f":"B62+1","v":2019},{"$f":"'Municipal WW, CH4'!C64","v":0},"x",null,"x",{"$f":"Control!$F$33","v":0},"x",{"$f":"Control!$F$25","v":0},"x",{"$f":"Control!$D$105","v":1E-3},"=",{"$f":"C64*E64*G64*I64*K64","v":0},"-",{"$f":"'Municipal WW, N2O, direct'!K64*(1/Control!$D$99)","v":0},"=",{"$f":"M64-O64","v":0},"x (1 -",null,") x",{"$f":"Control!$F$32","v":0},"x",{"$f":"Control!$D$99","v":1.5714285714285714},"=",{"$f":"Q64*(1-S64)*U64*W64","v":0},"x",{"$f":"Control!$D$102","v":298},"x",{"$f":"Control!$D$104","v":9.9999999999999995E-7},"x",{"$f":"Control!$D$100","v":0.27272727272727271},"=",{"$f":"Y64*AA$6*AC$6*AE$6","v":0},"+",{"$f":"'Municipal WW, N2O, direct'!S64","v":0},"=",{"$f":"AG64+AI64","v":0},"=",{"$f":"AK64*C_CO2","v":0},null,null,null,null,null,{"$f":"AS62","v":44.274081827503139}]
[]
[12,{"$f":"B64+1","v":2020},{"$f":"'Municipal WW, CH4'!C66","v":0},"x",null,"x",{"$f":"Control!$F$33","v":0},"x",{"$f":"Control!$F$25","v":0},"x",{"$f":"Control!$D$105","v":1E-3},"=",{"$f":"C66*E66*G66*I66*K66","v":0},"-",{"$f":"'Municipal WW, N2O, direct'!K66*(1/Control!$D$99)","v":0},"=",{"$f":"M66-O66","v":0},"x (1 -",null,") x",{"$f":"Control!$F$32","v":0},"x",{"$f":"Control!$D$99","v":1.5714285714285714},"=",{"$f":"Q66*(1-S66)*U66*W66","v":0},"x",{"$f":"Control!$D$102","v":298},"x",{"$f":"Control!$D$104","v":9.9999999999999995E-7},"x",{"$f":"Control!$D$100","v":0.27272727272727271},"=",{"$f":"Y66*AA$6*AC$6*AE$6","v":0},"+",{"$f":"'Municipal WW, N2O, direct'!S66","v":0},"=",{"$f":"AG66+AI66","v":0},"=",{"$f":"AK66*C_CO2","v":0}]

{"sheet":"Ind WW Fruit","index":4,"n_rows":66,"n_cols":27,"rows_kept":66,"cut":false,"hidden":false,"merged":[[1,0,1,7]]}
[null,{"$f":"\"7. \"&SelectedState & \" Industrial Wastewater Methane - Fruits and Vegetables\"","v":"7. Select a state . . . Industrial Wastewater Methane - Fruits and Vegetables"}]
[]
[null,null,"Production Processed",null,"WW Outflow ",null,"Unit Conversion",null,"COD ",null,"Emission Factor",null,"COD Degraded",null,"Emissions ",null,"Unit Conversion",null,"Emissions ",null,"CH4 GWP",null,"C/CO2",null,"Emissions ",null,"Emissions "]
[null,null,"(metric tons)",null,"(m3/metric ton)",null,"(l/m3)",null,"(g COD/l)",null,"(g CH4/g COD)",null,"(percent)",null,"(g CH4)",null,"(g/Tg)",null,"(Tg or MMT CH4)",null,"(CO2 Eq.)",null,null,null,"(MMTCE)",null,"(MMTCO2E)"]
[]
[null,1990,null,"x",{"$f":"Control!$F$37","v":0},"x",{"$f":"Control!$D$106","v":1000},"x",{"$f":"Control!$F$38","v":0},"x",{"$f":"Control!$F$40","v":0},"x",{"$f":"Control!$F$39","v":0},"=",{"$f":"C6*$E$6*$G$6*$I$6*$M$6*$K$6","v":0},"x",{"$f":"Control!$D$107","v":9.9999999999999998E-13},"=",{"$f":"O6*Q6","v":0},"x",{"$f":"Control!$D$101","v":25},"x",{"$f":"Control!$D$100","v":0.27272727272727271},"=",{"$f":"S6*U$6*W$6","v":0},"=",{"$f":"Y6*C_CO2","v":0}]
[]
[null,{"$f":"B6+1","v":1991},null,"x",{"$f":"Control!$F$37","v":0},"x",{"$f":"Control!$D$106","v":1000},"x",{"$f":"Control!$F$38","v":0},"x",{"$f":"Control!$F$40","v":0},"x",{"$f":"Control!$F$39","v":0},"=",{"$f":"C8*$E$6*$G$6*$I$6*$M$6*$K$6","v":0},"x",{"$f":"Control!$D$107","v":9.9999999999999998E-13},"=",{"$f":"O8*Q8","v":0},"x",{"$f":"Control!$D$101","v":25},"x",{"$f":"Control!$D$100","v":0.27272727272727271},"=",{"$f":"S8*U$6*W$6","v":0},"=",{"$f":"Y8*C_CO2","v":0}]
[]
[null,{"$f":"B8+1","v":1992},null,"x",{"$f":"Control!$F$37","v":0},"x",{"$f":"Control!$D$106","v":1000},"x",{"$f":"Control!$F$38","v":0},"x",{"$f":"Control!$F$40","v":0},"x",{"$f":"Control!$F$39","v":0},"=",{"$f":"C10*$E$6*$G$6*$I$6*$M$6*$K$6","v":0},"x",{"$f":"Control!$D$107","v":9.9999999999999998E-13},"=",{"$f":"O10*Q10","v":0},"x",{"$f":"Control!$D$101","v":25},"x",{"$f":"Control!$D$100","v":0.27272727272727271},"=",{"$f":"S10*U$6*W$6","v":0},"=",{"$f":"Y10*C_CO2","v":0}]
[]
[null,{"$f":"B10+1","v":1993},null,"x",{"$f":"Control!$F$37","v":0},"x",{"$f":"Control!$D$106","v":1000},"x",{"$f":"Control!$F$38","v":0},"x",{"$f":"Control!$F$40","v":0},"x",{"$f":"Control!$F$39","v":0},"=",{"$f":"C12*$E$6*$G$6*$I$6*$M$6*$K$6","v":0},"x",{"$f":"Control!$D$107","v":9.9999999999999998E-13},"=",{"$f":"O12*Q12","v":0},"x",{"$f":"Control!$D$101","v":25},"x",{"$f":"Control!$D$100","v":0.27272727272727271},"=",{"$f":"S12*U$6*W$6","v":0},"=",{"$f":"Y12*C_CO2","v":0}]
[]
[null,{"$f":"B12+1","v":1994},null,"x",{"$f":"Control!$F$37","v":0},"x",{"$f":"Control!$D$106","v":1000},"x",{"$f":"Control!$F$38","v":0},"x",{"$f":"Control!$F$40","v":0},"x",{"$f":"Control!$F$39","v":0},"=",{"$f":"C14*$E$6*$G$6*$I$6*$M$6*$K$6","v":0},"x",{"$f":"Control!$D$107","v":9.9999999999999998E-13},"=",{"$f":"O14*Q14","v":0},"x",{"$f":"Control!$D$101","v":25},"x",{"$f":"Control!$D$100","v":0.27272727272727271},"=",{"$f":"S14*U$6*W$6","v":0},"=",{"$f":"Y14*C_CO2","v":0}]
[]
[null,{"$f":"B14+1","v":1995},null,"x",{"$f":"Control!$F$37","v":0},"x",{"$f":"Control!$D$106","v":1000},"x",{"$f":"Control!$F$38","v":0},"x",{"$f":"Control!$F$40","v":0},"x",{"$f":"Control!$F$39","v":0},"=",{"$f":"C16*$E$6*$G$6*$I$6*$M$6*$K$6","v":0},"x",{"$f":"Control!$D$107","v":9.9999999999999998E-13},"=",{"$f":"O16*Q16","v":0},"x",{"$f":"Control!$D$101","v":25},"x",{"$f":"Control!$D$100","v":0.27272727272727271},"=",{"$f":"S16*U$6*W$6","v":0},"=",{"$f":"Y16*C_CO2","v":0}]
[]
[null,{"$f":"B16+1","v":1996},null,"x",{"$f":"Control!$F$37","v":0},"x",{"$f":"Control!$D$106","v":1000},"x",{"$f":"Control!$F$38","v":0},"x",{"$f":"Control!$F$40","v":0},"x",{"$f":"Control!$F$39","v":0},"=",{"$f":"C18*$E$6*$G$6*$I$6*$M$6*$K$6","v":0},"x",{"$f":"Control!$D$107","v":9.9999999999999998E-13},"=",{"$f":"O18*Q18","v":0},"x",{"$f":"Control!$D$101","v":25},"x",{"$f":"Control!$D$100","v":0.27272727272727271},"=",{"$f":"S18*U$6*W$6","v":0},"=",{"$f":"Y18*C_CO2","v":0}]
[]
[null,{"$f":"B18+1","v":1997},null,"x",{"$f":"Control!$F$37","v":0},"x",{"$f":"Control!$D$106","v":1000},"x",{"$f":"Control!$F$38","v":0},"x",{"$f":"Control!$F$40","v":0},"x",{"$f":"Control!$F$39","v":0},"=",{"$f":"C20*$E$6*$G$6*$I$6*$M$6*$K$6","v":0},"x",{"$f":"Control!$D$107","v":9.9999999999999998E-13},"=",{"$f":"O20*Q20","v":0},"x",{"$f":"Control!$D$101","v":25},"x",{"$f":"Control!$D$100","v":0.27272727272727271},"=",{"$f":"S20*U$6*W$6","v":0},"=",{"$f":"Y20*C_CO2","v":0}]
[]
[null,{"$f":"B20+1","v":1998},null,"x",{"$f":"Control!$F$37","v":0},"x",{"$f":"Control!$D$106","v":1000},"x",{"$f":"Control!$F$38","v":0},"x",{"$f":"Control!$F$40","v":0},"x",{"$f":"Control!$F$39","v":0},"=",{"$f":"C22*$E$6*$G$6*$I$6*$M$6*$K$6","v":0},"x",{"$f":"Control!$D$107","v":9.9999999999999998E-13},"=",{"$f":"O22*Q22","v":0},"x",{"$f":"Control!$D$101","v":25},"x",{"$f":"Control!$D$100","v":0.27272727272727271},"=",{"$f":"S22*U$6*W$6","v":0},"=",{"$f":"Y22*C_CO2","v":0}]
[]
[null,{"$f":"B22+1","v":1999},null,"x",{"$f":"Control!$F$37","v":0},"x",{"$f":"Control!$D$106","v":1000},"x",{"$f":"Control!$F$38","v":0},"x",{"$f":"Control!$F$40","v":0},"x",{"$f":"Control!$F$39","v":0},"=",{"$f":"C24*$E$6*$G$6*$I$6*$M$6*$K$6","v":0},"x",{"$f":"Control!$D$107","v":9.9999999999999998E-13},"=",{"$f":"O24*Q24","v":0},"x",{"$f":"Control!$D$101","v":25},"x",{"$f":"Control!$D$100","v":0.27272727272727271},"=",{"$f":"S24*U$6*W$6","v":0},"=",{"$f":"Y24*C_CO2","v":0}]
[]
[null,{"$f":"B24+1","v":2000},null,"x",{"$f":"Control!$F$37","v":0},"x",{"$f":"Control!$D$106","v":1000},"x",{"$f":"Control!$F$38","v":0},"x",{"$f":"Control!$F$40","v":0},"x",{"$f":"Control!$F$39","v":0},"=",{"$f":"C26*$E$6*$G$6*$I$6*$M$6*$K$6","v":0},"x",{"$f":"Control!$D$107","v":9.9999999999999998E-13},"=",{"$f":"O26*Q26","v":0},"x",{"$f":"Control!$D$101","v":25},"x",{"$f":"Control!$D$100","v":0.27272727272727271},"=",{"$f":"S26*U$6*W$6","v":0},"=",{"$f":"Y26*C_CO2","v":0}]
[]
[null,{"$f":"B26+1","v":2001},null,"x",{"$f":"Control!$F$37","v":0},"x",{"$f":"Control!$D$106","v":1000},"x",{"$f":"Control!$F$38","v":0},"x",{"$f":"Control!$F$40","v":0},"x",{"$f":"Control!$F$39","v":0},"=",{"$f":"C28*$E$6*$G$6*$I$6*$M$6*$K$6","v":0},"x",{"$f":"Control!$D$107","v":9.9999999999999998E-13},"=",{"$f":"O28*Q28","v":0},"x",{"$f":"Control!$D$101","v":25},"x",{"$f":"Control!$D$100","v":0.27272727272727271},"=",{"$f":"S28*U$6*W$6","v":0},"=",{"$f":"Y28*C_CO2","v":0}]
[]
[null,{"$f":"B28+1","v":2002},null,"x",{"$f":"Control!$F$37","v":0},"x",{"$f":"Control!$D$106","v":1000},"x",{"$f":"Control!$F$38","v":0},"x",{"$f":"Control!$F$40","v":0},"x",{"$f":"Control!$F$39","v":0},"=",{"$f":"C30*$E$6*$G$6*$I$6*$M$6*$K$6","v":0},"x",{"$f":"Control!$D$107","v":9.9999999999999998E-13},"=",{"$f":"O30*Q30","v":0},"x",{"$f":"Control!$D$101","v":25},"x",{"$f":"Control!$D$100","v":0.27272727272727271},"=",{"$f":"S30*U$6*W$6","v":0},"=",{"$f":"Y30*C_CO2","v":0}]
[]
[null,{"$f":"B30+1","v":2003},null,"x",{"$f":"Control!$F$37","v":0},"x",{"$f":"Control!$D$106","v":1000},"x",{"$f":"Control!$F$38","v":0},"x",{"$f":"Control!$F$40","v":0},"x",{"$f":"Control!$F$39","v":0},"=",{"$f":"C32*$E$6*$G$6*$I$6*$M$6*$K$6","v":0},"x",{"$f":"Control!$D$107","v":9.9999999999999998E-13},"=",{"$f":"O32*Q32","v":0},"x",{"$f":"Control!$D$101","v":25},"x",{"$f":"Control!$D$100","v":0.27272727272727271},"=",{"$f":"S32*U$6*W$6","v":0},"=",{"$f":"Y32*C_CO2","v":0}]
[]
[null,{"$f":"B32+1","v":2004},null,"x",{"$f":"Control!$F$37","v":0},"x",{"$f":"Control!$D$106","v":1000},"x",{"$f":"Control!$F$38","v":0},"x",{"$f":"Control!$F$40","v":0},"x",{"$f":"Control!$F$39","v":0},"=",{"$f":"C34*$E$6*$G$6*$I$6*$M$6*$K$6","v":0},"x",{"$f":"Control!$D$107","v":9.9999999999999998E-13},"=",{"$f":"O34*Q34","v":0},"x",{"$f":"Control!$D$101","v":25},"x",{"$f":"Control!$D$100","v":0.27272727272727271},"=",{"$f":"S34*U$6*W$6","v":0},"=",{"$f":"Y34*C_CO2","v":0}]
[]
[null,{"$f":"B34+1","v":2005},null,"x",{"$f":"Control!$F$37","v":0},"x",{"$f":"Control!$D$106","v":1000},"x",{"$f":"Control!$F$38","v":0},"x",{"$f":"Control!$F$40","v":0},"x",{"$f":"Control!$F$39","v":0},"=",{"$f":"C36*$E$6*$G$6*$I$6*$M$6*$K$6","v":0},"x",{"$f":"Control!$D$107","v":9.9999999999999998E-13},"=",{"$f":"O36*Q36","v":0},"x",{"$f":"Control!$D$101","v":25},"x",{"$f":"Control!$D$100","v":0.27272727272727271},"=",{"$f":"S36*U$6*W$6","v":0},"=",{"$f":"Y36*C_CO2","v":0}]
[]
[null,{"$f":"B36+1","v":2006},null,"x",{"$f":"Control!$F$37","v":0},"x",{"$f":"Control!$D$106","v":1000},"x",{"$f":"Control!$F$38","v":0},"x",{"$f":"Control!$F$40","v":0},"x",{"$f":"Control!$F$39","v":0},"=",{"$f":"C38*$E$6*$G$6*$I$6*$M$6*$K$6","v":0},"x",{"$f":"Control!$D$107","v":9.9999999999999998E-13},"=",{"$f":"O38*Q38","v":0},"x",{"$f":"Control!$D$101","v":25},"x",{"$f":"Control!$D$100","v":0.27272727272727271},"=",{"$f":"S38*U$6*W$6","v":0},"=",{"$f":"Y38*C_CO2","v":0}]
[]
[null,{"$f":"B38+1","v":2007},null,"x",{"$f":"Control!$F$37","v":0},"x",{"$f":"Control!$D$106","v":1000},"x",{"$f":"Control!$F$38","v":0},"x",{"$f":"Control!$F$40","v":0},"x",{"$f":"Control!$F$39","v":0},"=",{"$f":"C40*$E$6*$G$6*$I$6*$M$6*$K$6","v":0},"x",{"$f":"Control!$D$107","v":9.9999999999999998E-13},"=",{"$f":"O40*Q40","v":0},"x",{"$f":"Control!$D$101","v":25},"x",{"$f":"Control!$D$100","v":0.27272727272727271},"=",{"$f":"S40*U$6*W$6","v":0},"=",{"$f":"Y40*C_CO2","v":0}]
[]
[null,{"$f":"B40+1","v":2008},null,"x",{"$f":"Control!$F$37","v":0},"x",{"$f":"Control!$D$106","v":1000},"x",{"$f":"Control!$F$38","v":0},"x",{"$f":"Control!$F$40","v":0},"x",{"$f":"Control!$F$39","v":0},"=",{"$f":"C42*$E$6*$G$6*$I$6*$M$6*$K$6","v":0},"x",{"$f":"Control!$D$107","v":9.9999999999999998E-13},"=",{"$f":"O42*Q42","v":0},"x",{"$f":"Control!$D$101","v":25},"x",{"$f":"Control!$D$100","v":0.27272727272727271},"=",{"$f":"S42*U$6*W$6","v":0},"=",{"$f":"Y42*C_CO2","v":0}]
[]
[null,{"$f":"B42+1","v":2009},null,"x",{"$f":"Control!$F$37","v":0},"x",{"$f":"Control!$D$106","v":1000},"x",{"$f":"Control!$F$38","v":0},"x",{"$f":"Control!$F$40","v":0},"x",{"$f":"Control!$F$39","v":0},"=",{"$f":"C44*$E$6*$G$6*$I$6*$M$6*$K$6","v":0},"x",{"$f":"Control!$D$107","v":9.9999999999999998E-13},"=",{"$f":"O44*Q44","v":0},"x",{"$f":"Control!$D$101","v":25},"x",{"$f":"Control!$D$100","v":0.27272727272727271},"=",{"$f":"S44*U$6*W$6","v":0},"=",{"$f":"Y44*C_CO2","v":0}]
[]
[null,{"$f":"B44+1","v":2010},null,"x",{"$f":"Control!$F$37","v":0},"x",{"$f":"Control!$D$106","v":1000},"x",{"$f":"Control!$F$38","v":0},"x",{"$f":"Control!$F$40","v":0},"x",{"$f":"Control!$F$39","v":0},"=",{"$f":"C46*$E$6*$G$6*$I$6*$M$6*$K$6","v":0},"x",{"$f":"Control!$D$107","v":9.9999999999999998E-13},"=",{"$f":"O46*Q46","v":0},"x",{"$f":"Control!$D$101","v":25},"x",{"$f":"Control!$D$100","v":0.27272727272727271},"=",{"$f":"S46*U$6*W$6","v":0},"=",{"$f":"Y46*C_CO2","v":0}]
[]
[null,{"$f":"B46+1","v":2011},null,"x",{"$f":"Control!$F$37","v":0},"x",{"$f":"Control!$D$106","v":1000},"x",{"$f":"Control!$F$38","v":0},"x",{"$f":"Control!$F$40","v":0},"x",{"$f":"Control!$F$39","v":0},"=",{"$f":"C48*$E$6*$G$6*$I$6*$M$6*$K$6","v":0},"x",{"$f":"Control!$D$107","v":9.9999999999999998E-13},"=",{"$f":"O48*Q48","v":0},"x",{"$f":"Control!$D$101","v":25},"x",{"$f":"Control!$D$100","v":0.27272727272727271},"=",{"$f":"S48*U$6*W$6","v":0},"=",{"$f":"Y48*C_CO2","v":0}]
[]
[null,{"$f":"B48+1","v":2012},null,"x",{"$f":"Control!$F$37","v":0},"x",{"$f":"Control!$D$106","v":1000},"x",{"$f":"Control!$F$38","v":0},"x",{"$f":"Control!$F$40","v":0},"x",{"$f":"Control!$F$39","v":0},"=",{"$f":"C50*$E$6*$G$6*$I$6*$M$6*$K$6","v":0},"x",{"$f":"Control!$D$107","v":9.9999999999999998E-13},"=",{"$f":"O50*Q50","v":0},"x",{"$f":"Control!$D$101","v":25},"x",{"$f":"Control!$D$100","v":0.27272727272727271},"=",{"$f":"S50*U$6*W$6","v":0},"=",{"$f":"Y50*C_CO2","v":0}]
[]
[null,{"$f":"B50+1","v":2013},null,"x",{"$f":"Control!$F$37","v":0},"x",{"$f":"Control!$D$106","v":1000},"x",{"$f":"Control!$F$38","v":0},"x",{"$f":"Control!$F$40","v":0},"x",{"$f":"Control!$F$39","v":0},"=",{"$f":"C52*$E$6*$G$6*$I$6*$M$6*$K$6","v":0},"x",{"$f":"Control!$D$107","v":9.9999999999999998E-13},"=",{"$f":"O52*Q52","v":0},"x",{"$f":"Control!$D$101","v":25},"x",{"$f":"Control!$D$100","v":0.27272727272727271},"=",{"$f":"S52*U$6*W$6","v":0},"=",{"$f":"Y52*C_CO2","v":0}]
[]
[null,{"$f":"B52+1","v":2014},null,"x",{"$f":"Control!$F$37","v":0},"x",{"$f":"Control!$D$106","v":1000},"x",{"$f":"Control!$F$38","v":0},"x",{"$f":"Control!$F$40","v":0},"x",{"$f":"Control!$F$39","v":0},"=",{"$f":"C54*$E$6*$G$6*$I$6*$M$6*$K$6","v":0},"x",{"$f":"Control!$D$107","v":9.9999999999999998E-13},"=",{"$f":"O54*Q54","v":0},"x",{"$f":"Control!$D$101","v":25},"x",{"$f":"Control!$D$100","v":0.27272727272727271},"=",{"$f":"S54*U$6*W$6","v":0},"=",{"$f":"Y54*C_CO2","v":0}]
[]
[null,{"$f":"B54+1","v":2015},null,"x",{"$f":"Control!$F$37","v":0},"x",{"$f":"Control!$D$106","v":1000},"x",{"$f":"Control!$F$38","v":0},"x",{"$f":"Control!$F$40","v":0},"x",{"$f":"Control!$F$39","v":0},"=",{"$f":"C56*$E$6*$G$6*$I$6*$M$6*$K$6","v":0},"x",{"$f":"Control!$D$107","v":9.9999999999999998E-13},"=",{"$f":"O56*Q56","v":0},"x",{"$f":"Control!$D$101","v":25},"x",{"$f":"Control!$D$100","v":0.27272727272727271},"=",{"$f":"S56*U$6*W$6","v":0},"=",{"$f":"Y56*C_CO2","v":0}]
[]
[null,{"$f":"B56+1","v":2016},null,"x",{"$f":"Control!$F$37","v":0},"x",{"$f":"Control!$D$106","v":1000},"x",{"$f":"Control!$F$38","v":0},"x",{"$f":"Control!$F$40","v":0},"x",{"$f":"Control!$F$39","v":0},"=",{"$f":"C58*$E$6*$G$6*$I$6*$M$6*$K$6","v":0},"x",{"$f":"Control!$D$107","v":9.9999999999999998E-13},"=",{"$f":"O58*Q58","v":0},"x",{"$f":"Control!$D$101","v":25},"x",{"$f":"Control!$D$100","v":0.27272727272727271},"=",{"$f":"S58*U$6*W$6","v":0},"=",{"$f":"Y58*C_CO2","v":0}]
[]
[null,{"$f":"B58+1","v":2017},null,"x",{"$f":"Control!$F$37","v":0},"x",{"$f":"Control!$D$106","v":1000},"x",{"$f":"Control!$F$38","v":0},"x",{"$f":"Control!$F$40","v":0},"x",{"$f":"Control!$F$39","v":0},"=",{"$f":"C60*$E$6*$G$6*$I$6*$M$6*$K$6","v":0},"x",{"$f":"Control!$D$107","v":9.9999999999999998E-13},"=",{"$f":"O60*Q60","v":0},"x",{"$f":"Control!$D$101","v":25},"x",{"$f":"Control!$D$100","v":0.27272727272727271},"=",{"$f":"S60*U$6*W$6","v":0},"=",{"$f":"Y60*C_CO2","v":0}]
[]
[null,{"$f":"B60+1","v":2018},null,"x",{"$f":"Control!$F$37","v":0},"x",{"$f":"Control!$D$106","v":1000},"x",{"$f":"Control!$F$38","v":0},"x",{"$f":"Control!$F$40","v":0},"x",{"$f":"Control!$F$39","v":0},"=",{"$f":"C62*$E$6*$G$6*$I$6*$M$6*$K$6","v":0},"x",{"$f":"Control!$D$107","v":9.9999999999999998E-13},"=",{"$f":"O62*Q62","v":0},"x",{"$f":"Control!$D$101","v":25},"x",{"$f":"Control!$D$100","v":0.27272727272727271},"=",{"$f":"S62*U$6*W$6","v":0},"=",{"$f":"Y62*C_CO2","v":0}]
[]
[null,{"$f":"B62+1","v":2019},null,"x",{"$f":"Control!$F$37","v":0},"x",{"$f":"Control!$D$106","v":1000},"x",{"$f":"Control!$F$38","v":0},"x",{"$f":"Control!$F$40","v":0},"x",{"$f":"Control!$F$39","v":0},"=",{"$f":"C64*$E$6*$G$6*$I$6*$M$6*$K$6","v":0},"x",{"$f":"Control!$D$107","v":9.9999999999999998E-13},"=",{"$f":"O64*Q64","v":0},"x",{"$f":"Control!$D$101","v":25},"x",{"$f":"Control!$D$100","v":0.27272727272727271},"=",{"$f":"S64*U$6*W$6","v":0},"=",{"$f":"Y64*C_CO2","v":0}]
[]
[null,{"$f":"B64+1","v":2020},null,"x",{"$f":"Control!$F$37","v":0},"x",{"$f":"Control!$D$106","v":1000},"x",{"$f":"Control!$F$38","v":0},"x",{"$f":"Control!$F$40","v":0},"x",{"$f":"Control!$F$39","v":0},"=",{"$f":"C66*$E$6*$G$6*$I$6*$M$6*$K$6","v":0},"x",{"$f":"Control!$D$107","v":9.9999999999999998E-13},"=",{"$f":"O66*Q66","v":0},"x",{"$f":"Control!$D$101","v":25},"x",{"$f":"Control!$D$100","v":0.27272727272727271},"=",{"$f":"S66*U$6*W$6","v":0},"=",{"$f":"Y66*C_CO2","v":0}]

{"sheet":"Ind WW Meat","index":5,"n_rows":66,"n_cols":27,"rows_kept":66,"cut":false,"hidden":false,"merged":[[1,0,1,7]]}
[null,{"$f":"\"8. \"&SelectedState & \" Industrial Wastewater Methane - Red Meat\"","v":"8. Select a state . . . Industrial Wastewater Methane - Red Meat"}]
[{"$f":"SelectedStateAbbr","v":"XX"}]
[null,null,"Production Processed",null,"WW Outflow ",null,"Unit Conversion",null,"COD ",null,"Emission Factor",null,"COD Degraded",null,"Emissions ",null,"Unit Conversion",null,"Emissions ",null,"CH4 GWP",null,"C/CO2",null,"Emissions ",null,"Emissions "]
[null,null,"(metric tons)",null,"(m3/metric ton)",null,"(l/m3)",null,"(g COD/l)",null,"(g CH4/g COD)",null,"(percent)",null,"(g CH4)",null,"(g/Tg)",null,"(Tg or MMT CH4)",null,"(CO2 Eq.)",null,null,null,"(MMTCE)",null,"(MMTCO2E)"]
[]
[2,1990,null,"x",{"$f":"Control!$F$44","v":0},"x",{"$f":"Control!$D$106","v":1000},"x",{"$f":"Control!$F$45","v":0},"x",{"$f":"Control!$F$47","v":0},"x",{"$f":"Control!$F$46","v":0},"=",{"$f":"C6*$E$6*$I$6*$M$6*$K$6*$G$6","v":0},"x",{"$f":"Control!$D$107","v":9.9999999999999998E-13},"=",{"$f":"O6*Q6","v":0},"x",{"$f":"Control!$D$101","v":25},"x",{"$f":"Control!$D$100","v":0.27272727272727271},"=",{"$f":"S6*U$6*W$6","v":0},"=",{"$f":"Y6*C_CO2","v":0}]
[]
[3,{"$f":"B6+1","v":1991},null,"x",{"$f":"Control!$F$44","v":0},"x",{"$f":"Control!$D$106","v":1000},"x",{"$f":"Control!$F$45","v":0},"x",{"$f":"Control!$F$47","v":0},"x",{"$f":"Control!$F$46","v":0},"=",{"$f":"C8*$E$6*$I$6*$M$6*$K$6*$G$6","v":0},"x",{"$f":"Control!$D$107","v":9.9999999999999998E-13},"=",{"$f":"O8*Q8","v":0},"x",{"$f":"Control!$D$101","v":25},"x",{"$f":"Control!$D$100","v":0.27272727272727271},"=",{"$f":"S8*U$6*W$6","v":0},"=",{"$f":"Y8*C_CO2","v":0}]
[]
[4,{"$f":"B8+1","v":1992},null,"x",{"$f":"Control!$F$44","v":0},"x",{"$f":"Control!$D$106","v":1000},"x",{"$f":"Control!$F$45","v":0},"x",{"$f":"Control!$F$47","v":0},"x",{"$f":"Control!$F$46","v":0},"=",{"$f":"C10*$E$6*$I$6*$M$6*$K$6*$G$6","v":0},"x",{"$f":"Control!$D$107","v":9.9999999999999998E-13},"=",{"$f":"O10*Q10","v":0},"x",{"$f":"Control!$D$101","v":25},"x",{"$f":"Control!$D$100","v":0.27272727272727271},"=",{"$f":"S10*U$6*W$6","v":0},"=",{"$f":"Y10*C_CO2","v":0}]
[]
[5,{"$f":"B10+1","v":1993},null,"x",{"$f":"Control!$F$44","v":0},"x",{"$f":"Control!$D$106","v":1000},"x",{"$f":"Control!$F$45","v":0},"x",{"$f":"Control!$F$47","v":0},"x",{"$f":"Control!$F$46","v":0},"=",{"$f":"C12*$E$6*$I$6*$M$6*$K$6*$G$6","v":0},"x",{"$f":"Control!$D$107","v":9.9999999999999998E-13},"=",{"$f":"O12*Q12","v":0},"x",{"$f":"Control!$D$101","v":25},"x",{"$f":"Control!$D$100","v":0.27272727272727271},"=",{"$f":"S12*U$6*W$6","v":0},"=",{"$f":"Y12*C_CO2","v":0}]
[]
[6,{"$f":"B12+1","v":1994},null,"x",{"$f":"Control!$F$44","v":0},"x",{"$f":"Control!$D$106","v":1000},"x",{"$f":"Control!$F$45","v":0},"x",{"$f":"Control!$F$47","v":0},"x",{"$f":"Control!$F$46","v":0},"=",{"$f":"C14*$E$6*$I$6*$M$6*$K$6*$G$6","v":0},"x",{"$f":"Control!$D$107","v":9.9999999999999998E-13},"=",{"$f":"O14*Q14","v":0},"x",{"$f":"Control!$D$101","v":25},"x",{"$f":"Control!$D$100","v":0.27272727272727271},"=",{"$f":"S14*U$6*W$6","v":0},"=",{"$f":"Y14*C_CO2","v":0}]
[]
[7,{"$f":"B14+1","v":1995},null,"x",{"$f":"Control!$F$44","v":0},"x",{"$f":"Control!$D$106","v":1000},"x",{"$f":"Control!$F$45","v":0},"x",{"$f":"Control!$F$47","v":0},"x",{"$f":"Control!$F$46","v":0},"=",{"$f":"C16*$E$6*$I$6*$M$6*$K$6*$G$6","v":0},"x",{"$f":"Control!$D$107","v":9.9999999999999998E-13},"=",{"$f":"O16*Q16","v":0},"x",{"$f":"Control!$D$101","v":25},"x",{"$f":"Control!$D$100","v":0.27272727272727271},"=",{"$f":"S16*U$6*W$6","v":0},"=",{"$f":"Y16*C_CO2","v":0}]
[]
[8,{"$f":"B16+1","v":1996},null,"x",{"$f":"Control!$F$44","v":0},"x",{"$f":"Control!$D$106","v":1000},"x",{"$f":"Control!$F$45","v":0},"x",{"$f":"Control!$F$47","v":0},"x",{"$f":"Control!$F$46","v":0},"=",{"$f":"C18*$E$6*$I$6*$M$6*$K$6*$G$6","v":0},"x",{"$f":"Control!$D$107","v":9.9999999999999998E-13},"=",{"$f":"O18*Q18","v":0},"x",{"$f":"Control!$D$101","v":25},"x",{"$f":"Control!$D$100","v":0.27272727272727271},"=",{"$f":"S18*U$6*W$6","v":0},"=",{"$f":"Y18*C_CO2","v":0}]
[]
[9,{"$f":"B18+1","v":1997},null,"x",{"$f":"Control!$F$44","v":0},"x",{"$f":"Control!$D$106","v":1000},"x",{"$f":"Control!$F$45","v":0},"x",{"$f":"Control!$F$47","v":0},"x",{"$f":"Control!$F$46","v":0},"=",{"$f":"C20*$E$6*$I$6*$M$6*$K$6*$G$6","v":0},"x",{"$f":"Control!$D$107","v":9.9999999999999998E-13},"=",{"$f":"O20*Q20","v":0},"x",{"$f":"Control!$D$101","v":25},"x",{"$f":"Control!$D$100","v":0.27272727272727271},"=",{"$f":"S20*U$6*W$6","v":0},"=",{"$f":"Y20*C_CO2","v":0}]
[]
[10,{"$f":"B20+1","v":1998},null,"x",{"$f":"Control!$F$44","v":0},"x",{"$f":"Control!$D$106","v":1000},"x",{"$f":"Control!$F$45","v":0},"x",{"$f":"Control!$F$47","v":0},"x",{"$f":"Control!$F$46","v":0},"=",{"$f":"C22*$E$6*$I$6*$M$6*$K$6*$G$6","v":0},"x",{"$f":"Control!$D$107","v":9.9999999999999998E-13},"=",{"$f":"O22*Q22","v":0},"x",{"$f":"Control!$D$101","v":25},"x",{"$f":"Control!$D$100","v":0.27272727272727271},"=",{"$f":"S22*U$6*W$6","v":0},"=",{"$f":"Y22*C_CO2","v":0}]
[]
[11,{"$f":"B22+1","v":1999},null,"x",{"$f":"Control!$F$44","v":0},"x",{"$f":"Control!$D$106","v":1000},"x",{"$f":"Control!$F$45","v":0},"x",{"$f":"Control!$F$47","v":0},"x",{"$f":"Control!$F$46","v":0},"=",{"$f":"C24*$E$6*$I$6*$M$6*$K$6*$G$6","v":0},"x",{"$f":"Control!$D$107","v":9.9999999999999998E-13},"=",{"$f":"O24*Q24","v":0},"x",{"$f":"Control!$D$101","v":25},"x",{"$f":"Control!$D$100","v":0.27272727272727271},"=",{"$f":"S24*U$6*W$6","v":0},"=",{"$f":"Y24*C_CO2","v":0}]
[]
[12,{"$f":"B24+1","v":2000},null,"x",{"$f":"Control!$F$44","v":0},"x",{"$f":"Control!$D$106","v":1000},"x",{"$f":"Control!$F$45","v":0},"x",{"$f":"Control!$F$47","v":0},"x",{"$f":"Control!$F$46","v":0},"=",{"$f":"C26*$E$6*$I$6*$M$6*$K$6*$G$6","v":0},"x",{"$f":"Control!$D$107","v":9.9999999999999998E-13},"=",{"$f":"O26*Q26","v":0},"x",{"$f":"Control!$D$101","v":25},"x",{"$f":"Control!$D$100","v":0.27272727272727271},"=",{"$f":"S26*U$6*W$6","v":0},"=",{"$f":"Y26*C_CO2","v":0}]
[]
[13,{"$f":"B26+1","v":2001},null,"x",{"$f":"Control!$F$44","v":0},"x",{"$f":"Control!$D$106","v":1000},"x",{"$f":"Control!$F$45","v":0},"x",{"$f":"Control!$F$47","v":0},"x",{"$f":"Control!$F$46","v":0},"=",{"$f":"C28*$E$6*$I$6*$M$6*$K$6*$G$6","v":0},"x",{"$f":"Control!$D$107","v":9.9999999999999998E-13},"=",{"$f":"O28*Q28","v":0},"x",{"$f":"Control!$D$101","v":25},"x",{"$f":"Control!$D$100","v":0.27272727272727271},"=",{"$f":"S28*U$6*W$6","v":0},"=",{"$f":"Y28*C_CO2","v":0}]
[]
[14,{"$f":"B28+1","v":2002},null,"x",{"$f":"Control!$F$44","v":0},"x",{"$f":"Control!$D$106","v":1000},"x",{"$f":"Control!$F$45","v":0},"x",{"$f":"Control!$F$47","v":0},"x",{"$f":"Control!$F$46","v":0},"=",{"$f":"C30*$E$6*$I$6*$M$6*$K$6*$G$6","v":0},"x",{"$f":"Control!$D$107","v":9.9999999999999998E-13},"=",{"$f":"O30*Q30","v":0},"x",{"$f":"Control!$D$101","v":25},"x",{"$f":"Control!$D$100","v":0.27272727272727271},"=",{"$f":"S30*U$6*W$6","v":0},"=",{"$f":"Y30*C_CO2","v":0}]
[]
[15,{"$f":"B30+1","v":2003},null,"x",{"$f":"Control!$F$44","v":0},"x",{"$f":"Control!$D$106","v":1000},"x",{"$f":"Control!$F$45","v":0},"x",{"$f":"Control!$F$47","v":0},"x",{"$f":"Control!$F$46","v":0},"=",{"$f":"C32*$E$6*$I$6*$M$6*$K$6*$G$6","v":0},"x",{"$f":"Control!$D$107","v":9.9999999999999998E-13},"=",{"$f":"O32*Q32","v":0},"x",{"$f":"Control!$D$101","v":25},"x",{"$f":"Control!$D$100","v":0.27272727272727271},"=",{"$f":"S32*U$6*W$6","v":0},"=",{"$f":"Y32*C_CO2","v":0}]
[]
[16,{"$f":"B32+1","v":2004},null,"x",{"$f":"Control!$F$44","v":0},"x",{"$f":"Control!$D$106","v":1000},"x",{"$f":"Control!$F$45","v":0},"x",{"$f":"Control!$F$47","v":0},"x",{"$f":"Control!$F$46","v":0},"=",{"$f":"C34*$E$6*$I$6*$M$6*$K$6*$G$6","v":0},"x",{"$f":"Control!$D$107","v":9.9999999999999998E-13},"=",{"$f":"O34*Q34","v":0},"x",{"$f":"Control!$D$101","v":25},"x",{"$f":"Control!$D$100","v":0.27272727272727271},"=",{"$f":"S34*U$6*W$6","v":0},"=",{"$f":"Y34*C_CO2","v":0}]
[]
[17,{"$f":"B34+1","v":2005},null,"x",{"$f":"Control!$F$44","v":0},"x",{"$f":"Control!$D$106","v":1000},"x",{"$f":"Control!$F$45","v":0},"x",{"$f":"Control!$F$47","v":0},"x",{"$f":"Control!$F$46","v":0},"=",{"$f":"C36*$E$6*$I$6*$M$6*$K$6*$G$6","v":0},"x",{"$f":"Control!$D$107","v":9.9999999999999998E-13},"=",{"$f":"O36*Q36","v":0},"x",{"$f":"Control!$D$101","v":25},"x",{"$f":"Control!$D$100","v":0.27272727272727271},"=",{"$f":"S36*U$6*W$6","v":0},"=",{"$f":"Y36*C_CO2","v":0}]
[]
[18,{"$f":"B36+1","v":2006},null,"x",{"$f":"Control!$F$44","v":0},"x",{"$f":"Control!$D$106","v":1000},"x",{"$f":"Control!$F$45","v":0},"x",{"$f":"Control!$F$47","v":0},"x",{"$f":"Control!$F$46","v":0},"=",{"$f":"C38*$E$6*$I$6*$M$6*$K$6*$G$6","v":0},"x",{"$f":"Control!$D$107","v":9.9999999999999998E-13},"=",{"$f":"O38*Q38","v":0},"x",{"$f":"Control!$D$101","v":25},"x",{"$f":"Control!$D$100","v":0.27272727272727271},"=",{"$f":"S38*U$6*W$6","v":0},"=",{"$f":"Y38*C_CO2","v":0}]
[]
[19,{"$f":"B38+1","v":2007},null,"x",{"$f":"Control!$F$44","v":0},"x",{"$f":"Control!$D$106","v":1000},"x",{"$f":"Control!$F$45","v":0},"x",{"$f":"Control!$F$47","v":0},"x",{"$f":"Control!$F$46","v":0},"=",{"$f":"C40*$E$6*$I$6*$M$6*$K$6*$G$6","v":0},"x",{"$f":"Control!$D$107","v":9.9999999999999998E-13},"=",{"$f":"O40*Q40","v":0},"x",{"$f":"Control!$D$101","v":25},"x",{"$f":"Control!$D$100","v":0.27272727272727271},"=",{"$f":"S40*U$6*W$6","v":0},"=",{"$f":"Y40*C_CO2","v":0}]
[]
[20,{"$f":"B40+1","v":2008},null,"x",{"$f":"Control!$F$44","v":0},"x",{"$f":"Control!$D$106","v":1000},"x",{"$f":"Control!$F$45","v":0},"x",{"$f":"Control!$F$47","v":0},"x",{"$f":"Control!$F$46","v":0},"=",{"$f":"C42*$E$6*$I$6*$M$6*$K$6*$G$6","v":0},"x",{"$f":"Control!$D$107","v":9.9999999999999998E-13},"=",{"$f":"O42*Q42","v":0},"x",{"$f":"Control!$D$101","v":25},"x",{"$f":"Control!$D$100","v":0.27272727272727271},"=",{"$f":"S42*U$6*W$6","v":0},"=",{"$f":"Y42*C_CO2","v":0}]
[]
[21,{"$f":"B42+1","v":2009},null,"x",{"$f":"Control!$F$44","v":0},"x",{"$f":"Control!$D$106","v":1000},"x",{"$f":"Control!$F$45","v":0},"x",{"$f":"Control!$F$47","v":0},"x",{"$f":"Control!$F$46","v":0},"=",{"$f":"C44*$E$6*$I$6*$M$6*$K$6*$G$6","v":0},"x",{"$f":"Control!$D$107","v":9.9999999999999998E-13},"=",{"$f":"O44*Q44","v":0},"x",{"$f":"Control!$D$101","v":25},"x",{"$f":"Control!$D$100","v":0.27272727272727271},"=",{"$f":"S44*U$6*W$6","v":0},"=",{"$f":"Y44*C_CO2","v":0}]
[]
[22,{"$f":"B44+1","v":2010},null,"x",{"$f":"Control!$F$44","v":0},"x",{"$f":"Control!$D$106","v":1000},"x",{"$f":"Control!$F$45","v":0},"x",{"$f":"Control!$F$47","v":0},"x",{"$f":"Control!$F$46","v":0},"=",{"$f":"C46*$E$6*$I$6*$M$6*$K$6*$G$6","v":0},"x",{"$f":"Control!$D$107","v":9.9999999999999998E-13},"=",{"$f":"O46*Q46","v":0},"x",{"$f":"Control!$D$101","v":25},"x",{"$f":"Control!$D$100","v":0.27272727272727271},"=",{"$f":"S46*U$6*W$6","v":0},"=",{"$f":"Y46*C_CO2","v":0}]
[]
[23,{"$f":"B46+1","v":2011},null,"x",{"$f":"Control!$F$44","v":0},"x",{"$f":"Control!$D$106","v":1000},"x",{"$f":"Control!$F$45","v":0},"x",{"$f":"Control!$F$47","v":0},"x",{"$f":"Control!$F$46","v":0},"=",{"$f":"C48*$E$6*$I$6*$M$6*$K$6*$G$6","v":0},"x",{"$f":"Control!$D$107","v":9.9999999999999998E-13},"=",{"$f":"O48*Q48","v":0},"x",{"$f":"Control!$D$101","v":25},"x",{"$f":"Control!$D$100","v":0.27272727272727271},"=",{"$f":"S48*U$6*W$6","v":0},"=",{"$f":"Y48*C_CO2","v":0}]
[]
[24,{"$f":"B48+1","v":2012},null,"x",{"$f":"Control!$F$44","v":0},"x",{"$f":"Control!$D$106","v":1000},"x",{"$f":"Control!$F$45","v":0},"x",{"$f":"Control!$F$47","v":0},"x",{"$f":"Control!$F$46","v":0},"=",{"$f":"C50*$E$6*$I$6*$M$6*$K$6*$G$6","v":0},"x",{"$f":"Control!$D$107","v":9.9999999999999998E-13},"=",{"$f":"O50*Q50","v":0},"x",{"$f":"Control!$D$101","v":25},"x",{"$f":"Control!$D$100","v":0.27272727272727271},"=",{"$f":"S50*U$6*W$6","v":0},"=",{"$f":"Y50*C_CO2","v":0}]
[]
[25,{"$f":"B50+1","v":2013},null,"x",{"$f":"Control!$F$44","v":0},"x",{"$f":"Control!$D$106","v":1000},"x",{"$f":"Control!$F$45","v":0},"x",{"$f":"Control!$F$47","v":0},"x",{"$f":"Control!$F$46","v":0},"=",{"$f":"C52*$E$6*$I$6*$M$6*$K$6*$G$6","v":0},"x",{"$f":"Control!$D$107","v":9.9999999999999998E-13},"=",{"$f":"O52*Q52","v":0},"x",{"$f":"Control!$D$101","v":25},"x",{"$f":"Control!$D$100","v":0.27272727272727271},"=",{"$f":"S52*U$6*W$6","v":0},"=",{"$f":"Y52*C_CO2","v":0}]
[]
[26,{"$f":"B52+1","v":2014},null,"x",{"$f":"Control!$F$44","v":0},"x",{"$f":"Control!$D$106","v":1000},"x",{"$f":"Control!$F$45","v":0},"x",{"$f":"Control!$F$47","v":0},"x",{"$f":"Control!$F$46","v":0},"=",{"$f":"C54*$E$6*$I$6*$M$6*$K$6*$G$6","v":0},"x",{"$f":"Control!$D$107","v":9.9999999999999998E-13},"=",{"$f":"O54*Q54","v":0},"x",{"$f":"Control!$D$101","v":25},"x",{"$f":"Control!$D$100","v":0.27272727272727271},"=",{"$f":"S54*U$6*W$6","v":0},"=",{"$f":"Y54*C_CO2","v":0}]
[]
[27,{"$f":"B54+1","v":2015},null,"x",{"$f":"Control!$F$44","v":0},"x",{"$f":"Control!$D$106","v":1000},"x",{"$f":"Control!$F$45","v":0},"x",{"$f":"Control!$F$47","v":0},"x",{"$f":"Control!$F$46","v":0},"=",{"$f":"C56*$E$6*$I$6*$M$6*$K$6*$G$6","v":0},"x",{"$f":"Control!$D$107","v":9.9999999999999998E-13},"=",{"$f":"O56*Q56","v":0},"x",{"$f":"Control!$D$101","v":25},"x",{"$f":"Control!$D$100","v":0.27272727272727271},"=",{"$f":"S56*U$6*W$6","v":0},"=",{"$f":"Y56*C_CO2","v":0}]
[]
[28,{"$f":"B56+1","v":2016},null,"x",{"$f":"Control!$F$44","v":0},"x",{"$f":"Control!$D$106","v":1000},"x",{"$f":"Control!$F$45","v":0},"x",{"$f":"Control!$F$47","v":0},"x",{"$f":"Control!$F$46","v":0},"=",{"$f":"C58*$E$6*$I$6*$M$6*$K$6*$G$6","v":0},"x",{"$f":"Control!$D$107","v":9.9999999999999998E-13},"=",{"$f":"O58*Q58","v":0},"x",{"$f":"Control!$D$101","v":25},"x",{"$f":"Control!$D$100","v":0.27272727272727271},"=",{"$f":"S58*U$6*W$6","v":0},"=",{"$f":"Y58*C_CO2","v":0}]
[]
[29,{"$f":"B58+1","v":2017},null,"x",{"$f":"Control!$F$44","v":0},"x",{"$f":"Control!$D$106","v":1000},"x",{"$f":"Control!$F$45","v":0},"x",{"$f":"Control!$F$47","v":0},"x",{"$f":"Control!$F$46","v":0},"=",{"$f":"C60*$E$6*$I$6*$M$6*$K$6*$G$6","v":0},"x",{"$f":"Control!$D$107","v":9.9999999999999998E-13},"=",{"$f":"O60*Q60","v":0},"x",{"$f":"Control!$D$101","v":25},"x",{"$f":"Control!$D$100","v":0.27272727272727271},"=",{"$f":"S60*U$6*W$6","v":0},"=",{"$f":"Y60*C_CO2","v":0}]
[]
[30,{"$f":"B60+1","v":2018},null,"x",{"$f":"Control!$F$44","v":0},"x",{"$f":"Control!$D$106","v":1000},"x",{"$f":"Control!$F$45","v":0},"x",{"$f":"Control!$F$47","v":0},"x",{"$f":"Control!$F$46","v":0},"=",{"$f":"C62*$E$6*$I$6*$M$6*$K$6*$G$6","v":0},"x",{"$f":"Control!$D$107","v":9.9999999999999998E-13},"=",{"$f":"O62*Q62","v":0},"x",{"$f":"Control!$D$101","v":25},"x",{"$f":"Control!$D$100","v":0.27272727272727271},"=",{"$f":"S62*U$6*W$6","v":0},"=",{"$f":"Y62*C_CO2","v":0}]
[]
[31,{"$f":"B62+1","v":2019},null,"x",{"$f":"Control!$F$44","v":0},"x",{"$f":"Control!$D$106","v":1000},"x",{"$f":"Control!$F$45","v":0},"x",{"$f":"Control!$F$47","v":0},"x",{"$f":"Control!$F$46","v":0},"=",{"$f":"C64*$E$6*$I$6*$M$6*$K$6*$G$6","v":0},"x",{"$f":"Control!$D$107","v":9.9999999999999998E-13},"=",{"$f":"O64*Q64","v":0},"x",{"$f":"Control!$D$101","v":25},"x",{"$f":"Control!$D$100","v":0.27272727272727271},"=",{"$f":"S64*U$6*W$6","v":0},"=",{"$f":"Y64*C_CO2","v":0}]
[]
[32,{"$f":"B64+1","v":2020},null,"x",{"$f":"Control!$F$44","v":0},"x",{"$f":"Control!$D$106","v":1000},"x",{"$f":"Control!$F$45","v":0},"x",{"$f":"Control!$F$47","v":0},"x",{"$f":"Control!$F$46","v":0},"=",{"$f":"C66*$E$6*$I$6*$M$6*$K$6*$G$6","v":0},"x",{"$f":"Control!$D$107","v":9.9999999999999998E-13},"=",{"$f":"O66*Q66","v":0},"x",{"$f":"Control!$D$101","v":25},"x",{"$f":"Control!$D$100","v":0.27272727272727271},"=",{"$f":"S66*U$6*W$6","v":0},"=",{"$f":"Y66*C_CO2","v":0}]

{"sheet":"Ind WW Poultry","index":6,"n_rows":66,"n_cols":27,"rows_kept":66,"cut":false,"hidden":false,"merged":[[1,0,1,7]]}
[null,{"$f":"\"9. \"&SelectedState & \" Industrial Wastewater Methane - Poultry\"","v":"9. Select a state . . . Industrial Wastewater Methane - Poultry"}]
[]
[null,null,"Production Processed",null,"WW Outflow ",null,"Unit Conversion",null,"COD ",null,"Emission Factor",null,"COD Degraded",null,"Emissions ",null,"Unit Conversion",null,"Emissions ",null,"CH4 GWP",null,"C/CO2",null,"Emissions ",null,"Emissions "]
[null,null,"(metric tons)",null,"(m3/metric ton)",null,"(l/m3)",null,"(g COD/l)",null,"(g CH4/g COD)",null,"(percent)",null,"(g CH4)",null,"(g/Tg)",null,"(Tg or MMT CH4)",null,"(CO2 Eq.)",null,null,null,"(MMTCE)",null,"(MMTCO2E)"]
[]
[{"$f":"C6*1000","v":0},1990,null,"x",{"$f":"Control!$F$50","v":0},"x",{"$f":"Control!$D$106","v":1000},"x",{"$f":"Control!$F$51","v":0},"x",{"$f":"Control!$F$53","v":0},"x",{"$f":"Control!$F$52","v":0},"=",{"$f":"C6*$E$6*$I$6*$M$6*$K$6*$G$6","v":0},"x",{"$f":"Control!$D$107","v":9.9999999999999998E-13},"=",{"$f":"O6*Q6","v":0},"x",{"$f":"Control!$D$101","v":25},"x",{"$f":"Control!$D$100","v":0.27272727272727271},"=",{"$f":"S6*U$6*W$6","v":0},"=",{"$f":"Y6*C_CO2","v":0}]
[]
[{"$f":"C8*1000","v":0},{"$f":"B6+1","v":1991},null,"x",{"$f":"Control!$F$50","v":0},"x",{"$f":"Control!$D$106","v":1000},"x",{"$f":"Control!$F$51","v":0},"x",{"$f":"Control!$F$53","v":0},"x",{"$f":"Control!$F$52","v":0},"=",{"$f":"C8*$E$6*$I$6*$M$6*$K$6*$G$6","v":0},"x",{"$f":"Control!$D$107","v":9.9999999999999998E-13},"=",{"$f":"O8*Q8","v":0},"x",{"$f":"Control!$D$101","v":25},"x",{"$f":"Control!$D$100","v":0.27272727272727271},"=",{"$f":"S8*U$6*W$6","v":0},"=",{"$f":"Y8*C_CO2","v":0}]
[]
[{"$f":"C10*1000","v":0},{"$f":"B8+1","v":1992},null,"x",{"$f":"Control!$F$50","v":0},"x",{"$f":"Control!$D$106","v":1000},"x",{"$f":"Control!$F$51","v":0},"x",{"$f":"Control!$F$53","v":0},"x",{"$f":"Control!$F$52","v":0},"=",{"$f":"C10*$E$6*$I$6*$M$6*$K$6*$G$6","v":0},"x",{"$f":"Control!$D$107","v":9.9999999999999998E-13},"=",{"$f":"O10*Q10","v":0},"x",{"$f":"Control!$D$101","v":25},"x",{"$f":"Control!$D$100","v":0.27272727272727271},"=",{"$f":"S10*U$6*W$6","v":0},"=",{"$f":"Y10*C_CO2","v":0}]
[]
[{"$f":"C12*1000","v":0},{"$f":"B10+1","v":1993},null,"x",{"$f":"Control!$F$50","v":0},"x",{"$f":"Control!$D$106","v":1000},"x",{"$f":"Control!$F$51","v":0},"x",{"$f":"Control!$F$53","v":0},"x",{"$f":"Control!$F$52","v":0},"=",{"$f":"C12*$E$6*$I$6*$M$6*$K$6*$G$6","v":0},"x",{"$f":"Control!$D$107","v":9.9999999999999998E-13},"=",{"$f":"O12*Q12","v":0},"x",{"$f":"Control!$D$101","v":25},"x",{"$f":"Control!$D$100","v":0.27272727272727271},"=",{"$f":"S12*U$6*W$6","v":0},"=",{"$f":"Y12*C_CO2","v":0}]
[]
[{"$f":"C14*1000","v":0},{"$f":"B12+1","v":1994},null,"x",{"$f":"Control!$F$50","v":0},"x",{"$f":"Control!$D$106","v":1000},"x",{"$f":"Control!$F$51","v":0},"x",{"$f":"Control!$F$53","v":0},"x",{"$f":"Control!$F$52","v":0},"=",{"$f":"C14*$E$6*$I$6*$M$6*$K$6*$G$6","v":0},"x",{"$f":"Control!$D$107","v":9.9999999999999998E-13},"=",{"$f":"O14*Q14","v":0},"x",{"$f":"Control!$D$101","v":25},"x",{"$f":"Control!$D$100","v":0.27272727272727271},"=",{"$f":"S14*U$6*W$6","v":0},"=",{"$f":"Y14*C_CO2","v":0}]
[]
[{"$f":"C16*1000","v":0},{"$f":"B14+1","v":1995},null,"x",{"$f":"Control!$F$50","v":0},"x",{"$f":"Control!$D$106","v":1000},"x",{"$f":"Control!$F$51","v":0},"x",{"$f":"Control!$F$53","v":0},"x",{"$f":"Control!$F$52","v":0},"=",{"$f":"C16*$E$6*$I$6*$M$6*$K$6*$G$6","v":0},"x",{"$f":"Control!$D$107","v":9.9999999999999998E-13},"=",{"$f":"O16*Q16","v":0},"x",{"$f":"Control!$D$101","v":25},"x",{"$f":"Control!$D$100","v":0.27272727272727271},"=",{"$f":"S16*U$6*W$6","v":0},"=",{"$f":"Y16*C_CO2","v":0}]
[]
[{"$f":"C18*1000","v":0},{"$f":"B16+1","v":1996},null,"x",{"$f":"Control!$F$50","v":0},"x",{"$f":"Control!$D$106","v":1000},"x",{"$f":"Control!$F$51","v":0},"x",{"$f":"Control!$F$53","v":0},"x",{"$f":"Control!$F$52","v":0},"=",{"$f":"C18*$E$6*$I$6*$M$6*$K$6*$G$6","v":0},"x",{"$f":"Control!$D$107","v":9.9999999999999998E-13},"=",{"$f":"O18*Q18","v":0},"x",{"$f":"Control!$D$101","v":25},"x",{"$f":"Control!$D$100","v":0.27272727272727271},"=",{"$f":"S18*U$6*W$6","v":0},"=",{"$f":"Y18*C_CO2","v":0}]
[]
[{"$f":"C20*1000","v":0},{"$f":"B18+1","v":1997},null,"x",{"$f":"Control!$F$50","v":0},"x",{"$f":"Control!$D$106","v":1000},"x",{"$f":"Control!$F$51","v":0},"x",{"$f":"Control!$F$53","v":0},"x",{"$f":"Control!$F$52","v":0},"=",{"$f":"C20*$E$6*$I$6*$M$6*$K$6*$G$6","v":0},"x",{"$f":"Control!$D$107","v":9.9999999999999998E-13},"=",{"$f":"O20*Q20","v":0},"x",{"$f":"Control!$D$101","v":25},"x",{"$f":"Control!$D$100","v":0.27272727272727271},"=",{"$f":"S20*U$6*W$6","v":0},"=",{"$f":"Y20*C_CO2","v":0}]
[]
[{"$f":"C22*1000","v":0},{"$f":"B20+1","v":1998},null,"x",{"$f":"Control!$F$50","v":0},"x",{"$f":"Control!$D$106","v":1000},"x",{"$f":"Control!$F$51","v":0},"x",{"$f":"Control!$F$53","v":0},"x",{"$f":"Control!$F$52","v":0},"=",{"$f":"C22*$E$6*$I$6*$M$6*$K$6*$G$6","v":0},"x",{"$f":"Control!$D$107","v":9.9999999999999998E-13},"=",{"$f":"O22*Q22","v":0},"x",{"$f":"Control!$D$101","v":25},"x",{"$f":"Control!$D$100","v":0.27272727272727271},"=",{"$f":"S22*U$6*W$6","v":0},"=",{"$f":"Y22*C_CO2","v":0}]
[]
[{"$f":"C24*1000","v":0},{"$f":"B22+1","v":1999},null,"x",{"$f":"Control!$F$50","v":0},"x",{"$f":"Control!$D$106","v":1000},"x",{"$f":"Control!$F$51","v":0},"x",{"$f":"Control!$F$53","v":0},"x",{"$f":"Control!$F$52","v":0},"=",{"$f":"C24*$E$6*$I$6*$M$6*$K$6*$G$6","v":0},"x",{"$f":"Control!$D$107","v":9.9999999999999998E-13},"=",{"$f":"O24*Q24","v":0},"x",{"$f":"Control!$D$101","v":25},"x",{"$f":"Control!$D$100","v":0.27272727272727271},"=",{"$f":"S24*U$6*W$6","v":0},"=",{"$f":"Y24*C_CO2","v":0}]
[]
[{"$f":"C26*1000","v":0},{"$f":"B24+1","v":2000},null,"x",{"$f":"Control!$F$50","v":0},"x",{"$f":"Control!$D$106","v":1000},"x",{"$f":"Control!$F$51","v":0},"x",{"$f":"Control!$F$53","v":0},"x",{"$f":"Control!$F$52","v":0},"=",{"$f":"C26*$E$6*$I$6*$M$6*$K$6*$G$6","v":0},"x",{"$f":"Control!$D$107","v":9.9999999999999998E-13},"=",{"$f":"O26*Q26","v":0},"x",{"$f":"Control!$D$101","v":25},"x",{"$f":"Control!$D$100","v":0.27272727272727271},"=",{"$f":"S26*U$6*W$6","v":0},"=",{"$f":"Y26*C_CO2","v":0}]
[]
[{"$f":"C28*1000","v":0},{"$f":"B26+1","v":2001},null,"x",{"$f":"Control!$F$50","v":0},"x",{"$f":"Control!$D$106","v":1000},"x",{"$f":"Control!$F$51","v":0},"x",{"$f":"Control!$F$53","v":0},"x",{"$f":"Control!$F$52","v":0},"=",{"$f":"C28*$E$6*$I$6*$M$6*$K$6*$G$6","v":0},"x",{"$f":"Control!$D$107","v":9.9999999999999998E-13},"=",{"$f":"O28*Q28","v":0},"x",{"$f":"Control!$D$101","v":25},"x",{"$f":"Control!$D$100","v":0.27272727272727271},"=",{"$f":"S28*U$6*W$6","v":0},"=",{"$f":"Y28*C_CO2","v":0}]
[]
[{"$f":"C30*1000","v":0},{"$f":"B28+1","v":2002},null,"x",{"$f":"Control!$F$50","v":0},"x",{"$f":"Control!$D$106","v":1000},"x",{"$f":"Control!$F$51","v":0},"x",{"$f":"Control!$F$53","v":0},"x",{"$f":"Control!$F$52","v":0},"=",{"$f":"C30*$E$6*$I$6*$M$6*$K$6*$G$6","v":0},"x",{"$f":"Control!$D$107","v":9.9999999999999998E-13},"=",{"$f":"O30*Q30","v":0},"x",{"$f":"Control!$D$101","v":25},"x",{"$f":"Control!$D$100","v":0.27272727272727271},"=",{"$f":"S30*U$6*W$6","v":0},"=",{"$f":"Y30*C_CO2","v":0}]
[]
[{"$f":"C32*1000","v":0},{"$f":"B30+1","v":2003},null,"x",{"$f":"Control!$F$50","v":0},"x",{"$f":"Control!$D$106","v":1000},"x",{"$f":"Control!$F$51","v":0},"x",{"$f":"Control!$F$53","v":0},"x",{"$f":"Control!$F$52","v":0},"=",{"$f":"C32*$E$6*$I$6*$M$6*$K$6*$G$6","v":0},"x",{"$f":"Control!$D$107","v":9.9999999999999998E-13},"=",{"$f":"O32*Q32","v":0},"x",{"$f":"Control!$D$101","v":25},"x",{"$f":"Control!$D$100","v":0.27272727272727271},"=",{"$f":"S32*U$6*W$6","v":0},"=",{"$f":"Y32*C_CO2","v":0}]
[]
[{"$f":"C34*1000","v":0},{"$f":"B32+1","v":2004},null,"x",{"$f":"Control!$F$50","v":0},"x",{"$f":"Control!$D$106","v":1000},"x",{"$f":"Control!$F$51","v":0},"x",{"$f":"Control!$F$53","v":0},"x",{"$f":"Control!$F$52","v":0},"=",{"$f":"C34*$E$6*$I$6*$M$6*$K$6*$G$6","v":0},"x",{"$f":"Control!$D$107","v":9.9999999999999998E-13},"=",{"$f":"O34*Q34","v":0},"x",{"$f":"Control!$D$101","v":25},"x",{"$f":"Control!$D$100","v":0.27272727272727271},"=",{"$f":"S34*U$6*W$6","v":0},"=",{"$f":"Y34*C_CO2","v":0}]
[]
[{"$f":"C36*1000","v":0},{"$f":"B34+1","v":2005},null,"x",{"$f":"Control!$F$50","v":0},"x",{"$f":"Control!$D$106","v":1000},"x",{"$f":"Control!$F$51","v":0},"x",{"$f":"Control!$F$53","v":0},"x",{"$f":"Control!$F$52","v":0},"=",{"$f":"C36*$E$6*$I$6*$M$6*$K$6*$G$6","v":0},"x",{"$f":"Control!$D$107","v":9.9999999999999998E-13},"=",{"$f":"O36*Q36","v":0},"x",{"$f":"Control!$D$101","v":25},"x",{"$f":"Control!$D$100","v":0.27272727272727271},"=",{"$f":"S36*U$6*W$6","v":0},"=",{"$f":"Y36*C_CO2","v":0}]
[]
[{"$f":"C38*1000","v":0},{"$f":"B36+1","v":2006},null,"x",{"$f":"Control!$F$50","v":0},"x",{"$f":"Control!$D$106","v":1000},"x",{"$f":"Control!$F$51","v":0},"x",{"$f":"Control!$F$53","v":0},"x",{"$f":"Control!$F$52","v":0},"=",{"$f":"C38*$E$6*$I$6*$M$6*$K$6*$G$6","v":0},"x",{"$f":"Control!$D$107","v":9.9999999999999998E-13},"=",{"$f":"O38*Q38","v":0},"x",{"$f":"Control!$D$101","v":25},"x",{"$f":"Control!$D$100","v":0.27272727272727271},"=",{"$f":"S38*U$6*W$6","v":0},"=",{"$f":"Y38*C_CO2","v":0}]
[]
[{"$f":"C40*1000","v":0},{"$f":"B38+1","v":2007},null,"x",{"$f":"Control!$F$50","v":0},"x",{"$f":"Control!$D$106","v":1000},"x",{"$f":"Control!$F$51","v":0},"x",{"$f":"Control!$F$53","v":0},"x",{"$f":"Control!$F$52","v":0},"=",{"$f":"C40*$E$6*$I$6*$M$6*$K$6*$G$6","v":0},"x",{"$f":"Control!$D$107","v":9.9999999999999998E-13},"=",{"$f":"O40*Q40","v":0},"x",{"$f":"Control!$D$101","v":25},"x",{"$f":"Control!$D$100","v":0.27272727272727271},"=",{"$f":"S40*U$6*W$6","v":0},"=",{"$f":"Y40*C_CO2","v":0}]
[]
[{"$f":"C42*1000","v":0},{"$f":"B40+1","v":2008},null,"x",{"$f":"Control!$F$50","v":0},"x",{"$f":"Control!$D$106","v":1000},"x",{"$f":"Control!$F$51","v":0},"x",{"$f":"Control!$F$53","v":0},"x",{"$f":"Control!$F$52","v":0},"=",{"$f":"C42*$E$6*$I$6*$M$6*$K$6*$G$6","v":0},"x",{"$f":"Control!$D$107","v":9.9999999999999998E-13},"=",{"$f":"O42*Q42","v":0},"x",{"$f":"Control!$D$101","v":25},"x",{"$f":"Control!$D$100","v":0.27272727272727271},"=",{"$f":"S42*U$6*W$6","v":0},"=",{"$f":"Y42*C_CO2","v":0}]
[]
[{"$f":"C44*1000","v":0},{"$f":"B42+1","v":2009},null,"x",{"$f":"Control!$F$50","v":0},"x",{"$f":"Control!$D$106","v":1000},"x",{"$f":"Control!$F$51","v":0},"x",{"$f":"Control!$F$53","v":0},"x",{"$f":"Control!$F$52","v":0},"=",{"$f":"C44*$E$6*$I$6*$M$6*$K$6*$G$6","v":0},"x",{"$f":"Control!$D$107","v":9.9999999999999998E-13},"=",{"$f":"O44*Q44","v":0},"x",{"$f":"Control!$D$101","v":25},"x",{"$f":"Control!$D$100","v":0.27272727272727271},"=",{"$f":"S44*U$6*W$6","v":0},"=",{"$f":"Y44*C_CO2","v":0}]
[]
[{"$f":"C46*1000","v":0},{"$f":"B44+1","v":2010},null,"x",{"$f":"Control!$F$50","v":0},"x",{"$f":"Control!$D$106","v":1000},"x",{"$f":"Control!$F$51","v":0},"x",{"$f":"Control!$F$53","v":0},"x",{"$f":"Control!$F$52","v":0},"=",{"$f":"C46*$E$6*$I$6*$M$6*$K$6*$G$6","v":0},"x",{"$f":"Control!$D$107","v":9.9999999999999998E-13},"=",{"$f":"O46*Q46","v":0},"x",{"$f":"Control!$D$101","v":25},"x",{"$f":"Control!$D$100","v":0.27272727272727271},"=",{"$f":"S46*U$6*W$6","v":0},"=",{"$f":"Y46*C_CO2","v":0}]
[]
[{"$f":"C48*1000","v":0},{"$f":"B46+1","v":2011},null,"x",{"$f":"Control!$F$50","v":0},"x",{"$f":"Control!$D$106","v":1000},"x",{"$f":"Control!$F$51","v":0},"x",{"$f":"Control!$F$53","v":0},"x",{"$f":"Control!$F$52","v":0},"=",{"$f":"C48*$E$6*$I$6*$M$6*$K$6*$G$6","v":0},"x",{"$f":"Control!$D$107","v":9.9999999999999998E-13},"=",{"$f":"O48*Q48","v":0},"x",{"$f":"Control!$D$101","v":25},"x",{"$f":"Control!$D$100","v":0.27272727272727271},"=",{"$f":"S48*U$6*W$6","v":0},"=",{"$f":"Y48*C_CO2","v":0}]
[]
[{"$f":"C50*1000","v":0},{"$f":"B48+1","v":2012},null,"x",{"$f":"Control!$F$50","v":0},"x",{"$f":"Control!$D$106","v":1000},"x",{"$f":"Control!$F$51","v":0},"x",{"$f":"Control!$F$53","v":0},"x",{"$f":"Control!$F$52","v":0},"=",{"$f":"C50*$E$6*$I$6*$M$6*$K$6*$G$6","v":0},"x",{"$f":"Control!$D$107","v":9.9999999999999998E-13},"=",{"$f":"O50*Q50","v":0},"x",{"$f":"Control!$D$101","v":25},"x",{"$f":"Control!$D$100","v":0.27272727272727271},"=",{"$f":"S50*U$6*W$6","v":0},"=",{"$f":"Y50*C_CO2","v":0}]
[]
[{"$f":"C52*1000","v":0},{"$f":"B50+1","v":2013},null,"x",{"$f":"Control!$F$50","v":0},"x",{"$f":"Control!$D$106","v":1000},"x",{"$f":"Control!$F$51","v":0},"x",{"$f":"Control!$F$53","v":0},"x",{"$f":"Control!$F$52","v":0},"=",{"$f":"C52*$E$6*$I$6*$M$6*$K$6*$G$6","v":0},"x",{"$f":"Control!$D$107","v":9.9999999999999998E-13},"=",{"$f":"O52*Q52","v":0},"x",{"$f":"Control!$D$101","v":25},"x",{"$f":"Control!$D$100","v":0.27272727272727271},"=",{"$f":"S52*U$6*W$6","v":0},"=",{"$f":"Y52*C_CO2","v":0}]
[]
[{"$f":"C54*1000","v":0},{"$f":"B52+1","v":2014},null,"x",{"$f":"Control!$F$50","v":0},"x",{"$f":"Control!$D$106","v":1000},"x",{"$f":"Control!$F$51","v":0},"x",{"$f":"Control!$F$53","v":0},"x",{"$f":"Control!$F$52","v":0},"=",{"$f":"C54*$E$6*$I$6*$M$6*$K$6*$G$6","v":0},"x",{"$f":"Control!$D$107","v":9.9999999999999998E-13},"=",{"$f":"O54*Q54","v":0},"x",{"$f":"Control!$D$101","v":25},"x",{"$f":"Control!$D$100","v":0.27272727272727271},"=",{"$f":"S54*U$6*W$6","v":0},"=",{"$f":"Y54*C_CO2","v":0}]
[]
[{"$f":"C56*1000","v":0},{"$f":"B54+1","v":2015},null,"x",{"$f":"Control!$F$50","v":0},"x",{"$f":"Control!$D$106","v":1000},"x",{"$f":"Control!$F$51","v":0},"x",{"$f":"Control!$F$53","v":0},"x",{"$f":"Control!$F$52","v":0},"=",{"$f":"C56*$E$6*$I$6*$M$6*$K$6*$G$6","v":0},"x",{"$f":"Control!$D$107","v":9.9999999999999998E-13},"=",{"$f":"O56*Q56","v":0},"x",{"$f":"Control!$D$101","v":25},"x",{"$f":"Control!$D$100","v":0.27272727272727271},"=",{"$f":"S56*U$6*W$6","v":0},"=",{"$f":"Y56*C_CO2","v":0}]
[]
[{"$f":"C58*1000","v":0},{"$f":"B56+1","v":2016},null,"x",{"$f":"Control!$F$50","v":0},"x",{"$f":"Control!$D$106","v":1000},"x",{"$f":"Control!$F$51","v":0},"x",{"$f":"Control!$F$53","v":0},"x",{"$f":"Control!$F$52","v":0},"=",{"$f":"C58*$E$6*$I$6*$M$6*$K$6*$G$6","v":0},"x",{"$f":"Control!$D$107","v":9.9999999999999998E-13},"=",{"$f":"O58*Q58","v":0},"x",{"$f":"Control!$D$101","v":25},"x",{"$f":"Control!$D$100","v":0.27272727272727271},"=",{"$f":"S58*U$6*W$6","v":0},"=",{"$f":"Y58*C_CO2","v":0}]
[]
[{"$f":"C60*1000","v":0},{"$f":"B58+1","v":2017},null,"x",{"$f":"Control!$F$50","v":0},"x",{"$f":"Control!$D$106","v":1000},"x",{"$f":"Control!$F$51","v":0},"x",{"$f":"Control!$F$53","v":0},"x",{"$f":"Control!$F$52","v":0},"=",{"$f":"C60*$E$6*$I$6*$M$6*$K$6*$G$6","v":0},"x",{"$f":"Control!$D$107","v":9.9999999999999998E-13},"=",{"$f":"O60*Q60","v":0},"x",{"$f":"Control!$D$101","v":25},"x",{"$f":"Control!$D$100","v":0.27272727272727271},"=",{"$f":"S60*U$6*W$6","v":0},"=",{"$f":"Y60*C_CO2","v":0}]
[]
[{"$f":"C62*1000","v":0},{"$f":"B60+1","v":2018},null,"x",{"$f":"Control!$F$50","v":0},"x",{"$f":"Control!$D$106","v":1000},"x",{"$f":"Control!$F$51","v":0},"x",{"$f":"Control!$F$53","v":0},"x",{"$f":"Control!$F$52","v":0},"=",{"$f":"C62*$E$6*$I$6*$M$6*$K$6*$G$6","v":0},"x",{"$f":"Control!$D$107","v":9.9999999999999998E-13},"=",{"$f":"O62*Q62","v":0},"x",{"$f":"Control!$D$101","v":25},"x",{"$f":"Control!$D$100","v":0.27272727272727271},"=",{"$f":"S62*U$6*W$6","v":0},"=",{"$f":"Y62*C_CO2","v":0}]
[]
[{"$f":"C64*1000","v":0},{"$f":"B62+1","v":2019},null,"x",{"$f":"Control!$F$50","v":0},"x",{"$f":"Control!$D$106","v":1000},"x",{"$f":"Control!$F$51","v":0},"x",{"$f":"Control!$F$53","v":0},"x",{"$f":"Control!$F$52","v":0},"=",{"$f":"C64*$E$6*$I$6*$M$6*$K$6*$G$6","v":0},"x",{"$f":"Control!$D$107","v":9.9999999999999998E-13},"=",{"$f":"O64*Q64","v":0},"x",{"$f":"Control!$D$101","v":25},"x",{"$f":"Control!$D$100","v":0.27272727272727271},"=",{"$f":"S64*U$6*W$6","v":0},"=",{"$f":"Y64*C_CO2","v":0}]
[]
[{"$f":"C66*1000","v":0},{"$f":"B64+1","v":2020},null,"x",{"$f":"Control!$F$50","v":0},"x",{"$f":"Control!$D$106","v":1000},"x",{"$f":"Control!$F$51","v":0},"x",{"$f":"Control!$F$53","v":0},"x",{"$f":"Control!$F$52","v":0},"=",{"$f":"C66*$E$6*$I$6*$M$6*$K$6*$G$6","v":0},"x",{"$f":"Control!$D$107","v":9.9999999999999998E-13},"=",{"$f":"O66*Q66","v":0},"x",{"$f":"Control!$D$101","v":25},"x",{"$f":"Control!$D$100","v":0.27272727272727271},"=",{"$f":"S66*U$6*W$6","v":0},"=",{"$f":"Y66*C_CO2","v":0}]

{"sheet":"Ind WW P&P","index":7,"n_rows":66,"n_cols":30,"rows_kept":66,"cut":false,"hidden":false,"merged":[[2,3,2,5],[1,0,1,7]]}
[null,{"$f":"\"10. \"&SelectedState & \" Industrial Wastewater Methane - Pulp & Paper\"","v":"10. Select a state . . . Industrial Wastewater Methane - Pulp & Paper"}]
[]
[null,null,null,"Production Processed \n(metric tons)",null,null,null,"WW Outflow ",null,"Unit Conversion",null,"BOD Degraded",null,"Emission Factor",null,"TA",null,"Emissions ",null,"Unit Conversion",null,"Emissions ",null,"CH4 GWP",null,"C/CO2",null,"Emissions ",null,"Emissions "]
[null,null,null,"Woodpulp",null,"Paper & Paperboard",null,"(m3/metric ton)",null,"(l/m3)",null,"(g BOD / l)",null,"(g CH4/g BOD)",null,"(percent)",null,"(g CH4)",null,"(g/Tg)",null,"(Tg or MMT CH4)",null,"(CO2 Eq.)",null,null,null,"(MMTCE)",null,"(MMTCO2E)"]
[]
[null,1990,"(",null,"+",null," )   x ",{"$f":"Control!$F$57","v":0},"x",{"$f":"Control!$D$106","v":1000},"x",{"$f":"Control!$F$58","v":0},"x",{"$f":"Control!$F$60","v":0},"x",{"$f":"Control!$F$59","v":0},"=",{"$f":"(D6+F6)*$H$6*$J$6*$L$6*$P$6*$N$6","v":0},"x",{"$f":"Control!$D$107","v":9.9999999999999998E-13},"=",{"$f":"R6*T6","v":0},"x",{"$f":"Control!$D$101","v":25},"x",{"$f":"Control!$D$100","v":0.27272727272727271},"=",{"$f":"V6*X$6*Z$6","v":0},"=",{"$f":"AB6*C_CO2","v":0}]
[]
[null,{"$f":"B6+1","v":1991},"(",null,"+",null," )   x ",{"$f":"Control!$F$57","v":0},"x",{"$f":"Control!$D$106","v":1000},"x",{"$f":"Control!$F$58","v":0},"x",{"$f":"Control!$F$60","v":0},"x",{"$f":"Control!$F$59","v":0},"=",{"$f":"(D8+F8)*$H$6*$J$6*$L$6*$P$6*$N$6","v":0},"x",{"$f":"Control!$D$107","v":9.9999999999999998E-13},"=",{"$f":"R8*T8","v":0},"x",{"$f":"Control!$D$101","v":25},"x",{"$f":"Control!$D$100","v":0.27272727272727271},"=",{"$f":"V8*X$6*Z$6","v":0},"=",{"$f":"AB8*C_CO2","v":0}]
[]
[null,{"$f":"B8+1","v":1992},"(",null,"+",null," )   x ",{"$f":"Control!$F$57","v":0},"x",{"$f":"Control!$D$106","v":1000},"x",{"$f":"Control!$F$58","v":0},"x",{"$f":"Control!$F$60","v":0},"x",{"$f":"Control!$F$59","v":0},"=",{"$f":"(D10+F10)*$H$6*$J$6*$L$6*$P$6*$N$6","v":0},"x",{"$f":"Control!$D$107","v":9.9999999999999998E-13},"=",{"$f":"R10*T10","v":0},"x",{"$f":"Control!$D$101","v":25},"x",{"$f":"Control!$D$100","v":0.27272727272727271},"=",{"$f":"V10*X$6*Z$6","v":0},"=",{"$f":"AB10*C_CO2","v":0}]
[]
[null,{"$f":"B10+1","v":1993},"(",null,"+",null," )   x ",{"$f":"Control!$F$57","v":0},"x",{"$f":"Control!$D$106","v":1000},"x",{"$f":"Control!$F$58","v":0},"x",{"$f":"Control!$F$60","v":0},"x",{"$f":"Control!$F$59","v":0},"=",{"$f":"(D12+F12)*$H$6*$J$6*$L$6*$P$6*$N$6","v":0},"x",{"$f":"Control!$D$107","v":9.9999999999999998E-13},"=",{"$f":"R12*T12","v":0},"x",{"$f":"Control!$D$101","v":25},"x",{"$f":"Control!$D$100","v":0.27272727272727271},"=",{"$f":"V12*X$6*Z$6","v":0},"=",{"$f":"AB12*C_CO2","v":0}]
[]
[null,{"$f":"B12+1","v":1994},"(",null,"+",null," )   x ",{"$f":"Control!$F$57","v":0},"x",{"$f":"Control!$D$106","v":1000},"x",{"$f":"Control!$F$58","v":0},"x",{"$f":"Control!$F$60","v":0},"x",{"$f":"Control!$F$59","v":0},"=",{"$f":"(D14+F14)*$H$6*$J$6*$L$6*$P$6*$N$6","v":0},"x",{"$f":"Control!$D$107","v":9.9999999999999998E-13},"=",{"$f":"R14*T14","v":0},"x",{"$f":"Control!$D$101","v":25},"x",{"$f":"Control!$D$100","v":0.27272727272727271},"=",{"$f":"V14*X$6*Z$6","v":0},"=",{"$f":"AB14*C_CO2","v":0}]
[]
[null,{"$f":"B14+1","v":1995},"(",null,"+",null," )   x ",{"$f":"Control!$F$57","v":0},"x",{"$f":"Control!$D$106","v":1000},"x",{"$f":"Control!$F$58","v":0},"x",{"$f":"Control!$F$60","v":0},"x",{"$f":"Control!$F$59","v":0},"=",{"$f":"(D16+F16)*$H$6*$J$6*$L$6*$P$6*$N$6","v":0},"x",{"$f":"Control!$D$107","v":9.9999999999999998E-13},"=",{"$f":"R16*T16","v":0},"x",{"$f":"Control!$D$101","v":25},"x",{"$f":"Control!$D$100","v":0.27272727272727271},"=",{"$f":"V16*X$6*Z$6","v":0},"=",{"$f":"AB16*C_CO2","v":0}]
[]
[null,{"$f":"B16+1","v":1996},"(",null,"+",null," )   x ",{"$f":"Control!$F$57","v":0},"x",{"$f":"Control!$D$106","v":1000},"x",{"$f":"Control!$F$58","v":0},"x",{"$f":"Control!$F$60","v":0},"x",{"$f":"Control!$F$59","v":0},"=",{"$f":"(D18+F18)*$H$6*$J$6*$L$6*$P$6*$N$6","v":0},"x",{"$f":"Control!$D$107","v":9.9999999999999998E-13},"=",{"$f":"R18*T18","v":0},"x",{"$f":"Control!$D$101","v":25},"x",{"$f":"Control!$D$100","v":0.27272727272727271},"=",{"$f":"V18*X$6*Z$6","v":0},"=",{"$f":"AB18*C_CO2","v":0}]
[]
[null,{"$f":"B18+1","v":1997},"(",null,"+",null," )   x ",{"$f":"Control!$F$57","v":0},"x",{"$f":"Control!$D$106","v":1000},"x",{"$f":"Control!$F$58","v":0},"x",{"$f":"Control!$F$60","v":0},"x",{"$f":"Control!$F$59","v":0},"=",{"$f":"(D20+F20)*$H$6*$J$6*$L$6*$P$6*$N$6","v":0},"x",{"$f":"Control!$D$107","v":9.9999999999999998E-13},"=",{"$f":"R20*T20","v":0},"x",{"$f":"Control!$D$101","v":25},"x",{"$f":"Control!$D$100","v":0.27272727272727271},"=",{"$f":"V20*X$6*Z$6","v":0},"=",{"$f":"AB20*C_CO2","v":0}]
[]
[null,{"$f":"B20+1","v":1998},"(",null,"+",null," )   x ",{"$f":"Control!$F$57","v":0},"x",{"$f":"Control!$D$106","v":1000},"x",{"$f":"Control!$F$58","v":0},"x",{"$f":"Control!$F$60","v":0},"x",{"$f":"Control!$F$59","v":0},"=",{"$f":"(D22+F22)*$H$6*$J$6*$L$6*$P$6*$N$6","v":0},"x",{"$f":"Control!$D$107","v":9.9999999999999998E-13},"=",{"$f":"R22*T22","v":0},"x",{"$f":"Control!$D$101","v":25},"x",{"$f":"Control!$D$100","v":0.27272727272727271},"=",{"$f":"V22*X$6*Z$6","v":0},"=",{"$f":"AB22*C_CO2","v":0}]
[]
[null,{"$f":"B22+1","v":1999},"(",null,"+",null," )   x ",{"$f":"Control!$F$57","v":0},"x",{"$f":"Control!$D$106","v":1000},"x",{"$f":"Control!$F$58","v":0},"x",{"$f":"Control!$F$60","v":0},"x",{"$f":"Control!$F$59","v":0},"=",{"$f":"(D24+F24)*$H$6*$J$6*$L$6*$P$6*$N$6","v":0},"x",{"$f":"Control!$D$107","v":9.9999999999999998E-13},"=",{"$f":"R24*T24","v":0},"x",{"$f":"Control!$D$101","v":25},"x",{"$f":"Control!$D$100","v":0.27272727272727271},"=",{"$f":"V24*X$6*Z$6","v":0},"=",{"$f":"AB24*C_CO2","v":0}]
[]
[null,{"$f":"B24+1","v":2000},"(",null,"+",null," )   x ",{"$f":"Control!$F$57","v":0},"x",{"$f":"Control!$D$106","v":1000},"x",{"$f":"Control!$F$58","v":0},"x",{"$f":"Control!$F$60","v":0},"x",{"$f":"Control!$F$59","v":0},"=",{"$f":"(D26+F26)*$H$6*$J$6*$L$6*$P$6*$N$6","v":0},"x",{"$f":"Control!$D$107","v":9.9999999999999998E-13},"=",{"$f":"R26*T26","v":0},"x",{"$f":"Control!$D$101","v":25},"x",{"$f":"Control!$D$100","v":0.27272727272727271},"=",{"$f":"V26*X$6*Z$6","v":0},"=",{"$f":"AB26*C_CO2","v":0}]
[]
[null,{"$f":"B26+1","v":2001},"(",null,"+",null," )   x ",{"$f":"Control!$F$57","v":0},"x",{"$f":"Control!$D$106","v":1000},"x",{"$f":"Control!$F$58","v":0},"x",{"$f":"Control!$F$60","v":0},"x",{"$f":"Control!$F$59","v":0},"=",{"$f":"(D28+F28)*$H$6*$J$6*$L$6*$P$6*$N$6","v":0},"x",{"$f":"Control!$D$107","v":9.9999999999999998E-13},"=",{"$f":"R28*T28","v":0},"x",{"$f":"Control!$D$101","v":25},"x",{"$f":"Control!$D$100","v":0.27272727272727271},"=",{"$f":"V28*X$6*Z$6","v":0},"=",{"$f":"AB28*C_CO2","v":0}]
[]
[null,{"$f":"B28+1","v":2002},"(",null,"+",null," )   x ",{"$f":"Control!$F$57","v":0},"x",{"$f":"Control!$D$106","v":1000},"x",{"$f":"Control!$F$58","v":0},"x",{"$f":"Control!$F$60","v":0},"x",{"$f":"Control!$F$59","v":0},"=",{"$f":"(D30+F30)*$H$6*$J$6*$L$6*$P$6*$N$6","v":0},"x",{"$f":"Control!$D$107","v":9.9999999999999998E-13},"=",{"$f":"R30*T30","v":0},"x",{"$f":"Control!$D$101","v":25},"x",{"$f":"Control!$D$100","v":0.27272727272727271},"=",{"$f":"V30*X$6*Z$6","v":0},"=",{"$f":"AB30*C_CO2","v":0}]
[]
[null,{"$f":"B30+1","v":2003},"(",null,"+",null," )   x ",{"$f":"Control!$F$57","v":0},"x",{"$f":"Control!$D$106","v":1000},"x",{"$f":"Control!$F$58","v":0},"x",{"$f":"Control!$F$60","v":0},"x",{"$f":"Control!$F$59","v":0},"=",{"$f":"(D32+F32)*$H$6*$J$6*$L$6*$P$6*$N$6","v":0},"x",{"$f":"Control!$D$107","v":9.9999999999999998E-13},"=",{"$f":"R32*T32","v":0},"x",{"$f":"Control!$D$101","v":25},"x",{"$f":"Control!$D$100","v":0.27272727272727271},"=",{"$f":"V32*X$6*Z$6","v":0},"=",{"$f":"AB32*C_CO2","v":0}]
[]
[null,{"$f":"B32+1","v":2004},"(",null,"+",null," )   x ",{"$f":"Control!$F$57","v":0},"x",{"$f":"Control!$D$106","v":1000},"x",{"$f":"Control!$F$58","v":0},"x",{"$f":"Control!$F$60","v":0},"x",{"$f":"Control!$F$59","v":0},"=",{"$f":"(D34+F34)*$H$6*$J$6*$L$6*$P$6*$N$6","v":0},"x",{"$f":"Control!$D$107","v":9.9999999999999998E-13},"=",{"$f":"R34*T34","v":0},"x",{"$f":"Control!$D$101","v":25},"x",{"$f":"Control!$D$100","v":0.27272727272727271},"=",{"$f":"V34*X$6*Z$6","v":0},"=",{"$f":"AB34*C_CO2","v":0}]
[]
[null,{"$f":"B34+1","v":2005},"(",null,"+",null," )   x ",{"$f":"Control!$F$57","v":0},"x",{"$f":"Control!$D$106","v":1000},"x",{"$f":"Control!$F$58","v":0},"x",{"$f":"Control!$F$60","v":0},"x",{"$f":"Control!$F$59","v":0},"=",{"$f":"(D36+F36)*$H$6*$J$6*$L$6*$P$6*$N$6","v":0},"x",{"$f":"Control!$D$107","v":9.9999999999999998E-13},"=",{"$f":"R36*T36","v":0},"x",{"$f":"Control!$D$101","v":25},"x",{"$f":"Control!$D$100","v":0.27272727272727271},"=",{"$f":"V36*X$6*Z$6","v":0},"=",{"$f":"AB36*C_CO2","v":0}]
[]
[null,{"$f":"B36+1","v":2006},"(",null,"+",null," )   x ",{"$f":"Control!$F$57","v":0},"x",{"$f":"Control!$D$106","v":1000},"x",{"$f":"Control!$F$58","v":0},"x",{"$f":"Control!$F$60","v":0},"x",{"$f":"Control!$F$59","v":0},"=",{"$f":"(D38+F38)*$H$6*$J$6*$L$6*$P$6*$N$6","v":0},"x",{"$f":"Control!$D$107","v":9.9999999999999998E-13},"=",{"$f":"R38*T38","v":0},"x",{"$f":"Control!$D$101","v":25},"x",{"$f":"Control!$D$100","v":0.27272727272727271},"=",{"$f":"V38*X$6*Z$6","v":0},"=",{"$f":"AB38*C_CO2","v":0}]
[]
[null,{"$f":"B38+1","v":2007},"(",null,"+",null," )   x ",{"$f":"Control!$F$57","v":0},"x",{"$f":"Control!$D$106","v":1000},"x",{"$f":"Control!$F$58","v":0},"x",{"$f":"Control!$F$60","v":0},"x",{"$f":"Control!$F$59","v":0},"=",{"$f":"(D40+F40)*$H$6*$J$6*$L$6*$P$6*$N$6","v":0},"x",{"$f":"Control!$D$107","v":9.9999999999999998E-13},"=",{"$f":"R40*T40","v":0},"x",{"$f":"Control!$D$101","v":25},"x",{"$f":"Control!$D$100","v":0.27272727272727271},"=",{"$f":"V40*X$6*Z$6","v":0},"=",{"$f":"AB40*C_CO2","v":0}]
[]
[null,{"$f":"B40+1","v":2008},"(",null,"+",null," )   x ",{"$f":"Control!$F$57","v":0},"x",{"$f":"Control!$D$106","v":1000},"x",{"$f":"Control!$F$58","v":0},"x",{"$f":"Control!$F$60","v":0},"x",{"$f":"Control!$F$59","v":0},"=",{"$f":"(D42+F42)*$H$6*$J$6*$L$6*$P$6*$N$6","v":0},"x",{"$f":"Control!$D$107","v":9.9999999999999998E-13},"=",{"$f":"R42*T42","v":0},"x",{"$f":"Control!$D$101","v":25},"x",{"$f":"Control!$D$100","v":0.27272727272727271},"=",{"$f":"V42*X$6*Z$6","v":0},"=",{"$f":"AB42*C_CO2","v":0}]
[]
[null,{"$f":"B42+1","v":2009},"(",null,"+",null," )   x ",{"$f":"Control!$F$57","v":0},"x",{"$f":"Control!$D$106","v":1000},"x",{"$f":"Control!$F$58","v":0},"x",{"$f":"Control!$F$60","v":0},"x",{"$f":"Control!$F$59","v":0},"=",{"$f":"(D44+F44)*$H$6*$J$6*$L$6*$P$6*$N$6","v":0},"x",{"$f":"Control!$D$107","v":9.9999999999999998E-13},"=",{"$f":"R44*T44","v":0},"x",{"$f":"Control!$D$101","v":25},"x",{"$f":"Control!$D$100","v":0.27272727272727271},"=",{"$f":"V44*X$6*Z$6","v":0},"=",{"$f":"AB44*C_CO2","v":0}]
[]
[null,{"$f":"B44+1","v":2010},"(",null,"+",null," )   x ",{"$f":"Control!$F$57","v":0},"x",{"$f":"Control!$D$106","v":1000},"x",{"$f":"Control!$F$58","v":0},"x",{"$f":"Control!$F$60","v":0},"x",{"$f":"Control!$F$59","v":0},"=",{"$f":"(D46+F46)*$H$6*$J$6*$L$6*$P$6*$N$6","v":0},"x",{"$f":"Control!$D$107","v":9.9999999999999998E-13},"=",{"$f":"R46*T46","v":0},"x",{"$f":"Control!$D$101","v":25},"x",{"$f":"Control!$D$100","v":0.27272727272727271},"=",{"$f":"V46*X$6*Z$6","v":0},"=",{"$f":"AB46*C_CO2","v":0}]
[]
[null,{"$f":"B46+1","v":2011},"(",null,"+",null," )   x ",{"$f":"Control!$F$57","v":0},"x",{"$f":"Control!$D$106","v":1000},"x",{"$f":"Control!$F$58","v":0},"x",{"$f":"Control!$F$60","v":0},"x",{"$f":"Control!$F$59","v":0},"=",{"$f":"(D48+F48)*$H$6*$J$6*$L$6*$P$6*$N$6","v":0},"x",{"$f":"Control!$D$107","v":9.9999999999999998E-13},"=",{"$f":"R48*T48","v":0},"x",{"$f":"Control!$D$101","v":25},"x",{"$f":"Control!$D$100","v":0.27272727272727271},"=",{"$f":"V48*X$6*Z$6","v":0},"=",{"$f":"AB48*C_CO2","v":0}]
[]
[null,{"$f":"B48+1","v":2012},"(",null,"+",null," )   x ",{"$f":"Control!$F$57","v":0},"x",{"$f":"Control!$D$106","v":1000},"x",{"$f":"Control!$F$58","v":0},"x",{"$f":"Control!$F$60","v":0},"x",{"$f":"Control!$F$59","v":0},"=",{"$f":"(D50+F50)*$H$6*$J$6*$L$6*$P$6*$N$6","v":0},"x",{"$f":"Control!$D$107","v":9.9999999999999998E-13},"=",{"$f":"R50*T50","v":0},"x",{"$f":"Control!$D$101","v":25},"x",{"$f":"Control!$D$100","v":0.27272727272727271},"=",{"$f":"V50*X$6*Z$6","v":0},"=",{"$f":"AB50*C_CO2","v":0}]
[]
[null,{"$f":"B50+1","v":2013},"(",null,"+",null," )   x ",{"$f":"Control!$F$57","v":0},"x",{"$f":"Control!$D$106","v":1000},"x",{"$f":"Control!$F$58","v":0},"x",{"$f":"Control!$F$60","v":0},"x",{"$f":"Control!$F$59","v":0},"=",{"$f":"(D52+F52)*$H$6*$J$6*$L$6*$P$6*$N$6","v":0},"x",{"$f":"Control!$D$107","v":9.9999999999999998E-13},"=",{"$f":"R52*T52","v":0},"x",{"$f":"Control!$D$101","v":25},"x",{"$f":"Control!$D$100","v":0.27272727272727271},"=",{"$f":"V52*X$6*Z$6","v":0},"=",{"$f":"AB52*C_CO2","v":0}]
[]
[null,{"$f":"B52+1","v":2014},"(",null,"+",null," )   x ",{"$f":"Control!$F$57","v":0},"x",{"$f":"Control!$D$106","v":1000},"x",{"$f":"Control!$F$58","v":0},"x",{"$f":"Control!$F$60","v":0},"x",{"$f":"Control!$F$59","v":0},"=",{"$f":"(D54+F54)*$H$6*$J$6*$L$6*$P$6*$N$6","v":0},"x",{"$f":"Control!$D$107","v":9.9999999999999998E-13},"=",{"$f":"R54*T54","v":0},"x",{"$f":"Control!$D$101","v":25},"x",{"$f":"Control!$D$100","v":0.27272727272727271},"=",{"$f":"V54*X$6*Z$6","v":0},"=",{"$f":"AB54*C_CO2","v":0}]
[]
[null,{"$f":"B54+1","v":2015},"(",null,"+",null," )   x ",{"$f":"Control!$F$57","v":0},"x",{"$f":"Control!$D$106","v":1000},"x",{"$f":"Control!$F$58","v":0},"x",{"$f":"Control!$F$60","v":0},"x",{"$f":"Control!$F$59","v":0},"=",{"$f":"(D56+F56)*$H$6*$J$6*$L$6*$P$6*$N$6","v":0},"x",{"$f":"Control!$D$107","v":9.9999999999999998E-13},"=",{"$f":"R56*T56","v":0},"x",{"$f":"Control!$D$101","v":25},"x",{"$f":"Control!$D$100","v":0.27272727272727271},"=",{"$f":"V56*X$6*Z$6","v":0},"=",{"$f":"AB56*C_CO2","v":0}]
[]
[null,{"$f":"B56+1","v":2016},"(",null,"+",null," )   x ",{"$f":"Control!$F$57","v":0},"x",{"$f":"Control!$D$106","v":1000},"x",{"$f":"Control!$F$58","v":0},"x",{"$f":"Control!$F$60","v":0},"x",{"$f":"Control!$F$59","v":0},"=",{"$f":"(D58+F58)*$H$6*$J$6*$L$6*$P$6*$N$6","v":0},"x",{"$f":"Control!$D$107","v":9.9999999999999998E-13},"=",{"$f":"R58*T58","v":0},"x",{"$f":"Control!$D$101","v":25},"x",{"$f":"Control!$D$100","v":0.27272727272727271},"=",{"$f":"V58*X$6*Z$6","v":0},"=",{"$f":"AB58*C_CO2","v":0}]
[]
[null,{"$f":"B58+1","v":2017},"(",null,"+",null," )   x ",{"$f":"Control!$F$57","v":0},"x",{"$f":"Control!$D$106","v":1000},"x",{"$f":"Control!$F$58","v":0},"x",{"$f":"Control!$F$60","v":0},"x",{"$f":"Control!$F$59","v":0},"=",{"$f":"(D60+F60)*$H$6*$J$6*$L$6*$P$6*$N$6","v":0},"x",{"$f":"Control!$D$107","v":9.9999999999999998E-13},"=",{"$f":"R60*T60","v":0},"x",{"$f":"Control!$D$101","v":25},"x",{"$f":"Control!$D$100","v":0.27272727272727271},"=",{"$f":"V60*X$6*Z$6","v":0},"=",{"$f":"AB60*C_CO2","v":0}]
[]
[null,{"$f":"B60+1","v":2018},"(",null,"+",null," )   x ",{"$f":"Control!$F$57","v":0},"x",{"$f":"Control!$D$106","v":1000},"x",{"$f":"Control!$F$58","v":0},"x",{"$f":"Control!$F$60","v":0},"x",{"$f":"Control!$F$59","v":0},"=",{"$f":"(D62+F62)*$H$6*$J$6*$L$6*$P$6*$N$6","v":0},"x",{"$f":"Control!$D$107","v":9.9999999999999998E-13},"=",{"$f":"R62*T62","v":0},"x",{"$f":"Control!$D$101","v":25},"x",{"$f":"Control!$D$100","v":0.27272727272727271},"=",{"$f":"V62*X$6*Z$6","v":0},"=",{"$f":"AB62*C_CO2","v":0}]
[]
[null,{"$f":"B62+1","v":2019},"(",null,"+",null," )   x ",{"$f":"Control!$F$57","v":0},"x",{"$f":"Control!$D$106","v":1000},"x",{"$f":"Control!$F$58","v":0},"x",{"$f":"Control!$F$60","v":0},"x",{"$f":"Control!$F$59","v":0},"=",{"$f":"(D64+F64)*$H$6*$J$6*$L$6*$P$6*$N$6","v":0},"x",{"$f":"Control!$D$107","v":9.9999999999999998E-13},"=",{"$f":"R64*T64","v":0},"x",{"$f":"Control!$D$101","v":25},"x",{"$f":"Control!$D$100","v":0.27272727272727271},"=",{"$f":"V64*X$6*Z$6","v":0},"=",{"$f":"AB64*C_CO2","v":0}]
[]
[null,{"$f":"B64+1","v":2020},"(",null,"+",null," )   x ",{"$f":"Control!$F$57","v":0},"x",{"$f":"Control!$D$106","v":1000},"x",{"$f":"Control!$F$58","v":0},"x",{"$f":"Control!$F$60","v":0},"x",{"$f":"Control!$F$59","v":0},"=",{"$f":"(D66+F66)*$H$6*$J$6*$L$6*$P$6*$N$6","v":0},"x",{"$f":"Control!$D$107","v":9.9999999999999998E-13},"=",{"$f":"R66*T66","v":0},"x",{"$f":"Control!$D$101","v":25},"x",{"$f":"Control!$D$100","v":0.27272727272727271},"=",{"$f":"V66*X$6*Z$6","v":0},"=",{"$f":"AB66*C_CO2","v":0}]

{"sheet":"Summary","index":8,"n_rows":23,"n_cols":33,"rows_kept":23,"cut":false,"hidden":false,"merged":[[2,1,2,13]]}
[null,{"$f":"\"11. \"&SelectedState & \" Emissions Summary\"","v":"11. Select a state . . . Emissions Summary"}]
[2018]
[null,{"$f":"Tracker!B14","v":"Emissions were not calculated for the following sources: Municipal methane, Municipal nitrous oxides, Industrial fruits & vegetables, Industrial red meat, Industrial poultry, and Industrial pulp & paper."}]
[]
[null,"Emissions (MMTCO2E)",1990,1991,1992,1993,1994,1995,1996,1997,1998,1999,2000,2001,2002,2003,2004,2005,2006,2007,2008,2009,2010,2011,2012,2013,2014,2015,2016,2017,2018,2019,2020]
[null,"Municipal CH4",{"$f":"C16*C_CO2","v":0},0,0,0,0,0,0,0,0,0,0,0,0,0,0,0,0,0,0,0,0,0,0,0,0,0,0,0,0,{"$f":"AF16*C_CO2","v":0},0]
[null,"Municipal N2O",{"$f":"C17*C_CO2","v":0},0,0,0,0,0,0,0,0,0,0,0,0,0,0,0,0,0,0,0,0,0,0,0,0,0,0,0,0,0,0]
[null,"Industrial CH4",{"$f":"C18*C_CO2","v":0},0,0,0,0,0,0,0,0,0,0,0,0,0,0,0,0,0,0,0,0,0,0,0,0,0,0,0,0,0,0]
[null,"Fruits & Vegetables",{"$f":"C19*C_CO2","v":0},0,0,0,0,0,0,{"$f":"J19*C_CO2","v":0},0,0,0,0,0,0,0,0,0,0,0,0,0,0,0,0,0,0,0,0,0,0,0]
[null,"Red Meat",{"$f":"C20*C_CO2","v":0},0,0,0,0,0,0,0,0,0,0,0,0,0,0,0,0,0,0,0,0,0,0,0,0,0,0,0,0,0,0]
[null,"Poultry",{"$f":"C21*C_CO2","v":0},0,0,0,0,0,0,0,0,0,0,0,0,0,0,0,0,0,0,0,0,0,0,0,0,0,0,0,0,0,0]
[null,"Pulp & Paper",{"$f":"C22*C_CO2","v":0},0,0,0,0,0,0,0,0,0,0,0,0,0,0,0,0,0,0,0,0,0,0,0,0,0,0,0,0,0,0]
[null,"Total Emissions",{"$f":"SUM(C6:C8)","v":0},{"$f":"SUM(D6:D8)","v":0},0,0,0,0,0,0,0,0,{"$f":"SUM(M6:M8)","v":0},0,0,0,0,0,0,0,0,0,0,0,0,0,0,0,0,0,0,0,0]
[null,null,{"$f":"IF(C5<=$A$2,1,0)","v":1},{"$f":"IF(D5<=$A$2,C14+1,0)","v":2},{"$f":"IF(E5<=$A$2,D14+1,0)","v":3},4,5,6,7,8,9,10,11,12,13,14,15,16,17,18,19,20,21,22,23,24,25,26,27,28,29,0,0]
[null,"Emissions (MMTCE)",1990,1991,1992,1993,1994,1995,1996,1997,1998,1999,2000,2001,2002,2003,2004,2005,2006,2007,2008,2009,2010,2011,2012,2013,2014,2015,2016,2017,2018,2019,2020]
[null,"Municipal CH4",{"$f":"'Municipal WW, CH4'!W6","v":0},{"$f":"'Municipal WW, CH4'!W8","v":0},{"$f":"'Municipal WW, CH4'!W10","v":0},{"$f":"'Municipal WW, CH4'!W12","v":0},{"$f":"'Municipal WW, CH4'!W14","v":0},{"$f":"'Municipal WW, CH4'!W16","v":0},{"$f":"'Municipal WW, CH4'!W18","v":0},{"$f":"'Municipal WW, CH4'!W20","v":0},{"$f":"'Municipal WW, CH4'!W22","v":0},{"$f":"'Municipal WW, CH4'!W24","v":0},{"$f":"'Municipal WW, CH4'!W26","v":0},{"$f":"'Municipal WW, CH4'!W28","v":0},{"$f":"'Municipal WW, CH4'!W30","v":0},{"$f":"'Municipal WW, CH4'!W32","v":0},{"$f":"'Municipal WW, CH4'!W34","v":0},{"$f":"'Municipal WW, CH4'!W36","v":0},{"$f":"'Municipal WW, CH4'!W38","v":0},{"$f":"'Municipal WW, CH4'!W40","v":0},{"$f":"'Municipal WW, CH4'!W42","v":0},{"$f":"'Municipal WW, CH4'!W44","v":0},{"$f":"'Municipal WW, CH4'!W46","v":0},{"$f":"'Municipal WW, CH4'!W48","v":0},{"$f":"'Municipal WW, CH4'!W50","v":0},{"$f":"'Municipal WW, CH4'!W52","v":0},{"$f":"'Municipal WW, CH4'!W54","v":0},{"$f":"'Municipal WW, CH4'!W56","v":0},{"$f":"'Municipal WW, CH4'!W58","v":0},{"$f":"'Municipal WW, CH4'!W60","v":0},{"$f":"'Municipal WW, CH4'!W62","v":0},{"$f":"'Municipal WW, CH4'!W64","v":0},{"$f":"'Municipal WW, CH4'!W66","v":0}]
[null,"Municipal N2O ",{"$f":"'Municipal WW, N2O, effluent'!AK6","v":0},{"$f":"'Municipal WW, N2O, effluent'!AK8","v":0},{"$f":"'Municipal WW, N2O, effluent'!AK10","v":0},{"$f":"'Municipal WW, N2O, effluent'!AK12","v":0},{"$f":"'Municipal WW, N2O, effluent'!AK14","v":0},{"$f":"'Municipal WW, N2O, effluent'!AK16","v":0},{"$f":"'Municipal WW, N2O, effluent'!AK18","v":0},{"$f":"'Municipal WW, N2O, effluent'!AK20","v":0},{"$f":"'Municipal WW, N2O, effluent'!AK22","v":0},{"$f":"'Municipal WW, N2O, effluent'!AK24","v":0},{"$f":"'Municipal WW, N2O, effluent'!AK26","v":0},{"$f":"'Municipal WW, N2O, effluent'!AK28","v":0},{"$f":"'Municipal WW, N2O, effluent'!AK30","v":0},{"$f":"'Municipal WW, N2O, effluent'!AK32","v":0},{"$f":"'Municipal WW, N2O, effluent'!AK34","v":0},{"$f":"'Municipal WW, N2O, effluent'!AK36","v":0},{"$f":"'Municipal WW, N2O, effluent'!AK38","v":0},{"$f":"'Municipal WW, N2O, effluent'!AK40","v":0},{"$f":"'Municipal WW, N2O, effluent'!AK42","v":0},{"$f":"'Municipal WW, N2O, effluent'!AK44","v":0},{"$f":"'Municipal WW, N2O, effluent'!AK46","v":0},{"$f":"'Municipal WW, N2O, effluent'!AK48","v":0},{"$f":"'Municipal WW, N2O, effluent'!AK50","v":0},{"$f":"'Municipal WW, N2O, effluent'!AK52","v":0},{"$f":"'Municipal WW, N2O, effluent'!AK54","v":0},{"$f":"'Municipal WW, N2O, effluent'!AK56","v":0},{"$f":"'Municipal WW, N2O, effluent'!AK58","v":0},{"$f":"'Municipal WW, N2O, effluent'!AK60","v":0},{"$f":"'Municipal WW, N2O, effluent'!AK62","v":0},{"$f":"'Municipal WW, N2O, effluent'!AK64","v":0},{"$f":"'Municipal WW, N2O, effluent'!AK66","v":0}]
[null,"Industrial CH4",{"$f":"SUM(C19:C22)","v":0},{"$f":"SUM(D19:D22)","v":0},0,0,0,0,0,0,0,0,{"$f":"SUM(M19:M22)","v":0},0,0,0,0,0,0,0,0,0,0,0,0,0,0,0,0,0,0,0,0]
[null,"Fruits & Vegetables",{"$f":"'Ind WW Fruit'!Y6","v":0},{"$f":"'Ind WW Fruit'!Y8","v":0},{"$f":"'Ind WW Fruit'!Y10","v":0},{"$f":"'Ind WW Fruit'!Y12","v":0},{"$f":"'Ind WW Fruit'!Y14","v":0},{"$f":"'Ind WW Fruit'!Y16","v":0},{"$f":"'Ind WW Fruit'!Y18","v":0},{"$f":"'Ind WW Fruit'!Y20","v":0},{"$f":"'Ind WW Fruit'!Y22","v":0},{"$f":"'Ind WW Fruit'!Y24","v":0},{"$f":"'Ind WW Fruit'!Y26","v":0},{"$f":"'Ind WW Fruit'!Y28","v":0},{"$f":"'Ind WW Fruit'!Y30","v":0},{"$f":"'Ind WW Fruit'!Y32","v":0},{"$f":"'Ind WW Fruit'!Y34","v":0},{"$f":"'Ind WW Fruit'!Y36","v":0},{"$f":"'Ind WW Fruit'!Y38","v":0},{"$f":"'Ind WW Fruit'!Y40","v":0},{"$f":"'Ind WW Fruit'!Y42","v":0},{"$f":"'Ind WW Fruit'!Y44","v":0},{"$f":"'Ind WW Fruit'!Y46","v":0},{"$f":"'Ind WW Fruit'!Y48","v":0},{"$f":"'Ind WW Fruit'!Y50","v":0},{"$f":"'Ind WW Fruit'!Y52","v":0},{"$f":"'Ind WW Fruit'!Y54","v":0},{"$f":"'Ind WW Fruit'!Y56","v":0},{"$f":"'Ind WW Fruit'!Y58","v":0},{"$f":"'Ind WW Fruit'!Y60","v":0},{"$f":"'Ind WW Fruit'!Y62","v":0},{"$f":"'Ind WW Fruit'!Y64","v":0},{"$f":"'Ind WW Fruit'!Y66","v":0}]
[null,"Red Meat",{"$f":"'Ind WW Meat'!Y6","v":0},{"$f":"'Ind WW Meat'!Y8","v":0},{"$f":"'Ind WW Meat'!Y10","v":0},{"$f":"'Ind WW Meat'!Y12","v":0},{"$f":"'Ind WW Meat'!Y14","v":0},{"$f":"'Ind WW Meat'!Y16","v":0},{"$f":"'Ind WW Meat'!Y18","v":0},{"$f":"'Ind WW Meat'!Y20","v":0},{"$f":"'Ind WW Meat'!Y22","v":0},{"$f":"'Ind WW Meat'!Y24","v":0},{"$f":"'Ind WW Meat'!Y26","v":0},{"$f":"'Ind WW Meat'!Y28","v":0},{"$f":"'Ind WW Meat'!Y30","v":0},{"$f":"'Ind WW Meat'!Y32","v":0},{"$f":"'Ind WW Meat'!Y34","v":0},{"$f":"'Ind WW Meat'!Y36","v":0},{"$f":"'Ind WW Meat'!Y38","v":0},{"$f":"'Ind WW Meat'!Y40","v":0},{"$f":"'Ind WW Meat'!Y42","v":0},{"$f":"'Ind WW Meat'!Y44","v":0},{"$f":"'Ind WW Meat'!Y46","v":0},{"$f":"'Ind WW Meat'!Y48","v":0},{"$f":"'Ind WW Meat'!Y50","v":0},{"$f":"'Ind WW Meat'!Y52","v":0},{"$f":"'Ind WW Meat'!Y54","v":0},{"$f":"'Ind WW Meat'!Y56","v":0},{"$f":"'Ind WW Meat'!Y58","v":0},{"$f":"'Ind WW Meat'!Y60","v":0},{"$f":"'Ind WW Meat'!Y62","v":0},{"$f":"'Ind WW Meat'!Y64","v":0},{"$f":"'Ind WW Meat'!Y66","v":0}]
[null,"Poultry",{"$f":"'Ind WW Poultry'!Y6","v":0},{"$f":"'Ind WW Poultry'!Y8","v":0},{"$f":"'Ind WW Poultry'!Y10","v":0},{"$f":"'Ind WW Poultry'!Y12","v":0},{"$f":"'Ind WW Poultry'!Y14","v":0},{"$f":"'Ind WW Poultry'!Y16","v":0},{"$f":"'Ind WW Poultry'!Y18","v":0},{"$f":"'Ind WW Poultry'!Y20","v":0},{"$f":"'Ind WW Poultry'!Y22","v":0},{"$f":"'Ind WW Poultry'!Y24","v":0},{"$f":"'Ind WW Poultry'!Y26","v":0},{"$f":"'Ind WW Poultry'!Y28","v":0},{"$f":"'Ind WW Poultry'!Y30","v":0},{"$f":"'Ind WW Poultry'!Y32","v":0},{"$f":"'Ind WW Poultry'!Y34","v":0},{"$f":"'Ind WW Poultry'!Y36","v":0},{"$f":"'Ind WW Poultry'!Y38","v":0},{"$f":"'Ind WW Poultry'!Y40","v":0},{"$f":"'Ind WW Poultry'!Y42","v":0},{"$f":"'Ind WW Poultry'!Y44","v":0},{"$f":"'Ind WW Poultry'!Y46","v":0},{"$f":"'Ind WW Poultry'!Y48","v":0},{"$f":"'Ind WW Poultry'!Y50","v":0},{"$f":"'Ind WW Poultry'!Y52","v":0},{"$f":"'Ind WW Poultry'!Y54","v":0},{"$f":"'Ind WW Poultry'!Y56","v":0},{"$f":"'Ind WW Poultry'!Y58","v":0},{"$f":"'Ind WW Poultry'!Y60","v":0},{"$f":"'Ind WW Poultry'!Y62","v":0},{"$f":"'Ind WW Poultry'!Y64","v":0},{"$f":"'Ind WW Poultry'!Y66","v":0}]
[null,"Pulp & Paper",{"$f":"'Ind WW P&P'!AB6","v":0},{"$f":"'Ind WW P&P'!AB8","v":0},{"$f":"'Ind WW P&P'!AB10","v":0},{"$f":"'Ind WW P&P'!AB12","v":0},{"$f":"'Ind WW P&P'!AB14","v":0},{"$f":"'Ind WW P&P'!AB16","v":0},{"$f":"'Ind WW P&P'!AB18","v":0},{"$f":"'Ind WW P&P'!AB20","v":0},{"$f":"'Ind WW P&P'!AB22","v":0},{"$f":"'Ind WW P&P'!AB24","v":0},{"$f":"'Ind WW P&P'!AB26","v":0},{"$f":"'Ind WW P&P'!AB28","v":0},{"$f":"'Ind WW P&P'!AB30","v":0},{"$f":"'Ind WW P&P'!AB32","v":0},{"$f":"'Ind WW P&P'!AB34","v":0},{"$f":"'Ind WW P&P'!AB36","v":0},{"$f":"'Ind WW P&P'!AB38","v":0},{"$f":"'Ind WW P&P'!AB40","v":0},{"$f":"'Ind WW P&P'!AB42","v":0},{"$f":"'Ind WW P&P'!AB44","v":0},{"$f":"'Ind WW P&P'!AB46","v":0},{"$f":"'Ind WW P&P'!AB48","v":0},{"$f":"'Ind WW P&P'!AB50","v":0},{"$f":"'Ind WW P&P'!AB52","v":0},{"$f":"'Ind WW P&P'!AB54","v":0},{"$f":"'Ind WW P&P'!AB56","v":0},{"$f":"'Ind WW P&P'!AB58","v":0},{"$f":"'Ind WW P&P'!AB60","v":0},{"$f":"'Ind WW P&P'!AB62","v":0},{"$f":"'Ind WW P&P'!AB64","v":0},{"$f":"'Ind WW P&P'!AB66","v":0}]
[null,"Total Emissions",{"$f":"SUM(C16:C18)","v":0},{"$f":"SUM(D16:D18)","v":0},0,0,0,0,0,0,0,0,{"$f":"SUM(M16:M18)","v":0},0,0,0,0,0,0,0,0,0,0,0,0,0,0,0,0,0,0,0,0]

{"sheet":"Tracker","index":9,"n_rows":14,"n_cols":7,"rows_kept":14,"cut":false,"hidden":true,"merged":[]}
["Sector","Sum","Not included?","Text of missing sector","\"and\"?","Punctuation","Text used"]
["Municipal methane",{"$f":"SUM(Summary!C16:R16)","v":0},{"$f":"IF(ISERROR(B2),TRUE,IF(B2=0,TRUE,FALSE))","v":true},{"$f":"IF(C2=TRUE,\" \"&A2,\"\")","v":" Municipal methane"},{"$f":"IF(AND($C$10=A2,$C$9>1),\" and\",\"\")","v":""},{"$f":"IF(C2=TRUE,IF($C$10=A2,\".\",\",\"),\"\")","v":","},{"$f":"E2&D2&F2","v":" Municipal methane,"}]
["Municipal nitrous oxides",{"$f":"SUM(Summary!C17:R17)","v":0},true," Municipal nitrous oxides","",","," Municipal nitrous oxides,"]
["Industrial fruits & vegetables",{"$f":"SUM(Summary!C19:R19)","v":0},true," Industrial fruits & vegetables","",","," Industrial fruits & vegetables,"]
["Industrial red meat",{"$f":"SUM(Summary!C20:R20)","v":0},true," Industrial red meat","",","," Industrial red meat,"]
["Industrial poultry",{"$f":"SUM(Summary!C21:R21)","v":0},true,{"$f":"IF(C6=TRUE,\" \"&A6,\"\")","v":" Industrial poultry"},{"$f":"IF(AND($C$10=A6,$C$9>1),\" and\",\"\")","v":""},{"$f":"IF(C6=TRUE,IF($C$10=A6,\".\",\",\"),\"\")","v":","},{"$f":"E6&D6&F6","v":" Industrial poultry,"}]
["Industrial pulp & paper",{"$f":"SUM(Summary!C22:R22)","v":0},true," Industrial pulp & paper"," and","."," and Industrial pulp & paper."]
[]
[null,"Count",{"$f":"COUNTIF(C2:C7,TRUE)","v":6}]
[null,"Last",{"$f":"IF(C8=TRUE,A8,IF(C7=TRUE,A7,IF(C5=TRUE,A5,IF(C4=TRUE,A4,IF(C3=TRUE,A3,IF(C2=TRUE,A2,))))))","v":"Industrial pulp & paper"}]
[]
["Part A",{"$f":"IF(C9>1,\"Emissions were not calculated for the following sources:\",\"Emissions were not calculated for the following source:\")","v":"Emissions were not calculated for the following sources:"}]
["Part B",{"$f":"G2&G3&G4&G5&G6&G7","v":" Municipal methane, Municipal nitrous oxides, Industrial fruits & vegetables, Industrial red meat, Industrial poultry, and Industrial pulp & paper."}]
["Final",{"$f":"IF(C9=0,0,B12&B13)","v":"Emissions were not calculated for the following sources: Municipal methane, Municipal nitrous oxides, Industrial fruits & vegetables, Industrial red meat, Industrial poultry, and Industrial pulp & paper."}]

{"sheet":"Uncertainty","index":10,"n_rows":3,"n_cols":2,"rows_kept":3,"cut":false,"hidden":false,"merged":[]}
[]
["Uncertainty Associated With These Emissions Estimates"]
[null,"Excerpted from EIIP Guidance, Chapter 14."]

{"sheet":"Population","index":11,"n_rows":59,"n_cols":32,"rows_kept":59,"cut":false,"hidden":false,"merged":[]}
["SELECTED STATE:",null,{"$f":"VLOOKUP(SelectedState,Lookups!$B$4:$C$55,2,FALSE)","v":{"$error":"#N/A"}}]
[null,{"$f":"VLOOKUP($C$1,$A$6:$AF$57,B4-1988,FALSE)","v":{"$error":"#N/A"}},{"$f":"VLOOKUP($C$1,$A$6:$AF$57,C4-1988,FALSE)","v":{"$error":"#N/A"}},{"$f":"VLOOKUP($C$1,$A$6:$AF$57,D4-1988,FALSE)","v":{"$error":"#N/A"}},{"$error":"#N/A"},{"$error":"#N/A"},{"$error":"#N/A"},{"$error":"#N/A"},{"$error":"#N/A"},{"$error":"#N/A"},{"$error":"#N/A"},{"$error":"#N/A"},{"$error":"#N/A"},{"$error":"#N/A"},{"$error":"#N/A"},{"$error":"#N/A"},{"$error":"#N/A"},{"$error":"#N/A"},{"$error":"#N/A"},{"$error":"#N/A"},{"$error":"#N/A"},{"$error":"#N/A"},{"$f":"VLOOKUP($C$1,$A$6:$AF$57,W4-1988,FALSE)","v":{"$error":"#N/A"}},{"$error":"#N/A"},{"$f":"VLOOKUP($C$1,$A$6:$AF$57,Y4-1988,FALSE)","v":{"$error":"#N/A"}},{"$error":"#N/A"},{"$error":"#N/A"},{"$error":"#N/A"},{"$error":"#N/A"},{"$f":"VLOOKUP($C$1,$A$6:$AF$57,AD4-1988,FALSE)","v":{"$error":"#N/A"}},{"$f":"VLOOKUP($C$1,$A$6:$AF$57,AE4-1988,FALSE)","v":{"$error":"#N/A"}},{"$error":"#N/A"}]
[]
[null,1990,1991,1992,1993,1994,1995,1996,1997,1998,1999,2000,2001,2002,2003,2004,2005,2006,2007,2008,2009,2010,2011,2012,2013,2014,2015,2016,2017,2018,2019,2020]
[]
["AL",4048508,4091025,4139269,4193114,4232965,4262731,4290403,4320281,4351037,4369862,4451687,4462832,4469906,4486598,4506574,4537299,4597688,4637904,4677464,4708708,4785437,4799069,4815588,4830081,4841799,4852347,4863525,4874486,4887681,4903185]
["AK",553120,569273,587073,596993,600624,601345,604918,608846,615205,619500,627428,633160,642391,650426,660975,668625,677325,682297,688125,698473,713910,722128,730443,737068,736283,737498,741456,739700,735139,731545]
["AZ",3679056,3762394,3867333,3993390,4147561,4306908,4432308,4552207,4667277,4778332,5166810,5303632,5449195,5585512,5750475,5961239,6192100,6362241,6499377,6595778,6407172,6472643,6554978,6632764,6730413,6829676,6941072,7044008,7158024,7278717]
["AR",2354343,2370666,2394098,2423743,2450605,2480121,2504858,2524007,2538202,2551373,2678217,2689601,2701889,2717909,2740191,2768918,2815097,2842194,2867764,2889450,2921964,2940667,2952164,2959400,2967392,2978048,2989918,3001345,3009733,3017804]
["CA",29950111,30414114,30875920,31147208,31317179,31493525,31780829,32217708,32682794,33145121,33998767,34507030,34916495,35307398,35629666,35885415,35979208,36226122,36580371,36961664,37319502,37638369,37948800,38260787,38596972,38918045,39167117,39358497,39461588,39512223]
["CO",3303862,3367567,3459995,3560884,3653910,3738061,3812716,3891293,3968967,4056133,4327788,4431918,4503156,4548339,4600050,4662734,4753044,4842259,4935213,5024748,5047349,5121108,5192647,5269035,5350101,5450623,5539215,5611885,5691287,5758736]
["CT",3289056,3288640,3274997,3272325,3268346,3265293,3267030,3268514,3272563,3282031,3411714,3428208,3448261,3467932,3475351,3478714,3485162,3488633,3502932,3518288,3579114,3588283,3594547,3594841,3594524,3587122,3578141,3573297,3571520,3565287]
["DE",669063,680495,690158,699475,708416,718265,727090,735024,744066,753538,786404,794498,803774,814262,825682,838519,853022,864896,876211,885122,899593,907381,915179,923576,932487,941252,948921,956823,965479,973764]
["DC",603814,593239,584183,576358,564982,551273,538273,528752,521426,519000,571723,577678,579112,577371,579521,582049,583978,586409,590074,599657,605226,619800,634924,650581,662328,675400,685815,694906,701547,705749]
["FL",13018365,13289497,13504775,13713593,13961798,14185403,14426911,14683350,14908230,15111244,16047246,16340734,16652679,16937337,17313811,17702476,18088505,18277888,18423878,18537969,18845537,19053237,19297822,19545621,19845911,20209042,20613477,20963613,21244317,21477737]
["GA",6506531,6621279,6759474,6894092,7045900,7188538,7332225,7486094,7636522,7788240,8230053,8418592,8583674,8732924,8910741,9093958,9330086,9533761,9697838,9829211,9711881,9802431,9901430,9972479,10067278,10178447,10301890,10410330,10511131,10617423]
["HI",1112703,1131412,1149926,1161508,1173903,1180490,1184434,1189322,1190472,1185497,1211479,1217955,1227391,1238333,1251532,1264468,1275599,1276832,1287481,1295178,1363963,1379329,1394804,1408243,1414538,1422052,1427559,1424393,1420593,1415872]
["ID",1011882,1038915,1066490,1101204,1135459,1165000,1187706,1210638,1230923,1251700,1299474,1320732,1341408,1363010,1390329,1424127,1464413,1499245,1527506,1545801,1570746,1583910,1595324,1611206,1631112,1651059,1682380,1717715,1750536,1787065]
["IL",11446979,11535973,11635197,11725984,11804986,11884935,11953003,12011509,12069774,12128370,12437888,12510596,12565228,12611047,12665718,12704063,12718011,12779417,12842954,12910409,12840503,12867454,12882510,12895129,12884493,12858913,12820527,12778828,12723071,12671821]
["IN",5555097,5602062,5648649,5701965,5745626,5791819,5834908,5872370,5907617,5942901,6091392,6123942,6146974,6178828,6210801,6248569,6301700,6346113,6388309,6423113,6490432,6516528,6537703,6568713,6593644,6608422,6634304,6658078,6695497,6732219]
["IA",2779769,2791227,2806923,2820525,2829422,2840860,2848473,2854396,2861025,2869413,2928046,2929294,2929395,2933407,2942739,2951775,2964391,2978719,2993987,3007856,3050745,3066336,3076190,3092997,3109350,3120960,3131371,3141550,3148618,3155070]
["KS",2480683,2495209,2526042,2547605,2569118,2586942,2598266,2616339,2638667,2654052,2692681,2701346,2712561,2722070,2731069,2742204,2755700,2775586,2797375,2818747,2858190,2869225,2885257,2893212,2900475,2909011,2910844,2908718,2911359,2913314]
["KY",3692584,3714686,3756358,3792288,3823215,3855248,3881051,3907816,3934310,3960825,4048831,4066442,4086754,4110922,4135567,4165958,4219374,4256278,4287931,4314113,4348181,4369821,4386346,4404659,4414349,4425976,4438182,4452268,4461153,4467673]
["LA",4219179,4240950,4270849,4284749,4306500,4327978,4338763,4351390,4362758,4372035,4468879,4460395,4465215,4473558,4487830,4495627,4240327,4376122,4451513,4492076,4544532,4575625,4600972,4624527,4644013,4664628,4678135,4670560,4659690,4648794]
["ME",1231296,1235439,1235748,1238256,1237687,1237438,1241436,1245215,1247554,1253040,1277179,1284663,1293667,1302729,1307904,1311044,1314963,1317308,1319691,1318301,1327629,1328284,1327729,1328009,1330513,1328262,1331317,1334612,1339057,1344212]
["MD",4797431,4856176,4902545,4942504,4985411,5023650,5057142,5092914,5130072,5171634,5310451,5375659,5439327,5495009,5538989,5575552,5612196,5634242,5658655,5699478,5788645,5839419,5886992,5923188,5957283,5985562,6003323,6023868,6035802,6045680]
["MA",6018664,5998652,5993474,6010884,6031352,6062335,6085393,6115476,6144407,6175169,6362583,6407269,6433043,6441440,6437414,6434343,6466399,6499275,6543595,6593587,6566307,6613583,6663005,6713315,6762596,6794228,6823608,6859789,6882635,6892503]
["MI",9310462,9395022,9470323,9529240,9584481,9659871,9739184,9785450,9820231,9863775,9955146,10004341,10037303,10065881,10090280,10093266,10082438,10050847,10002486,9969727,9877510,9882412,9897145,9913065,9929848,9931715,9950571,9973114,9984072,9986857]
["MN",4387283,4427429,4471503,4521709,4566028,4605445,4647723,4687726,4726411,4775508,4933787,4982339,5016643,5046708,5078014,5104890,5148346,5191206,5230567,5266214,5310828,5346143,5376643,5413479,5451079,5482032,5522744,5566230,5606249,5639632]
["MS",2577426,2591230,2610193,2635574,2663450,2690788,2709925,2731826,2751335,2768619,2848293,2853061,2858013,2866711,2884596,2898209,2897150,2921723,2940212,2951996,2970548,2978731,2983816,2988711,2990468,2988471,2987938,2988510,2981020,2976149]
["MO",5126370,5157770,5193686,5237757,5281206,5324610,5367888,5407113,5437562,5468338,5605868,5641994,5675641,5704639,5742650,5785130,5861572,5909824,5956335,5987580,5995974,6010275,6024367,6040715,6056202,6071732,6087135,6106670,6121623,6137428]
["MT",799824,807837,822436,839876,854923,868522,876656,878706,879533,882779,903283,905854,909859,916754,925969,934888,946230,957225,968035,974989,990697,997316,1003783,1013569,1021869,1030475,1040859,1052482,1060665,1068778]
["NE",1580664,1590805,1602406,1612149,1621551,1635142,1647657,1656042,1660772,1666028,1713194,1717705,1724236,1732873,1741450,1751069,1760435,1769912,1781949,1796619,1829542,1840672,1853303,1865279,1879321,1891277,1905616,1915947,1925614,1934408]
["NV",1218629,1285046,1330694,1380197,1456388,1525777,1596476,1675581,1743772,1809253,2018244,2093973,2164518,2233830,2323875,2401671,2493405,2567752,2615772,2643085,2702405,2712730,2743996,2775970,2817628,2866939,2917563,2969905,3027341,3080156]
["NH",1111831,1107055,1112766,1122191,1133054,1145604,1160768,1173239,1185823,1201134,1240361,1256625,1270701,1281260,1292064,1300530,1311894,1317343,1321872,1324575,1316762,1320202,1324232,1326622,1333341,1336350,1342307,1348787,1353465,1359711]
["NJ",7757158,7784269,7827770,7874891,7918796,7965523,8009624,8054178,8095542,8143412,8430913,8490942,8547410,8589562,8620770,8634657,8623721,8636043,8663398,8707739,8799446,8828117,8844942,8856972,8864525,8867949,8870827,8885525,8886025,8882190]
["NM",1519933,1547115,1580750,1614937,1653329,1682417,1706151,1722939,1733535,1739844,1820704,1828330,1848986,1867909,1889266,1912884,1942608,1968731,1986763,2009671,2064552,2080450,2087309,2092273,2089568,2089291,2091630,2091784,2092741,2096829]
["NY",18002855,18029532,18082032,18140894,18156652,18150928,18143805,18143184,18159175,18196601,18998429,19088220,19161573,19230877,19301113,19336376,19356564,19422777,19467789,19541453,19399878,19499241,19572932,19624447,19651049,19654666,19633428,19589572,19530351,19453561]
["NC",6656987,6748135,6831850,6947412,7060959,7185403,7307658,7428672,7545828,7650789,8078824,8199913,8311263,8409660,8523199,8661061,8866977,9064074,9247134,9380884,9574323,9657592,9749476,9843336,9932887,10031646,10154788,10268233,10381615,10488084]
["ND",637364,634199,635427,637229,639762,641548,642858,640945,637808,633666,641183,636211,633521,632689,636196,635222,636771,638202,641421,646844,674715,685225,701176,722036,737401,754066,754434,754942,758080,762062]
["OH",10861837,10933683,11007609,11070385,11111451,11155493,11187032,11212498,11237752,11256654,11363719,11391298,11410582,11430306,11445095,11450954,11492495,11520815,11528072,11542645,11539336,11544663,11548923,11576684,11602700,11617527,11634370,11659650,11676341,11689100]
["OK",3147105,3166471,3204174,3228829,3246119,3265547,3289634,3314259,3339478,3358044,3453861,3463387,3482946,3496157,3511960,3530087,3574334,3612186,3644025,3687050,3759944,3788379,3818814,3853214,3878187,3909500,3926331,3931316,3940235,3956971]
["OR",2858547,2918745,2973934,3034490,3087142,3141421,3195087,3243254,3282055,3316154,3430828,3470716,3517982,3551877,3576262,3621939,3677545,3732957,3782991,3825657,3837491,3872036,3899001,3922468,3963244,4015792,4089976,4143625,4181886,4217737]
["PA",11895604,11943160,11980819,12022128,12042545,12044780,12038008,12015888,12002329,11994016,12285041,12284522,12298775,12317647,12335652,12351881,12471142,12522531,12566368,12604767,12711160,12745815,12767118,12776309,12788313,12784826,12782275,12787641,12800922,12801989]
["RI",1004649,1003990,1000571,997852,993412,989203,987858,986966,987704,990819,1050725,1058065,1065937,1071302,1071095,1064439,1060196,1055009,1053502,1053209,1053959,1053649,1054621,1055081,1055936,1056065,1056770,1055673,1058287,1059361]
["SC",3499064,3559470,3600576,3634507,3666456,3699943,3738974,3790066,3839578,3885736,4023396,4061844,4102211,4143420,4196799,4249385,4339399,4424232,4503280,4561242,4635649,4671994,4717354,4764080,4823617,4891938,4957968,5021268,5084156,5148714]
["SD",696667,701445,708698,716258,723038,728251,730699,730855,730789,733133,755657,758705,761709,766440,773539,779315,788519,797035,804532,812383,816166,823579,833566,842316,849129,853988,862996,872868,878698,884659]
["TN",4890626,4946886,5013999,5085666,5163016,5241168,5313576,5378433,5432679,5483535,5703094,5753497,5799093,5849563,5906936,5983211,6089453,6172862,6240456,6296254,6355311,6399291,6453898,6494340,6541223,6591170,6646010,6708799,6771631,6829174]
["TX",17044714,17339904,17650479,17996764,18338319,18679706,19006240,19355427,19712389,20044141,20946049,21333928,21713397,22062119,22424884,22811128,23369024,23837701,24304290,24782302,25241971,25645629,26084481,26480266,26964333,27470056,27914410,28295273,28628666,28995881]
["UT",1729722,1771941,1821498,1875993,1930436,1976774,2022253,2065397,2100562,2129836,2244210,2291066,2334462,2380462,2439852,2501262,2583724,2663796,2727343,2784572,2775332,2814384,2853375,2897640,2936879,2981835,3041868,3101042,3153550,3205958]
["VT",564526,567141,570115,574004,578900,582827,586352,588665,590579,593740,609876,612134,614994,616702,618432,619282,619985,620460,621049,621760,625879,627049,626090,626210,625214,625216,623657,624344,624358,623989]
["VA",6213526,6283853,6383315,6464795,6536771,6601392,6665491,6732878,6789225,6872912,7104354,7188251,7276785,7363300,7454688,7546725,7646996,7719749,7795424,7882590,8023699,8101155,8185080,8252427,8310993,8361808,8410106,8463587,8501286,8535519]
["WA",4900780,5013443,5139011,5247704,5334896,5431024,5509963,5604105,5687832,5756361,5911104,5987181,6055613,6110202,6179645,6254579,6372243,6464979,6566073,6664195,6742830,6826627,6897058,6963985,7054655,7163657,7294771,7423362,7523869,7614893]
["WV",1792481,1798212,1805462,1816179,1818490,1820560,1818983,1815588,1811688,1806928,1806977,1798540,1799392,1802287,1803312,1804020,1807237,1811198,1814873,1819777,1854239,1856301,1856872,1853914,1849489,1842050,1831023,1817004,1804291,1792147]
["WI",4902265,4952675,5004636,5055318,5095504,5137004,5173828,5200235,5222124,5250446,5374133,5408061,5444638,5474360,5508789,5538806,5571680,5601571,5627610,5654774,5690475,5705288,5719960,5736754,5751525,5760940,5772628,5790186,5807406,5822434]
["WY",453401,457739,463491,469033,474982,478447,480085,480031,480045,479602,493963,492924,496969,499056,502816,506007,512841,523414,532981,544270,564487,567299,576305,582122,582531,585613,584215,578931,577601,578759]
["US",{"$f":"SUM(B6:B56)","v":249464396},{"$f":"SUM(C6:C56)","v":252153092},255029699,257782608,260327021,262803276,265228572,267783607,270248003,272690813,{"$f":"SUM(L6:L56)","v":282171936},285039803,287726647,290210914,292892127,295560549,298593212,301579895,304374846,{"$f":"SUM(U6:U56)","v":307006550},{"$f":"SUM(V6:V56)","v":309321666},311556874,313830990,315993715,318301008,320635163,322941311,324985539,326687501,328239523]
[null,"1991-1999 estimates from http://www.census.gov/population/estimates/state/st-99-2.txt"]
[null,"2000+ sources in cell comments"]

{"sheet":"Vegetable Data","index":12,"n_rows":100,"n_cols":31,"rows_kept":100,"cut":false,"hidden":true,"merged":[]}
["Data on Vegetable Production were obtained from:"]
["USDA Quick Stats 2.0, Annual Vegetable Production. Available online by state: http://quickstats.nass.usda.gov/"]
["THIS DATASET IS NOT USED IN THE MODULE, DEFAULTS FOR VEGETABLE DATA ARE NOT PROVIDED IN THE STATE INVENTORY TOOL"]
["Vegetable Production, Metric Tons"]
["State",1998,1999,2000,2001,2002,2003,2004,2005,2006,2007,2008,2009,2010,2011]
["Alabama",{"$f":"B56/MT_Hundredweight+IF(ISERROR((VLOOKUP($A6,$Q$56:$Y$81,B$5-1996,FALSE)/MT_Ton)),0,(VLOOKUP($A6,$Q$56:$Y$81,B$5-1996,FALSE)/MT_Ton))","v":31.649860489142242},34.494791769065138,50.040309120072408,56.644613877036278,57.508253729870013,58.321091238419413,35.968059753310925,33.173930817672364,{"$f":"J56/MT_Hundredweight+IF(ISERROR((VLOOKUP($A6,$Q$56:$Y$81,J$5-1996,FALSE)/MT_Ton)),0,(VLOOKUP($A6,$Q$56:$Y$81,J$5-1996,FALSE)/MT_Ton))","v":39.321014476077202},41.505515280303712,43.842423117383234,45.366493445913356,46.331737987315769,42.877178575980821]
["Arizona",968.14027502661918,1180.9512952337088,1083.6648059292024,1052.7769806043254,1151.943156647352,2075.7329851137447,2103.2678557158556,2064.7088764040432,2067.7062147168194,1878.6706916347996,1680.5415489258835,{"$f":"M57/MT_Hundredweight+IF(ISERROR((VLOOKUP($A7,$Q$56:$Y$81,M$5-1996,FALSE)/MT_Ton)),0,(VLOOKUP($A7,$Q$56:$Y$81,M$5-1996,FALSE)/MT_Ton))","v":1605.4556840736327},1605.4048817293483,1687.7554818142594]
["Arkansas",34.088373014790442,32.310290964838629,28.195301077807294,41.099096526029008,40.591073083185634,37.034908983282016,24.740741666472346,29.160545619209707,34.342384736212125,28.804929209219345,31.243441734867542,17.476006433812088,26.671230749277171,27.839684667816933]
["California",8235454.9701552782,11241708.043599697,9482669.4046431575,8004580.8003722094,10201492.460185224,17233299.295862168,21652308.537319083,17879085.408909019,11447.901865721175,11265.62305442897,11108.999427000359,{"$f":"M59/MT_Hundredweight+IF(ISERROR((VLOOKUP($A9,$Q$56:$Y$81,M$5-1996,FALSE)/MT_Ton)),0,(VLOOKUP($A9,$Q$56:$Y$81,M$5-1996,FALSE)/MT_Ton))","v":10897.814081810367},{"$f":"N59/MT_Hundredweight+IF(ISERROR((VLOOKUP($A9,$Q$56:$Y$81,N$5-1996,FALSE)/MT_Ton)),0,(VLOOKUP($A9,$Q$56:$Y$81,N$5-1996,FALSE)/MT_Ton))","v":11162.951516630324},{"$f":"O59/MT_Hundredweight+IF(ISERROR((VLOOKUP($A9,$Q$56:$Y$81,O$5-1996,FALSE)/MT_Ton)),0,(VLOOKUP($A9,$Q$56:$Y$81,O$5-1996,FALSE)/MT_Ton))","v":11032.948317606706}]
["Colorado",2172.3739570908197,794.95508336131275,685.8316478385558,483.79072461974573,470.93773151580831,417.18885126297931,542.36582757958683,482.26665429121556,402.81178783051178,368.21539137287795,346.87840677345622,352.72067636615503,360.74744676308035,361.05226082878636]
["Connecticut",14.885086875310877,9.6524454140241183,15.139098596732566,13.259411858212079,15.64712203957594,14.02144702247714,17.476006433812088,17.171192368106063,14.22465639961449,18.288843942361488,16.86637830240004,13.869039989624129,10.668492299710868,7.8743633640723072]
["Delaware",52.834438055710969,54.612520105662774,55.679369335633865,80.572518034959231,62.385278781166413,166686.00421102895,136563.10785266792,141072.98573613944,57.406649041301336,67.719524931021851,83.468251659166455,68.989583538130276,68.075141341012213,70.3612468338074]
["Florida",56258.278501857334,48752.977281490057,66914.356395662733,66649.7777866299,66601.921978314058,66355.886224945018,66523.584763427614,71329.364648826944,1978.9545192520818,2190.800294917769,2077.4094624751278,2094.5806548432338,1741.3519550342353,1925.3072436878213]
["Georgia",875.47679905198754,977.9451274734962,1289.9731260678971,1227.6894519752993,1149.5046441217039,49312.943128627609,30908.808527656776,27007.216319187184,1179.8844460037376,1165.5581849155544,1118.3120047311206,1154.5848785501375,1115.1622593854918,877.35648579050803]
["Hawaii",24.486729945050659,24.740741666472346,23.419880715079572,7.0615258555229081,0,0,0,0,0,0,0,0,0,0]
["Idaho",{"$f":"B66/MT_Hundredweight+IF(ISERROR((VLOOKUP($A16,$Q$56:$Y$81,B$5-1996,FALSE)/MT_Ton)),0,(VLOOKUP($A16,$Q$56:$Y$81,B$5-1996,FALSE)/MT_Ton))","v":131946.12394657583},128121.15619930343,148269.15438183103,253.60530266741264,318.63230335136461,298.71778439190433,406.82517302897446,308.87825324877178,257.87269958729701,346.72599974060324,314.56811580861762,330.82486597960559,347.4880349048683,364.55762258440569]
["Illinois",118377.40890288625,132591.55355311054,132633.35658073518,143142.10049053415,129316.68098825334,223132.54239098151,211019.81556182174,234805.30621841317,282.20702249949466,318.63230335136461,293.23113120919584,247.55982369757649,248.01704479613551,290.23379289641997]
["Indiana",162299.01719838119,216702.52401558158,237566.66126938339,252230.00036390935,257883.72967304586,208597.35586077347,272207.69450430962,263478.74595949292,180.6023339308197,187.30824337635224,188.88311604916672,184.41250975214501,200.0088294474366,206.00350607298844]
["Louisiana",23.06426430508921,22.505438517961498,12.294167316809666,0,10.973306365416892,11.887748562534968,6.6043047569638711,0,0,0,0,0,0,0]
["Maine",6.4518977241108582,7.0107235112385702,5.8930719369831461,5.5882578712771211,5.5882578712771211,6.0962813141204961,6.0962813141204961,6.6043047569638711,6.2994906912578461,7.7219563312192951,5.4866531827084462,4.5722109855903721,5.0294320841494091,4.8770250512963971]
["Maryland",52.428019301436265,69.853223390964018,91.596626744660455,92.866685351768893,64.722186618245928,112337.38571468029,119851.64257687506,121195.59723173761,55.7301716799182,48.719448168679634,81.232948510655618,60.912010796920626,56.898625598457961,62.791697535441109]
["Massachusetts",24.68993932218801,25.24876510931572,22.759450239383185,25.24876510931572,20.270135369450649,22.505438517961498,26.518823716424158,23.978706502207285,18.492053319498837,21.133775222284388,21.133775222284388,15.545517351007264,19.812914270891614,16.002738449566301]
["Michigan",302237.28117253131,351254.80161905981,355433.01266958396,289826.11226294277,359750.62558510352,707578.73579397856,680477.84684716398,613817.24744500755,446.70501329217933,424.04716774136483,426.5364826112974,462.30133298747097,426.23166854559133,400.83049640342261]
["Minnesota",870351.67388459051,857401.60081498919,834748.20445350849,828327.11276468611,912994.94244244008,2042875.050687955,1836934.1211320404,2033681.9645272521,0,0,0,0,0,0]
["Mississippi",12.090957939672318,10.566887611142194,9.3984336926024312,21.590996320843423,26.772835437845846,20.625751779441011,19.203286139479562,18.288843942361488,19.711309582322937,22.454636173677162,22.454636173677162,16.967982990968714,22.861054927951862,18.898472073773537]
["Missouri",{"$f":"B76/MT_Hundredweight+IF(ISERROR((VLOOKUP($A26,$Q$56:$Y$81,B$5-1996,FALSE)/MT_Ton)),0,(VLOOKUP($A26,$Q$56:$Y$81,B$5-1996,FALSE)/MT_Ton))","v":58.524300615556761},64.620581929677257,61.877255338323039,58.422695926988091,67.363908521031476,38643.96887659152,46367.807256053602,42278.384216035207,43.486806707392873,37.64453711469406,34.29158239192779,43.58841139596155,54.460113072809769,48.617843480110956]
["Nevada",93.882732237455642,159.31615167568231,171.0006908610799,76.609935180780894,103.38277061862675,103.73838702861711,117.86143873966293,112.78120431122917,104.29721281574483,107.39615581708941,105.26245735714723,128.88554744936417,135.89627096060272,147.1235890474413]
["New Hampshire",5.4866531827084462,5.4866531827084462,5.4866531827084462,5.0294320841494091,4.318199264168685,6.7567117898168831,6.4010953798265211,6.5027000683951961,4.5722109855903721,5.1818391170024221,6.5027000683951961,3.9117805098939851,3.9117805098939851,4.318199264168685]
["New Jersey",240.2442861206319,171.0006908610799,282.51183656520067,266.10267936135966,238.16139000497404,38074.677593618719,51413.570152843924,44977.702244843058,196.80828175752336,202.70135369450651,209.66127486146073,198.43395677462215,201.63450446453541,200.41524820171131]
["New Mexico",374.10846330986112,358.66455064742252,460.47244859323479,273.97704272543194,321.4772346312875,349.97734977480081,349.21531461053576,319.95316430275739,276.1615435296585,262.64811995002469,267.32193562418377,260.87003790007287,257.16146676731626,241.10792597346563]
["New York",411046.67531217495,378092.78117119469,351579.98752160685,341054.28294989484,159328.36355840182,389296.84251218929,383154.64124489791,390324.66136415221,649.55877401953887,754.92283606525473,809.17973976092719,619.22977448178938,714.17935594921607,571.93279195307116]
["North Carolina",71746.902550329018,70986.318652101065,82076.234253000788,78664.405830961201,73862.595830137449,72915.748729381885,63127.266182465522,62691.302097989224,329.50400502821282,315.58416269430433,305.3220891488682,400.5256823377166,341.79817234502246,347.2340231834466]
["Ohio",185606.14558268694,219256.12639496551,165022.69860213407,176278.46216488053,162076.91649603873,365344.69121109537,403618.65201082127,371382.4065047839,351.75543182475263,296.4316788991091,215.35113742130653,287.94768740362474,250.55716201035239,274.84068257826573]
["Oklahoma",35.815652720457912,34.29158239192779,21.336984599421736,38.101758213253099,36.323676163301286,42.673969198843473,35.561640999036229,36.831699606144667,16.256750170987988,28.601719832081994,18.288843942361488,16.917180646684375,27.941289356385607,11.684539185397618]
["Oregon",449522.78619316535,496345.87695053971,465746.54152661096,351208.1290423146,370956.57391455804,751054.14696412801,760949.45959742274,686584.29771266924,649.45716933097015,882.33511553037317,801.81339983969826,719.31039272193425,788.90960439147659,801.55938811827662]
["Other States",{"$f":"B88/MT_Hundredweight+IF(ISERROR((VLOOKUP($A36,$Q$56:$Y$81,B$5-1996,FALSE)/MT_Ton)),0,(VLOOKUP($A36,$Q$56:$Y$81,B$5-1996,FALSE)/MT_Ton))","v":709872.74877134105},763795.02655723807,787130.41708079656,854493.71468330326,660340.29793108488,1174967.8629715207,1222713.0093049963,1280010.813645151,{"$f":"J88/MT_Hundredweight+IF(ISERROR((VLOOKUP($A36,$Q$56:$Y$81,J$5-1996,FALSE)/MT_Ton)),0,(VLOOKUP($A36,$Q$56:$Y$81,J$5-1996,FALSE)/MT_Ton))","v":0},0,0,0,0,0]
["Pennsylvania",60738.328804349898,55890.869246325972,75048.547950624095,25148.764689585259,24652.447400742582,86671.46745401778,99523.811281162722,{"$f":"I89/MT_Hundredweight+IF(ISERROR((VLOOKUP($A37,$Q$56:$Y$81,I$5-1996,FALSE)/MT_Ton)),0,(VLOOKUP($A37,$Q$56:$Y$81,I$5-1996,FALSE)/MT_Ton))","v":61854.050218584583},155.60758054292566,139.60484209335937,164.09157203841002,0,0,0]
["Rhode Island",3.8609781656096476,2.2353031485108485,2.5401172142168735,3.4545594113349476,3.251350034197598,3.6577687884722976,5.0294320841494091,2.8449312799228981,1.8288843942361488,2.7433265913542231,3.4545594113349476,0,0,0]
["South Carolina",5573.9042421796275,4893.4429232528692,8215.7212802658178,14861.671465968615,12955.944333157126,16831.910371082784,20842.118010988881,13092.53012533945,127.97110525224608,76.152714082221863,133.10214202496417,127.20907008798102,137.72515535483888,119.79192782246776]
["Tennessee",57.355846697017,57.508253729870013,79.556471149272468,47.754203627277221,94.136743958877332,8380.1104807880929,8342.6183507062524,8358.925903221525,90.428172826120687,85.14472902054959,79.251657083566457,2.286105492795186,2.489314869932536,2.3369078370795235]
["Texas",111672.76717381315,120225.03959444244,98046.841253241888,128240.21496978513,100635.98354267003,182069.44470804758,147799.6388449629,134472.05345820167,852.10772068119229,581.07721392425196,645.18977241108587,137.67435301055454,183.80288162073296,210.57571705857882]
["Utah",107.29455112852074,127.61548884225571,112.17157617981712,48.567041135826621,53.342461498554343,42.064341067431421,39.625828541783228,37.746141803262738,34.29158239192779,46.636552053021795,39.27021213179286,85.19553136483394,95.051186155995396,68.227548373865218]
["Vermont",3.6577687884722976,2.7941289356385606,2.0828961156578361,2.5401172142168735,2.4385125256481985,4.4706062970216971,2.7941289356385606,3.9117805098939851,2.5401172142168735,3.6577687884722976,2.5401172142168735,664.5962679277028,683.29153062433898,589.51040307545202]
["Virginia",119.9951371996051,129.9015943350509,146.41235622746058,171.66112133677629,156.72523211718109,5318.1288679414465,7443.0464240981855,3366.1280237819506,147.98722890027506,125.48179038231355,101.09666512583156,35.460036310467551,41.454712936019376,38.203362901821777]
["Washington",1014287.7130631816,1021376.0432838191,1014023.9399125096,984823.48397290218,1026408.7066130015,2121754.3286462142,1987223.881234413,1841176.3646931082,779.71438007601148,870.9045880663972,808.87492569522112,2.286105492795186,2.5401172142168735,1.422465639961449]
["Wisconsin",1109261.5713130082,1160881.3991191427,1123905.5111943826,1032216.7228352956,1016974.7956481493,2124676.6402241029,1824071.5006666204,2147236.5602527438,105.82128314427494,112.88280899979786,80.623320379243566,105.36406204571591,81.334553199224288,83.620658692019475]
[]
[]
[]
[]
[]
["1 metric ton = ",19.684131000000001,"hundredweight",null,null,null,null,null,null,null,null,null,null,null,null,null,"1 metric ton = ",1.102311,"tons"]
[]
["Thousand Hundredweight",null,null,null,null,null,null,null,null,null,null,null,null,null,null,null,"Tons"]
["State",1998,1999,2000,2001,2002,2003,2004,2005,2006,2007,2008,2009,2010,2011,null,"State",1998,1999,2000,2001,2002,2003,2004,2005,2006,2007,2008,2009,2010,2011]
["Alabama",623,679,985,1115,1132,1148,708,653,774,817,863,893,912,844,null,"California",9063620,12376270,10433500,8805950,11229730,18983730,23854720,19695780,null,null,11941950]
["Arizona",19057,23246,21331,20723,22675,40859,41401,40642,40701,36980,33080,31602,31601,33222,null,"Colorado",1440]
["Arkansas",671,636,555,809,799,729,487,574,676,567,615,344,525,548,null,"Delaware",null,null,null,null,null,183700,150470,155440,null,null,10080]
["California",257368,278365,345550,314062,276560,227239,229605,223795,225342,221754,218671,214514,219733,217174,null,"Florida",59500,50920,70850,70850,70850,70850,70850,76250,null,null,73500]
["Colorado",17047,15648,13500,9523,9270,8212,10676,9493,7929,7248,6828,6943,7101,7107,null,"Georgia",null,null,null,null,null,53220,32880,28550]
["Connecticut",293,190,298,261,308,276,344,338,280,360,332,273,210,155,null,"Idaho",144900,140610,162900]
["Delaware",1040,1075,1096,1586,1228,711,1161,1184,1130,1333,1643,1358,1340,1385,null,"Illinois",130440,146120,145960,157570,142340,245750,232320,258510,null,null,44820]
["Florida",44895,50374,51972,46764,45822,40979,44280,42449,38954,43124,40892,41230,34277,37898,null,"Indiana",178730,238710,261710,277810,284070,229730,299850,290230,null,null,270290]
["Georgia",17233,19250,25392,24166,22627,20325,21270,21792,23225,22943,22013,22727,21951,17270,null,"Iowa",null,null,null,null,null,10790,9600,18930]
["Hawaii",482,487,461,139,null,null,null,null,null,null,null,null,null,null,null,"Maryland",null,null,null,null,null,123780,132050,133530,null,null,50370]
["Idaho",9744,11060,9620,4992,6272,5880,8008,6080,5076,6825,6192,6512,6840,7176,null,"Michigan",332000,385970,390580,318280,396030,779420,749560,676120,null,null,413350]
["Illinois",870,663,4343,3877,3700,3776,5169,5687,5555,6272,5772,4873,4882,5713,null,"Minnesota",959370,945110,920150,913070,1006400,2251880,2024870,2241750,null,null,1016340]
["Indiana",3107,2921,2899,4034,3537,3735,3706,3670,3555,3687,3718,3630,3937,4055,null,"Missouri",null,null,null,null,null,42520,51060,46550]
["Louisiana",454,443,242,null,216,234,130,null,null,null,null,null,null,null,null,"New Jersey",null,null,null,null,null,41750,56440,49380]
["Maine",127,138,116,110,110,120,120,130,124,152,108,90,99,96,null,"New York",452150,415810,386320,374940,174850,428360,421520,429580,null,null,77590]
["Maryland",1032,1375,1803,1828,1274,906,1139,1165,1097,959,1599,1199,1120,1236,null,"North Carolina",78750,77920,90000,86240,81000,80040,69300,68800,null,null,42300]
["Massachusetts",486,497,448,497,399,443,522,472,364,416,416,306,390,315,null,"Ohio",204410,241500,181640,194010,178330,402440,444640,409040,null,null,153940]
["Michigan",20705,21822,21745,21402,9412,9854,9611,8884,8793,8347,8396,9100,8390,7890,null,"Oregon",495420,547020,513190,386920,408740,827220,838010,756160,null,null,324770]
["Minnesota",504,236,38,73,78,65,48,0,0,null,null,null,null,null,null,"Other States",767970,827240,858420,932490,721840,1295180,1347810,1410970,null,null,861260]
["Mississippi",238,208,185,425,527,406,378,360,388,442,442,334,450,372,null,"Pennsylvania",66830,61510,82530,27570,27000,95410,109500,68020,null,null,37250]
["Missouri",1152,1272,1218,1150,1326,1387,924,963,856,741,675,858,1072,957,null,"South Carolina",6010,5270,8860,16170,14130,18400,22800,14350,null,null,10500]
["Nevada",1848,3136,3366,1508,2035,2042,2320,2220,2053,2114,2072,2537,2675,2896,null,"Tennessee",null,null,null,null,null,9120,9120,9120]
["New Hampshire",108,108,108,99,85,133,126,128,90,102,128,77,77,85,null,"Texas",121970,131280,106860,140060,109800,199600,161920,147310,null,null,37000]
["New Jersey",4729,3366,5561,5238,4688,3931,4174,3561,3874,3990,4127,3906,3969,3945,null,"Virginia",null,null,null,null,null,5700,8030,3540]
["New Mexico",7364,7060,9064,5393,6328,6889,6874,6298,5436,5170,5262,5135,5062,4746,null,"Washington",1115680,1124720,1115240,1083750,1130750,2338060,2189710,2028700,null,null,892950]
["New York",16987,17247,21973,17998,13918,13682,14921,12128,12786,14860,15928,12189,14058,11258,null,"Wisconsin",1222540,1279470,1238730,1137710,1120910,2341930,2010600,2366820,null,null,1172200]
["North Carolina",6025,5875,8456,8440,7492,5997,5105,5452,6486,6212,6010,7884,6728,6835]
["Ohio",3316,3365,4756,5423,5878,5062,4880,6052,6924,5835,4239,5668,4932,5410]
["Oklahoma",705,675,420,750,715,840,700,725,320,563,360,333,550,230]
["Oregon",1677,1920,3706,3939,3027,12058,14160,11954,12784,17368,15783,14159,15529,15778]
["Oregon - OR Malhuer",12240,17286,13920,7006,7800]
["Oregon - OR Other",6600,7200,6344,2964,3869]
["Other States",259474,262494,165045,168354,108221]
["Pennsylvania",2188,1770,3515,2710,3119,2302,3682,2900,3063,2748,3230,2504,2711,2358]
["Rhode Island",76,44,50,68,64,72,99,56,36,54,68,45,49,46]
["South Carolina",2396,2216,3505,3789,2705,2750,3116,1465,2519,1499,2620,2710,3618,4145]
["Tennessee",1129,1132,1566,940,1853,2098,1360,1681,1780,1676,1560,1677,1871,1343]
["Texas",20145,22239,21752,23225,20217,19592,17878,16429,16773,11438,12700,13082,13450,11604]
["Utah",2112,2512,2208,956,1050,828,780,743,675,918,773,698,816,752]
["Vermont",72,55,41,50,48,88,55,77,50,72,50,45,50,28]
["Virginia",2362,2557,2882,3379,3085,2897,3117,3045,2913,2470,1990,2074,1601,1646]
["Washington",42509,20608,45174,32710,11993,13806,14799,15160,15348,17143,15922,17096,17458,16404]
["Wisconsin",3772,3256,2918,2033,2009,2222,1680,1830,2083,2222,1587,2562,1683,2145]
[]
["Source: USDA Quick Stats 2.0, Annual Vegetable Production. Available online by state: http://quickstats.nass.usda.gov. Choose Survey, Crops, Vegetables, Vegetable Totals, Production, Vegetable Totals 34 Major Varies by Season Fresh Market - Production, Measured in CWT (Don't choose Total in the Domain), State, Select All States, Select All Years, Get the Data."]

{"sheet":"Red Meat Data","index":13,"n_rows":105,"n_cols":33,"rows_kept":105,"cut":false,"hidden":false,"merged":[]}
["Data on Red Meat Production were obtained from:"]
["USDA Quick Stats 2.0, Annual Red Meat Production. Available online by state: http://quickstats.nass.usda.gov/"]
[]
[]
["Red Meat Production, Metric Tons"]
["State",null,1990,1991,1992,1993,1994,1995,1996,1997,1998,1999,2000,2001,2002,2003,2004,2005,2006,2007,2008,2009,2010,2011,2012,2013,2014,2015,2016,2017,2018,2019,2020]
["Alabama","AL",{"$f":"(C58/MT_Lbs)*10^6","v":94802.400000000009},86909.760000000009,17917.2,18325.440000000002,18234.72,51846.48,62596.80000000001,60419.519999999997,69718.320000000007,42366.240000000005,19141.920000000002,20684.160000000003,22634.639999999999,18370.800000000003,15286.320000000003,14061.6,{"$f":"(S58/MT_Lbs)*10^6","v":13880.160000000002},12519.360000000002,10886.400000000001,10342.080000000002,9843.1200000000008,{"$f":"(X58/MT_Lbs)*10^6","v":9117.36},5171.0400000000009,{"$f":"(Z58/MT_Lbs)*10^6","v":5034.9600000000009},4173.12,{"$f":"(AB58/MT_Lbs)*10^6","v":3991.6800000000007},4581.3600000000006,{"$f":"(AD58/MT_Lbs)*10^6","v":6032.880000000001},6259.6800000000012,{"$f":"(AF58/MT_Lbs)*10^6","v":4263.84},0]
["Alaska","AK",{"$f":"(C59/MT_Lbs)*10^6","v":0},0,0,0,0,0,0,0,0,181.44000000000003,272.16000000000003,226.8,272.16000000000003,226.8,226.8,317.52,317.52,226.8,226.8,272.16000000000003,272.16000000000003,272.16000000000003,226.8,317.52,272.16000000000003,272.16000000000003,589.68000000000006,{"$f":"(AD59/MT_Lbs)*10^6","v":453.6},408.24,{"$f":"(AF59/MT_Lbs)*10^6","v":317.52},0]
["Arizona","AZ",{"$f":"(C60/MT_Lbs)*10^6","v":102695.04000000001},108319.68000000002,108546.48000000001,112855.68000000001,123197.76000000002,141750.00000000003,152364.24000000002,145923.12000000002,149189.04,162660.96000000002,177040.08000000002,189287.28000000003,203666.40000000002,192643.92,160529.04,163522.80000000002,175316.40000000002,184116.24000000002,185204.88,164430.00000000003,177448.32000000001,187654.32,175225.68000000002,183118.32,189695.52000000002,204120.00000000003,222490.80000000002,{"$f":"(AD60/MT_Lbs)*10^6","v":206705.52},212330.16,{"$f":"(AF60/MT_Lbs)*10^6","v":210878.64},0]
["Arkansas","AR",{"$f":"(C61/MT_Lbs)*10^6","v":30391.200000000004},33022.080000000002,32568.480000000003,29892.240000000005,31389.120000000006,35471.520000000004,34972.559999999998,31842.720000000005,31026.240000000005,31661.279999999999,25310.880000000001,26898.480000000003,30300.48,29756.16,27397.440000000002,25764.48,24630.48,26399.520000000004,29166.480000000003,27034.560000000001,23451.120000000003,19368.72,20638.800000000003,7212.2400000000007,2131.92,1950.48,2268,{"$f":"(AD61/MT_Lbs)*10^6","v":2268},1905.1200000000001,{"$f":"(AF61/MT_Lbs)*10^6","v":1905.1200000000001},0]
["California","CA",{"$f":"(C62/MT_Lbs)*10^6","v":509846.4},485215.9200000001,430375.68000000005,413274.96,434412.72000000003,473104.80000000005,477187.2,470020.32000000007,473195.52000000002,480952.08,487302.48000000004,513429.84000000014,613720.80000000005,647650.08000000007,648149.04,666383.76,729207.36,758600.64000000013,753973.92,772843.68,781961.04000000015,786315.60000000009,783367.20000000007,785272.32000000018,657720.00000000012,601428.24000000011,617893.92000000004,{"$f":"(AD62/MT_Lbs)*10^6","v":649146.96000000008},656948.88000000012,{"$f":"(AF62/MT_Lbs)*10^6","v":722358},0]
["Colorado","CO",{"$f":"(C63/MT_Lbs)*10^6","v":721042.56},795523.68,878623.20000000007,861522.4800000001,885744.72000000009,917269.92,921034.8,919311.12000000011,887014.8,969751.44000000018,975421.44000000006,969887.52,991070.64000000013,898989.8400000002,894998.16,798971.04,829452.96,856079.28,967937.04000000015,924436.8,966576.24000000011,975285.36,1003227.12,1028810.1600000001,990798.4800000001,966666.96000000008,1013750.64,{"$f":"(AD63/MT_Lbs)*10^6","v":1017107.28},1014113.52,{"$f":"(AF63/MT_Lbs)*10^6","v":993338.64000000013},0]
["Delaware","DE",{"$f":"(C64/MT_Lbs)*10^6","v":0},0,0,0,0,0,0,0,0,0,0,0,0,0,0,0,0,0,0,0,0,0,0,0,0,0,0,{"$f":"(AD64/MT_Lbs)*10^6","v":0},0,{"$f":"(AF64/MT_Lbs)*10^6","v":0},0]
["Florida","FL",{"$f":"(C65/MT_Lbs)*10^6","v":44588.880000000005},22589.279999999999,18280.080000000002,18416.16,19459.440000000002,20412.000000000004,22453.200000000004,21092.400000000001,20230.560000000001,21273.840000000004,25356.240000000002,28622.160000000003,31162.320000000003,30209.759999999998,24993.360000000004,24494.400000000001,30255.120000000003,39327.12000000001,45178.559999999998,46811.520000000004,51665.040000000008,{"$f":"(X65/MT_Lbs)*10^6","v":53570.159999999996},52844.400000000009,{"$f":"(Z65/MT_Lbs)*10^6","v":53978.400000000001},42729.120000000003,42094.080000000002,19822.320000000003,{"$f":"(AD65/MT_Lbs)*10^6","v":13608},14243.04,{"$f":"(AF65/MT_Lbs)*10^6","v":16374.960000000001},0]
["Georgia","GA",{"$f":"(C66/MT_Lbs)*10^6","v":179761.68},194957.28,202305.60000000003,194186.16000000003,205480.80000000002,207295.2,158034.23999999999,133766.63999999998,127416.24000000002,137077.92000000001,148780.80000000002,148327.20000000001,116393.76000000002,112447.44,72258.48000000001,61372.080000000009,67087.440000000017,74118.240000000005,71260.56,58559.76,56881.440000000002,61236.000000000007,64048.320000000007,64184.4,54477.36,56473.200000000012,64728.72,{"$f":"(AD66/MT_Lbs)*10^6","v":71079.12},72077.040000000008,{"$f":"(AF66/MT_Lbs)*10^6","v":75978},0]
["Hawaii","HI",{"$f":"(C67/MT_Lbs)*10^6","v":17554.320000000003},15649.200000000003,13199.760000000002,7892.6399999999994,7212.2400000000007,6577.2000000000007,7076.1600000000008,7529.760000000002,6940.0800000000008,6577.2000000000007,6486.4800000000014,5579.2800000000007,5307.12,4853.5200000000004,4762.8,4173.12,4581.3600000000006,4536,4898.88,4626.72,4853.5200000000004,4808.1600000000008,4581.3600000000006,4173.12,4173.12,3946.3199999999997,3810.2400000000002,{"$f":"(AD67/MT_Lbs)*10^6","v":3946.3199999999997},3674.1600000000003,{"$f":"(AF67/MT_Lbs)*10^6","v":4173.12},0]
["Idaho","ID",{"$f":"(C68/MT_Lbs)*10^6","v":210198.24000000002},200536.56000000003,215868.24000000002,207385.92,227162.88,236325.60000000003,247983.12000000002,246531.6,248436.72000000003,263768.40000000002,266716.80000000005,291392.64000000001,283726.8,259822.08000000002,203666.40000000002,141840.72,102241.44000000002,81194.399999999994,105008.40000000001,103375.44000000002,92579.760000000009,42275.520000000004,19867.68,20684.160000000003,19731.600000000002,21137.760000000002,24358.320000000003,{"$f":"(AD68/MT_Lbs)*10^6","v":67132.800000000003},140978.88000000003,{"$f":"(AF68/MT_Lbs)*10^6","v":165881.52000000002},0]
["Illinois","IL",{"$f":"(C69/MT_Lbs)*10^6","v":1121027.0400000003},1072174.32,1082198.8800000001,1023140.16,1168201.44,1183124.8800000004,1102384.0800000003,1085782.32,1166069.52,1182126.96,1216192.32,1201450.32,1190926.8000000003,1131686.6400000001,1200769.92,1213788.2400000002,1241684.6400000001,1297976.4000000001,1374135.84,1282145.7600000002,1231750.8,1250620.56,1350140.4000000001,1381574.8800000004,1373954.4000000001,1489123.4400000002,1529629.9200000002,{"$f":"(AD69/MT_Lbs)*10^6","v":1532669.0400000003},1542240,{"$f":"(AF69/MT_Lbs)*10^6","v":1579707.36},0]
["Indiana","IN",{"$f":"(C70/MT_Lbs)*10^6","v":327726},330084.72000000003,405609.12000000005,367642.80000000005,333758.88,321919.92000000004,370591.2,440490.96,557519.76,552666.24000000011,574302.96000000008,597527.28,627419.52000000014,644248.07999999996,652322.16,651777.84000000008,680626.8,709566.48,761957.28,787177.44000000006,790352.64000000013,795342.24000000011,795705.12,799923.60000000009,805276.08000000007,829135.44000000006,831630.24000000011,{"$f":"(AD70/MT_Lbs)*10^6","v":860388.48},821787.12000000011,{"$f":"(AF70/MT_Lbs)*10^6","v":827683.92000000016},0]
["Iowa","IA",{"$f":"(C71/MT_Lbs)*10^6","v":2790093.6},2908846.0800000005,3059441.2800000003,3013400.8800000004,3244328.64,3151295.2800000003,2628748.08,2445221.52,2804427.3600000003,2860265.52,2697559.2,2710622.8800000004,2823523.92,2913109.92,2981875.68,2940053.7600000007,2966407.92,2992807.44,3205954.08,3159550.8000000003,2980242.72,2990040.4800000004,3011087.52,2981013.8400000003,2992444.5600000005,3161138.4000000004,3200238.72,{"$f":"(AD71/MT_Lbs)*10^6","v":3279301.2},3492946.8000000003,{"$f":"(AF71/MT_Lbs)*10^6","v":3911846.4000000004},0]
["Kansas","KS",{"$f":"(C72/MT_Lbs)*10^6","v":2096221.6800000002},2030857.92,2045010.2399999998,2063018.1600000004,2382216.4800000004,2438961.8400000003,2373189.8400000003,2469489.12,2604798,2811367.44,2875824,2549322.7200000002,2668664.8800000004,2597676.4800000004,2541203.2800000003,2636005.6800000002,2782609.2000000007,2823523.92,2426578.56,2396459.52,2440368.0000000005,2422722.9600000004,2392377.12,2444042.1600000006,2301203.52,2285599.6800000002,2457695.52,{"$f":"(AD72/MT_Lbs)*10^6","v":2581573.6800000006},2665036.08,{"$f":"(AF72/MT_Lbs)*10^6","v":2533718.8800000004},0]
["Kentucky","KY",{"$f":"(C73/MT_Lbs)*10^6","v":255104.63999999998},264902.40000000002,254016.00000000003,246849.12000000002,263949.83999999997,281232.00000000006,232515.36000000004,203484.96000000002,232787.52000000005,215913.60000000001,198268.56000000003,195365.52000000002,203212.80000000002,213509.52000000002,227253.60000000003,214189.92,226391.76000000004,255376.80000000002,266762.16000000003,257962.32000000004,254333.52000000005,251112.96000000005,248255.28,234828.72000000006,232606.07999999999,253154.16,252110.87999999998,{"$f":"(AD73/MT_Lbs)*10^6","v":246849.12000000002},249525.36000000002,{"$f":"(AF73/MT_Lbs)*10^6","v":262316.87999999995},0]
["Louisiana","LA",{"$f":"(C74/MT_Lbs)*10^6","v":16828.560000000001},14424.480000000001,13471.92,12247.2,11702.880000000001,11702.880000000001,12791.52,10886.400000000001,9797.76,8663.760000000002,7847.2800000000016,7756.5600000000013,7529.760000000002,6849.3600000000006,5987.52,5488.56,4037.0400000000004,3402,3265.92,2903.0400000000004,2676.2400000000002,2721.6000000000004,2358.7200000000003,2222.6400000000003,2313.36,2540.16,2313.36,{"$f":"(AD74/MT_Lbs)*10^6","v":1995.8400000000004},1995.8400000000004,{"$f":"(AF74/MT_Lbs)*10^6","v":1859.76},0]
["Maryland","MD",{"$f":"(C75/MT_Lbs)*10^6","v":0},0,0,0,0,0,0,0,0,0,0,0,0,0,0,0,0,17191.440000000002,16737.84,17781.120000000003,17236.8,16284.240000000002,14152.320000000002,13834.800000000001,14106.960000000001,15513.120000000003,16284.240000000002,{"$f":"(AD75/MT_Lbs)*10^6","v":16420.320000000003},16873.920000000006,{"$f":"(AF75/MT_Lbs)*10^6","v":16284.240000000002},0]
["Michigan","MI",{"$f":"(C76/MT_Lbs)*10^6","v":451967.04000000004},423934.56000000006,409782.24000000005,397897.9200000001,452738.16000000003,474737.76,466164.72000000003,435773.52000000008,280007.28000000003,159803.28000000003,162207.36000000002,175180.32,190829.52,182029.68000000002,173184.48000000004,177720.48,206614.80000000002,224758.80000000002,237731.76000000004,237051.36000000002,238003.92000000004,{"$f":"(X76/MT_Lbs)*10^6","v":230791.68000000002},224894.88,217682.64,211377.60000000003,202986.00000000003,218998.08000000002,{"$f":"(AD76/MT_Lbs)*10^6","v":266762.16000000003},448111.44,{"$f":"(AF76/MT_Lbs)*10^6","v":485805.60000000003},0]
["Minnesota","MN",{"$f":"(C77/MT_Lbs)*10^6","v":777969.3600000001},948659.04000000015,1020237.12,1015746.4800000002,937364.40000000014,926840.88000000012,931921.20000000007,938453.04,895224.96000000008,936048.96000000008,918131.76000000013,969706.08000000019,1031985.36,1053077.76,1040785.2000000002,1038970.8000000002,1083106.08,1107645.8400000003,1172374.56,1171558.0800000003,1229528.1600000001,1249713.3600000001,1273890.24,1217008.8,1136993.76,1176547.6800000002,1159900.56,{"$f":"(AD77/MT_Lbs)*10^6","v":1249214.4000000001},1278380.8800000004,{"$f":"(AF77/MT_Lbs)*10^6","v":1295209.44},0]
["Mississippi","MS",{"$f":"(C78/MT_Lbs)*10^6","v":179943.12000000002},168603.12,161481.60000000001,140117.04,144970.56000000003,137985.12000000002,125102.88000000003,132133.68,133993.44,133857.36000000002,126735.83999999998,132224.40000000002,133766.63999999998,136170.72,135308.88000000003,131770.80000000002,131589.36000000002,35698.320000000007,7030.8,11748.24,10704.960000000001,11702.880000000001,12065.760000000002,6259.6800000000012,2948.4000000000005,{"$f":"(AB78/MT_Lbs)*10^6","v":2630.88},2721.6000000000004,{"$f":"(AD78/MT_Lbs)*10^6","v":2812.3200000000006},3084.48,{"$f":"(AF78/MT_Lbs)*10^6","v":3039.1200000000003},0]
["Missouri","MO",{"$f":"(C79/MT_Lbs)*10^6","v":307268.64},234465.84,264811.68,307676.88,200037.6,288126.72000000003,329495.04000000004,334212.48000000004,361519.2,368187.12000000005,356983.20000000007,288671.03999999998,197951.04,202895.28,204800.40000000002,219769.2,430103.52000000008,680490.72000000009,766946.88,788175.35999999999,770167.44000000018,796294.8,800876.16,831403.44000000006,855807.12000000011,885109.68,908424.72000000009,{"$f":"(AD79/MT_Lbs)*10^6","v":926024.4},905204.16,{"$f":"(AF79/MT_Lbs)*10^6","v":886198.32000000007},0]
["Montana","MT",{"$f":"(C80/MT_Lbs)*10^6","v":9344.16},7529.760000000002,7801.92,7847.2800000000016,9026.6400000000012,8074.0800000000008,8210.1600000000017,6940.0800000000008,8799.84,10069.920000000002,9752.4000000000015,7439.04,7620.4800000000005,7257.6,7030.8,7892.6399999999994,7348.3200000000006,7348.3200000000006,7529.760000000002,8346.24,7938.0000000000009,7302.9600000000019,7393.68,7575.12,7529.760000000002,7393.68,8074.0800000000008,{"$f":"(AD80/MT_Lbs)*10^6","v":10251.36},9616.3200000000015,{"$f":"(AF80/MT_Lbs)*10^6","v":9525.6},0]
["Nebraska","NE",{"$f":"(C81/MT_Lbs)*10^6","v":2289908.8800000004},2493076.3200000003,2626842.9600000004,2592278.64,2663992.8000000003,2724140.1600000006,2868475.6800000006,2940915.6,3043701.3600000003,3110879.52,3222964.0800000005,3248274.9600000004,3446861.04,3286422.72,3084480,3196746,3278076.48,3275082.72,3353374.0800000005,3250588.3200000003,3236753.52,3249545.04,3304521.3600000003,3335320.8000000003,3299667.8400000003,3390705.3600000003,3632338.08,{"$f":"(AD81/MT_Lbs)*10^6","v":3680056.8000000003},3677063.04,{"$f":"(AF81/MT_Lbs)*10^6","v":3759981.120000001},0]
["Nevada","NV",{"$f":"(C82/MT_Lbs)*10^6","v":589.68000000000006},680.40000000000009,589.68000000000006,544.32000000000005,544.32000000000005,544.32000000000005,589.68000000000006,498.96000000000009,408.24,408.24,408.24,408.24,408.24,408.24,453.6,498.96000000000009,362.88000000000005,453.6,589.68000000000006,{"$f":"(V82/MT_Lbs)*10^6","v":498.96000000000009},{"$f":"(W82/MT_Lbs)*10^6","v":362.88000000000005},498.96000000000009,408.24,453.6,498.96000000000009,544.32000000000005,589.68000000000006,{"$f":"(AD82/MT_Lbs)*10^6","v":635.04},635.04,{"$f":"(AF82/MT_Lbs)*10^6","v":498.96000000000009},0]
["New Hampshire","NH",0,0,0,0,0,0,0,0,0,0,0,0,0,0,0,0,0,5806.0800000000008,6259.6800000000012,{"$f":"(V83/MT_Lbs)*10^6","v":7393.68},{"$f":"(W83/MT_Lbs)*10^6","v":7393.68},7892.6399999999994,8482.32,8890.5600000000013,9298.8000000000011,10024.560000000001,11067.84,{"$f":"(AD83/MT_Lbs)*10^6","v":11249.280000000002},11340.000000000002,{"$f":"(AF83/MT_Lbs)*10^6","v":12337.92},0]
["New Jersey","NJ",{"$f":"(C84/MT_Lbs)*10^6","v":13199.760000000002},14288.400000000001,14696.640000000001,13925.52,13834.800000000001,16193.520000000002,19459.440000000002,23178.960000000003,24811.920000000006,24766.560000000005,25673.760000000002,27079.920000000006,27397.440000000002,24358.320000000003,22543.920000000002,22271.760000000002,23541.84,23904.720000000005,21818.160000000003,22498.560000000005,24630.48,24857.280000000002,22816.079999999998,22725.360000000004,20502.72,20548.079999999998,16057.439999999999,{"$f":"(AD84/MT_Lbs)*10^6","v":17236.8},17962.560000000001,{"$f":"(AF84/MT_Lbs)*10^6","v":18824.400000000001},0]
["New Mexico","NM",{"$f":"(C85/MT_Lbs)*10^6","v":40506.480000000003},38057.040000000008,26127.360000000001,13562.640000000001,12700.800000000001,9117.36,9162.7200000000012,6214.3200000000006,5397.8400000000011,6078.2400000000007,4490.6400000000003,4490.6400000000003,4853.5200000000004,5624.6400000000012,3583.4400000000005,3039.1200000000003,2766.96,2222.6400000000003,2585.5200000000004,2358.7200000000003,2177.2800000000002,2086.56,1632.96,1678.3200000000004,1587.6000000000001,1587.6000000000001,1451.5200000000002,{"$f":"(AD85/MT_Lbs)*10^6","v":1451.5200000000002},1723.68,{"$f":"(AF85/MT_Lbs)*10^6","v":1678.3200000000004},0]
["New York","NY",{"$f":"(C86/MT_Lbs)*10^6","v":39463.200000000004},41549.759999999995,46720.80000000001,37195.200000000004,41368.320000000007,45405.36,50803.200000000004,42366.240000000005,30300.48,23950.080000000002,22770.720000000005,18552.240000000002,20412.000000000004,20457.36,17327.520000000004,17871.84,15921.360000000002,15240.960000000001,16647.120000000003,15331.68,15014.160000000002,14968.800000000001,14832.720000000003,15331.68,15830.64,16420.320000000003,18779.04,{"$f":"(AD86/MT_Lbs)*10^6","v":18370.800000000003},18053.280000000002,{"$f":"(AF86/MT_Lbs)*10^6","v":17055.36},0]
["North Carolina","NC",{"$f":"(C87/MT_Lbs)*10^6","v":243492.48000000001},273157.92000000004,343919.52,509075.28,568043.28,665884.80000000005,786587.76,823284,844194.96000000008,873542.88,878396.4,898989.8400000002,935504.64000000013,997965.36,983404.8,1014884.6400000002,1039878.0000000001,1058702.4000000001,1138808.1599999999,1161034.56,1107419.04,1081518.4800000002,1107645.8400000003,1137764.8800000001,1039106.8800000001,1104788.1599999999,1131278.3999999999,{"$f":"(AD87/MT_Lbs)*10^6","v":1166795.28},1158585.1199999999,{"$f":"(AF87/MT_Lbs)*10^6","v":1228394.1600000001},0]
["North Dakota","ND",{"$f":"(C88/MT_Lbs)*10^6","v":56019.600000000006},57743.28,58242.240000000005,55157.760000000002,51302.159999999996,49034.16,56427.840000000004,49397.040000000008,48535.200000000004,13698.720000000001,12610.080000000002,15739.920000000002,16238.880000000001,14515.2,14787.36,15377.039999999999,14923.44,13517.28,12927.6,13471.92,17599.68,16964.64,6531.84,3583.4400000000005,3538.0800000000004,3492.7200000000003,3719.52,{"$f":"(AD88/MT_Lbs)*10^6","v":3764.880000000001},3356.6400000000008,{"$f":"(AF88/MT_Lbs)*10^6","v":3356.6400000000008},0]
["Ohio","OH",{"$f":"(C89/MT_Lbs)*10^6","v":283091.76},291891.60000000003,304229.52,280415.52,181530.72,159485.76000000004,147918.96000000002,141387.12,154405.44,152681.76000000004,143020.08000000002,134719.20000000001,142158.24,146784.96000000002,144607.68000000002,131725.44,131045.04000000001,131226.48000000001,140298.48000000001,138620.16000000003,137259.36000000002,134719.20000000001,126418.32,125737.92,122018.40000000001,119206.08000000002,120702.96000000002,{"$f":"(AD89/MT_Lbs)*10^6","v":116030.88000000002},112492.8,{"$f":"(AF89/MT_Lbs)*10^6","v":115305.12000000001},0]
["Oklahoma","OK",{"$f":"(C90/MT_Lbs)*10^6","v":27714.960000000003},26444.880000000001,29257.200000000004,25401.600000000002,25129.440000000002,23859.360000000004,144562.32,305091.36000000004,376578.72000000003,416949.12000000005,431555.04,437769.36000000004,441352.80000000005,446886.72000000009,473331.60000000003,484535.52000000008,476280.00000000006,469929.60000000003,508258.8,514926.72000000009,521912.16,542369.52,523635.84000000008,520959.60000000009,477187.2,543730.32000000007,522955.44000000006,{"$f":"(AD90/MT_Lbs)*10^6","v":521277.12000000005},545771.52000000002,{"$f":"(AF90/MT_Lbs)*10^6","v":553437.36},0]
["Oregon","OR",{"$f":"(C91/MT_Lbs)*10^6","v":27714.960000000003},21546.000000000004,21183.120000000003,22044.960000000003,15513.120000000003,16873.920000000006,18189.36,18688.32,18779.04,19550.160000000003,20412.000000000004,20321.28,19686.240000000002,19504.800000000003,18915.120000000003,19822.320000000003,22997.520000000004,25673.760000000002,26218.080000000002,25855.200000000001,26626.320000000003,31207.68,33022.080000000002,36151.920000000006,34700.400000000009,34564.32,32205.600000000002,{"$f":"(AD91/MT_Lbs)*10^6","v":30164.400000000001},23541.84,{"$f":"(AF91/MT_Lbs)*10^6","v":21772.800000000003},0]
["Pennsylvania","PA",{"$f":"(C92/MT_Lbs)*10^6","v":450606.24000000005},471335.76,486712.80000000005,492201.36,500411.52000000014,514155.60000000003,526811.04000000015,509755.68000000005,512568,541553.04,537470.64000000013,529850.15999999992,568179.36,573259.68000000005,529215.12,524679.12000000011,554571.36,584372.88,606417.84000000008,581424.48,582422.4,576843.12,580018.32000000007,565457.76,578521.44000000006,609184.80000000005,658854,{"$f":"(AD92/MT_Lbs)*10^6","v":662845.67999999993},668969.28,{"$f":"(AF92/MT_Lbs)*10^6","v":686432.88},0]
["South Carolina","SC",{"$f":"(C93/MT_Lbs)*10^6","v":78699.600000000006},76340.880000000019,81103.680000000008,81149.040000000008,77429.52,74481.119999999995,72530.640000000014,74798.640000000014,81920.160000000003,100381.68000000001,99202.319999999992,105053.76000000001,111948.48000000001,110587.68000000001,111812.40000000001,109589.76000000001,112538.16000000002,115350.48000000003,114261.84000000001,106958.88000000002,110270.16,111177.36,112039.20000000001,106006.32,111449.52,104464.08000000002,72031.680000000008,{"$f":"(AD93/MT_Lbs)*10^6","v":52572.240000000005},50757.840000000004,{"$f":"(AF93/MT_Lbs)*10^6","v":66225.600000000006},0]
["South Dakota","SD",{"$f":"(C94/MT_Lbs)*10^6","v":562191.84000000008},571717.44000000018,571082.40000000014,524180.16000000003,564641.28000000003,579836.88,543684.96,504947.52000000008,467616.24000000005,452057.76,441534.24000000005,460494.72000000009,425839.68,445888.80000000005,446977.44,454915.44,429786.00000000006,465892.56,467208,433868.4,449154.72000000009,473331.60000000003,478003.68000000005,486395.28,497327.0400000001,536064.4800000001,595395.36,{"$f":"(AD94/MT_Lbs)*10^6","v":667608.4800000001},688791.60000000009,{"$f":"(AF94/MT_Lbs)*10^6","v":704440.8},0]
["Tennessee","TN",{"$f":"(C95/MT_Lbs)*10^6","v":107684.64000000001},77701.680000000008,87227.280000000013,97569.36,104872.32000000001,89903.52,91808.640000000014,95392.080000000016,102060.00000000001,105552.72,106097.04000000002,102921.84000000001,103239.36,105643.44,100744.56000000001,97796.160000000003,95709.6,98748.72,102150.72,105824.88,106686.72,105734.16,108002.16,109499.04000000001,108954.72,116030.88000000002,118888.56000000001,{"$f":"(AD95/MT_Lbs)*10^6","v":123016.31999999999},117391.68000000001,{"$f":"(AF95/MT_Lbs)*10^6","v":122426.64},0]
["Texas","TX",{"$f":"(C96/MT_Lbs)*10^6","v":1760240.1600000001},1781922.24,1805055.8400000003,1881941.04,1966446.72,2034577.4400000002,2102436,2088283.6800000004,2205448.56,2227402.8000000003,2197238.4000000004,2168570.8800000004,2213568,2197056.9600000004,2090597.04,2125977.84,2234841.84,2121124.3200000003,2343796.5600000005,2317714.56,2295261.3600000003,2332955.52,2274305.04,2081615.7600000005,1896320.1600000004,1851958.08,1992392.6400000001,{"$f":"(AD96/MT_Lbs)*10^6","v":2048548.32},2111553.3600000003,{"$f":"(AF96/MT_Lbs)*10^6","v":2122349.04},0]
["United States","US",{"$f":"(C97/MT_Lbs)*10^6","v":17511772.32},17872520.400000002,18505110.960000001,18401780.880000003,19289657.52,19739674.080000006,19567215.360000003,19599194.16,20472374.16,20924704.080000002,20934275.040000003,20713371.84,21395813.040000003,21126873.600000001,20601604.800000001,20734282.800000001,21562964.640000004,22082971.680000003,22781878.560000002,22350731.760000002,22244226.48,22331499.120000001,22425938.640000001,22305326.400000002,21474285.840000004,21968755.199999999,22855951.440000001,{"$f":"(AD97/MT_Lbs)*10^6","v":23583299.040000003},24229815.120000001,{"$f":"(AF97/MT_Lbs)*10^6","v":24954940.080000002},0]
["Utah","UT",{"$f":"(C98/MT_Lbs)*10^6","v":178582.32},182301.84,190920.24000000002,197814.96000000005,210515.76000000004,192281.04,188561.52000000002,184978.08000000002,208429.2,224486.64,225529.92,236507.04,230746.32,208746.72000000003,186021.36000000002,209245.68000000002,227707.20000000004,215641.44000000003,235962.72000000003,199629.36000000004,206388.00000000003,205798.32,223035.12,216639.36000000004,212511.60000000003,{"$f":"(AB98/MT_Lbs)*10^6","v":210334.32},224078.40000000002,{"$f":"(AD98/MT_Lbs)*10^6","v":239818.32000000004},254923.2,{"$f":"(AF98/MT_Lbs)*10^6","v":265537.44},0]
["Virginia","VA",{"$f":"(C99/MT_Lbs)*10^6","v":370228.32000000007},383745.60000000003,387283.68,322600.32000000007,381205.44,399757.68,371861.28,351721.44,351131.76,334983.60000000003,327635.28000000003,348682.32000000007,366236.64,341832.96000000002,344191.68,298468.80000000005,186248.16000000003,217546.56000000003,230292.72,209608.56000000003,220268.16000000003,221084.63999999998,235872.00000000003,235236.96000000002,217410.48,226936.08000000002,229068.00000000003,{"$f":"(AD99/MT_Lbs)*10^6","v":235917.36000000002},238412.16000000003,{"$f":"(AF99/MT_Lbs)*10^6","v":243038.88},0]
["Washington","WA",{"$f":"(C100/MT_Lbs)*10^6","v":275562.00000000006},272658.96000000002,279871.20000000007,273974.40000000002,294749.28000000003,308357.28000000003,333622.80000000005,313528.32000000001,317973.60000000003,298242,314798.40000000002,304365.60000000003,293887.44,271207.44,221220.72,280324.80000000005,343239.12000000005,399893.76000000007,369684,374673.60000000003,392636.16000000009,392772.24,406879.20000000007,398850.48,392817.60000000003,386875.44,414046.08,{"$f":"(AD100/MT_Lbs)*10^6","v":416223.36000000004},412639.92000000004,{"$f":"(AF100/MT_Lbs)*10^6","v":437542.56},0]
["West Virginia","WV",{"$f":"(C101/MT_Lbs)*10^6","v":7302.9600000000019},7892.6399999999994,8164.8,7756.5600000000013,8663.760000000002,8346.24,9162.7200000000012,6078.2400000000007,4263.84,4445.2800000000007,3810.2400000000002,3447.36,3492.7200000000003,3220.56,3175.2000000000003,2812.3200000000006,2676.2400000000002,3039.1200000000003,3311.28,3810.2400000000002,3628.8,3900.96,3356.6400000000008,3311.28,3039.1200000000003,3039.1200000000003,3311.28,{"$f":"(AD101/MT_Lbs)*10^6","v":3583.4400000000005},3810.2400000000002,{"$f":"(AF101/MT_Lbs)*10^6","v":3719.52},0]
["Wisconsin","WI",{"$f":"(C102/MT_Lbs)*10^6","v":396537.12000000005},383881.68,435138.48,456321.60000000003,450334.08,461084.40000000008,506671.2,531210.96,557565.12,593399.52,611498.16,591358.32000000007,614628.00000000012,596620.07999999996,556521.84000000008,559606.32000000007,605782.80000000005,643839.84000000008,657266.4,628009.20000000007,638714.16,634042.08000000007,589362.48,601020,527264.64,463216.32000000007,492428.16000000003,{"$f":"(AD102/MT_Lbs)*10^6","v":552212.64},552212.64,{"$f":"(AF102/MT_Lbs)*10^6","v":560105.28},0]
["Wyoming","WY",{"$f":"(C103/MT_Lbs)*10^6","v":2041.2},1814.4,1950.48,2086.56,2222.6400000000003,2540.16,2494.8000000000002,2268,2449.44,2540.16,2268,2086.56,2585.5200000000004,2993.76,3129.8400000000006,2948.4000000000005,2812.3200000000006,2766.96,2812.3200000000006,2948.4000000000005,2766.96,2857.68,2721.6000000000004,2449.44,2358.7200000000003,2131.92,2131.92,{"$f":"(AD103/MT_Lbs)*10^6","v":1995.8400000000004},2041.2,{"$f":"(AF103/MT_Lbs)*10^6","v":1950.48},0]
[]
["1 metric ton = ",null,{"$f":"2000/0.9072","v":2204.5855379188711},"pounds"]
["Red Meat Production Data from USDA Quick Stats."]
["(in million pounds)",null,2,3,4,5,6,7,8,9,10,11,12,13,14,15,16,17,18,19,20,21,22,23,24,25,26,27,28,29,30,31,32]
["State",null,1990,1991,1992,1993,1994,1995,1996,1997,1998,1999,2000,2001,2002,2003,2004,2005,2006,2007,2008,2009,2010,2011,2012,2013,2014,2015,2016,2017,2018,2019,2020]
["Alabama","Alabama",209,191.6,39.5,40.4,40.200000000000003,114.3,138,133.19999999999999,153.69999999999999,93.4,42.2,45.6,49.9,40.5,33.700000000000003,31,30.6,27.6,24,22.8,21.7,20.100000000000001,11.4,11.1,9.1999999999999993,8.8000000000000007,10.1,13.3,13.8,9.4,0]
["Alaska","Alaska",0,0,0,0,0,0,0,0,0,0.4,0.6,0.5,0.6,0.5,0.5,0.7,0.7,0.5,0.5,0.6,0.6,0.6,0.5,0.7,0.6,0.6,1.3,1,0.9,0.7,0]
["Arizona","Arizona",226.4,238.8,239.3,248.8,271.60000000000002,312.5,335.9,321.7,328.9,358.6,390.3,417.3,449,424.7,353.9,360.5,386.5,405.9,408.3,362.5,391.2,413.7,386.3,403.7,418.2,450,490.5,455.7,468.1,464.9,0]
["Arkansas","Arkansas",67,72.8,71.8,65.900000000000006,69.2,78.2,77.099999999999994,70.2,68.400000000000006,69.8,55.8,59.3,66.8,65.599999999999994,60.4,56.8,54.3,58.2,64.3,59.6,51.7,42.7,45.5,15.9,4.7,4.3,5,5,4.2,4.2,0]
["California","California",1124,1069.7,948.8,911.1,957.7,1043,1052,1036.2,1043.2,1060.3,1074.3,1131.9000000000001,1353,1427.8,1428.9,1469.1,1607.6,1672.4,1662.2,1703.8,1723.9,1733.5,1727,1731.2,1450,1325.9,1362.2,1431.1,1448.3,1592.5,0]
["Colorado","Colorado",1589.6,1753.8,1937,1899.3,1952.7,2022.2,2030.5,2026.7,1955.5,2137.9,2150.4,2138.1999999999998,2184.9,1981.9,1973.1,1761.4,1828.6,1887.3,2133.9,2038,2130.9,2150.1,2211.6999999999998,2268.1,2184.3000000000002,2131.1,2234.9,2242.3000000000002,2235.6999999999998,2189.9,0]
["Delaware","Delaware",0,0,0,0,0,0,0,0,0,0,0,0,0,0,0,0,0,0,0,0,0,0,0,0,0,0,0,0,0,0,0]
["Florida","Florida",98.3,49.8,40.299999999999997,40.6,42.9,45,49.5,46.5,44.6,46.9,55.9,63.1,68.7,66.599999999999994,55.1,54,66.7,86.7,99.6,103.2,113.9,118.1,116.5,119,94.2,92.8,43.7,30,31.4,36.1,0]
["Georgia","Georgia",396.3,429.8,446,428.1,453,457,348.4,294.89999999999998,280.89999999999998,302.2,328,327,256.60000000000002,247.9,159.30000000000001,135.30000000000001,147.9,163.4,157.1,129.1,125.4,135,141.19999999999999,141.5,120.1,124.5,142.69999999999999,156.69999999999999,158.9,167.5,0]
["Hawaii","Hawaii",38.700000000000003,34.5,29.1,17.399999999999999,15.9,14.5,15.6,16.600000000000001,15.3,14.5,14.3,12.3,11.7,10.7,10.5,9.1999999999999993,10.1,10,10.8,10.199999999999999,10.7,10.6,10.1,9.1999999999999993,9.1999999999999993,8.6999999999999993,8.4,8.6999999999999993,8.1,9.1999999999999993,0]
["Idaho","Idaho",463.4,442.1,475.9,457.2,500.8,521,546.70000000000005,543.5,547.70000000000005,581.5,588,642.4,625.5,572.79999999999995,449,312.7,225.4,179,231.5,227.9,204.1,93.2,43.8,45.6,43.5,46.6,53.7,148,310.8,365.7,0]
["Illinois","Illinois",2471.4,2363.6999999999998,2385.8000000000002,2255.6,2575.4,2608.3000000000002,2430.3000000000002,2393.6999999999998,2570.6999999999998,2606.1,2681.2,2648.7,2625.5,2494.9,2647.2,2675.9,2737.4,2861.5,3029.4,2826.6,2715.5,2757.1,2976.5,3045.8,3029,3282.9,3372.2,3378.9,3400,3482.6,0]
["Indiana","Indiana",722.5,727.7,894.2,810.5,735.8,709.7,817,971.1,1229.0999999999999,1218.4000000000001,1266.0999999999999,1317.3,1383.2,1420.3,1438.1,1436.9,1500.5,1564.3,1679.8,1735.4,1742.4,1753.4,1754.2,1763.5,1775.3,1827.9,1833.4,1896.8,1811.7,1824.7,0]
["Iowa","Iowa",6151,6412.8,6744.8,6643.3,7152.4,6947.3,5795.3,5390.7,6182.6,6305.7,5947,5975.8,6224.7,6422.2,6573.8,6481.6,6539.7,6597.9,7067.8,6965.5,6570.2,6591.8,6638.2,6571.9,6597.1,6969,7055.2,7229.5,7700.5,8624,0]
["Kansas","Kansas",4621.3,4477.2,4508.3999999999996,4548.1000000000004,5251.8,5376.9,5231.8999999999996,5444.2,5742.5,6197.9,6340,5620.2,5883.3,5726.8,5602.3,5811.3,6134.5,6224.7,5349.6,5283.2,5380,5341.1,5274.2,5388.1,5073.2,5038.8,5418.2,5691.3,5875.3,5585.8,0]
["Kentucky","Kentucky",562.4,584,560,544.20000000000005,581.9,620,512.6,448.6,513.20000000000005,476,437.1,430.7,448,470.7,501,472.2,499.1,563,588.1,568.70000000000005,560.70000000000005,553.6,547.29999999999995,517.70000000000005,512.79999999999995,558.1,555.79999999999995,544.20000000000005,550.1,578.29999999999995,0]
["Louisiana","Louisiana",37.1,31.8,29.7,27,25.8,25.8,28.2,24,21.6,19.100000000000001,17.3,17.100000000000001,16.600000000000001,15.1,13.2,12.1,8.9,7.5,7.2,6.4,5.9,6,5.2,4.9000000000000004,5.0999999999999996,5.6,5.0999999999999996,4.4000000000000004,4.4000000000000004,4.0999999999999996,0]
["Maryland","Maryland",0,0,0,0,0,0,0,0,0,0,0,0,0,0,0,0,0,37.9,36.9,39.200000000000003,38,35.9,31.2,30.5,31.1,34.200000000000003,35.9,36.200000000000003,37.200000000000003,35.9,0]
["Michigan","Michigan",996.4,934.6,903.4,877.2,998.1,1046.5999999999999,1027.7,960.7,617.29999999999995,352.3,357.6,386.2,420.7,401.3,381.8,391.8,455.5,495.5,524.1,522.6,524.70000000000005,508.8,495.8,479.9,466,447.5,482.8,588.1,987.9,1071,0]
["Minnesota","Minnesota",1715.1,2091.4,2249.1999999999998,2239.3000000000002,2066.5,2043.3,2054.5,2068.9,1973.6,2063.6,2024.1,2137.8000000000002,2275.1,2321.6,2294.5,2290.5,2387.8000000000002,2441.9,2584.6,2582.8000000000002,2710.6,2755.1,2808.4,2683,2506.6,2593.8000000000002,2557.1,2754,2818.3,2855.4,0]
["Mississippi","Mississippi",396.7,371.7,356,308.89999999999998,319.60000000000002,304.2,275.8,291.3,295.39999999999998,295.10000000000002,279.39999999999998,291.5,294.89999999999998,300.2,298.3,290.5,290.10000000000002,78.7,15.5,25.9,23.6,25.8,26.6,13.8,6.5,5.8,6,6.2,6.8,6.7,0]
["Missouri","Missouri",677.4,516.9,583.79999999999995,678.3,441,635.20000000000005,726.4,736.8,797,811.7,787,636.4,436.4,447.3,451.5,484.5,948.2,1500.2,1690.8,1737.6,1697.9,1755.5,1765.6,1832.9,1886.7,1951.3,2002.7,2041.5,1995.6,1953.7,0]
["Montana","Montana",20.6,16.600000000000001,17.2,17.3,19.899999999999999,17.8,18.100000000000001,15.3,19.399999999999999,22.2,21.5,16.399999999999999,16.8,16,15.5,17.399999999999999,16.2,16.2,16.600000000000001,18.399999999999999,17.5,16.100000000000001,16.3,16.7,16.600000000000001,16.3,17.8,22.6,21.2,21,0]
["Nebraska","Nebraska",5048.3,5496.2,5791.1,5714.9,5873,6005.6,6323.8,6483.5,6710.1,6858.2,7105.3,7161.1,7598.9,7245.2,6800,7047.5,7226.8,7220.2,7392.8,7166.2,7135.7,7163.9,7285.1,7353,7274.4,7475.1,8007.8,8113,8106.4,8289.2000000000007,0]
["Nevada","Nevada",1.3,1.5,1.3,1.2,1.2,1.2,1.3,1.1000000000000001,0.9,0.9,0.9,0.9,0.9,0.9,1,1.1000000000000001,0.8,1,1.3,1.1000000000000001,0.8,1.1000000000000001,0.9,1,1.1000000000000001,1.2,1.3,1.4,1.4,1.1000000000000001,0]
["New Hampshire","New Hampshire",0,0,0,0,0,0,0,0,0,0,0,0,0,0,0,0,0,12.8,13.8,16.3,16.3,17.399999999999999,18.7,19.600000000000001,20.5,22.1,24.4,24.8,25,27.2,0]
["New Jersey","New Jersey",29.1,31.5,32.4,30.7,30.5,35.700000000000003,42.9,51.1,54.7,54.6,56.6,59.7,60.4,53.7,49.7,49.1,51.9,52.7,48.1,49.6,54.3,54.8,50.3,50.1,45.2,45.3,35.4,38,39.6,41.5,0]
["New Mexico","New Mexico",89.3,83.9,57.6,29.9,28,20.100000000000001,20.2,13.7,11.9,13.4,9.9,9.9,10.7,12.4,7.9,6.7,6.1,4.9000000000000004,5.7,5.2,4.8,4.5999999999999996,3.6,3.7,3.5,3.5,3.2,3.2,3.8,3.7,0]
["New York","New York",87,91.6,103,82,91.2,100.1,112,93.4,66.8,52.8,50.2,40.9,45,45.1,38.200000000000003,39.4,35.1,33.6,36.700000000000003,33.799999999999997,33.1,33,32.700000000000003,33.799999999999997,34.9,36.200000000000003,41.4,40.5,39.799999999999997,37.6,0]
["North Carolina","North Carolina",536.79999999999995,602.20000000000005,758.2,1122.3,1252.3,1468,1734.1,1815,1861.1,1925.8,1936.5,1981.9,2062.4,2200.1,2168,2237.4,2292.5,2334,2510.6,2559.6,2441.4,2384.3000000000002,2441.9,2508.3000000000002,2290.8000000000002,2435.6,2494,2572.3000000000002,2554.1999999999998,2708.1,0]
["North Dakota","North Dakota",123.5,127.3,128.4,121.6,113.1,108.1,124.4,108.9,107,30.2,27.8,34.700000000000003,35.799999999999997,32,32.6,33.9,32.9,29.8,28.5,29.7,38.799999999999997,37.4,14.4,7.9,7.8,7.7,8.1999999999999993,8.3000000000000007,7.4,7.4,0]
["Ohio","Ohio",624.1,643.5,670.7,618.20000000000005,400.2,351.6,326.10000000000002,311.7,340.4,336.6,315.3,297,313.39999999999998,323.60000000000002,318.8,290.39999999999998,288.89999999999998,289.3,309.3,305.60000000000002,302.60000000000002,297,278.7,277.2,269,262.8,266.10000000000002,255.8,248,254.2,0]
["Oklahoma","Oklahoma",61.1,58.3,64.5,56,55.4,52.6,318.7,672.6,830.2,919.2,951.4,965.1,973,985.2,1043.5,1068.2,1050,1036,1120.5,1135.2,1150.5999999999999,1195.7,1154.4000000000001,1148.5,1052,1198.7,1152.9000000000001,1149.2,1203.2,1220.0999999999999,0]
["Oregon","Oregon",61.1,47.5,46.7,48.6,34.200000000000003,37.200000000000003,40.1,41.2,41.4,43.1,45,44.8,43.4,43,41.7,43.7,50.7,56.6,57.8,57,58.7,68.8,72.8,79.7,76.5,76.2,71,66.5,51.9,48,0]
["Pennsylvania","Pennsylvania",993.4,1039.0999999999999,1073,1085.0999999999999,1103.2,1133.5,1161.4000000000001,1123.8,1130,1193.9000000000001,1184.9000000000001,1168.0999999999999,1252.5999999999999,1263.8,1166.7,1156.7,1222.5999999999999,1288.3,1336.9,1281.8,1284,1271.7,1278.7,1246.5999999999999,1275.4000000000001,1343,1452.5,1461.3,1474.8,1513.3,0]
["South Carolina","South Carolina",173.5,168.3,178.8,178.9,170.7,164.2,159.9,164.9,180.6,221.3,218.7,231.6,246.8,243.8,246.5,241.6,248.1,254.3,251.9,235.8,243.1,245.1,247,233.7,245.7,230.3,158.80000000000001,115.9,111.9,146,0]
["South Dakota","South Dakota",1239.4000000000001,1260.4000000000001,1259,1155.5999999999999,1244.8,1278.3,1198.5999999999999,1113.2,1030.9000000000001,996.6,973.4,1015.2,938.8,983,985.4,1002.9,947.5,1027.0999999999999,1030,956.5,990.2,1043.5,1053.8,1072.3,1096.4000000000001,1181.8,1312.6,1471.8,1518.5,1553,0]
["Tennessee","Tennessee",237.4,171.3,192.3,215.1,231.2,198.2,202.4,210.3,225,232.7,233.9,226.9,227.6,232.9,222.1,215.6,211,217.7,225.2,233.3,235.2,233.1,238.1,241.4,240.2,255.8,262.10000000000002,271.2,258.8,269.89999999999998,0]
["Texas","Texas",3880.6,3928.4,3979.4,4148.8999999999996,4335.2,4485.3999999999996,4635,4603.8,4862.1000000000004,4910.5,4844,4780.8,4880,4843.6000000000004,4608.8999999999996,4686.8999999999996,4926.8999999999996,4676.2,5167.1000000000004,5109.6000000000004,5060.1000000000004,5143.2,5013.8999999999996,4589.1000000000004,4180.6000000000004,4082.8,4392.3999999999996,4516.2,4655.1000000000004,4678.8999999999996,0]
["United States","US TOTAL",38606.199999999997,39401.5,40796.1,40568.300000000003,42525.7,43517.8,43137.599999999999,43208.1,45133.1,46130.3,46151.4,45664.4,47168.9,46576,45418,45710.5,47537.4,48683.8,50224.6,49274.1,49039.3,49231.7,49439.9,49174,47341.9,48432,50387.9,51991.4,53416.7,55015.3,0]
["Utah","Utah",393.7,401.9,420.9,436.1,464.1,423.9,415.7,407.8,459.5,494.9,497.2,521.4,508.7,460.2,410.1,461.3,502,475.4,520.20000000000005,440.1,455,453.7,491.7,477.6,468.5,463.7,494,528.70000000000005,562,585.4,0]
["Virginia","Virginia",816.2,846,853.8,711.2,840.4,881.3,819.8,775.4,774.1,738.5,722.3,768.7,807.4,753.6,758.8,658,410.6,479.6,507.7,462.1,485.6,487.4,520,518.6,479.3,500.3,505,520.1,525.6,535.79999999999995,0]
["Washington","Washington",607.5,601.1,617,604,649.79999999999995,679.8,735.5,691.2,701,657.5,694,671,647.9,597.9,487.7,618,756.7,881.6,815,826,865.6,865.9,897,879.3,866,852.9,912.8,917.6,909.7,964.6,0]
["West Virginia","West Virginia",16.100000000000001,17.399999999999999,18,17.100000000000001,19.100000000000001,18.399999999999999,20.2,13.4,9.4,9.8000000000000007,8.4,7.6,7.7,7.1,7,6.2,5.9,6.7,7.3,8.4,8,8.6,7.4,7.3,6.7,6.7,7.3,7.9,8.4,8.1999999999999993,0]
["Wisconsin","Wisconsin",874.2,846.3,959.3,1006,992.8,1016.5,1117,1171.0999999999999,1229.2,1308.2,1348.1,1303.7,1355,1315.3,1226.9000000000001,1233.7,1335.5,1419.4,1449,1384.5,1408.1,1397.8,1299.3,1325,1162.4000000000001,1021.2,1085.5999999999999,1217.4000000000001,1217.4000000000001,1234.8,0]
["Wyoming","Wyoming",4.5,4,4.3,4.5999999999999996,4.9000000000000004,5.6,5.5,5,5.4,5.6,5,4.5999999999999996,5.7,6.6,6.9,6.5,6.2,6.1,6.2,6.5,6.1,6.3,6,5.4,5.2,4.7,4.7,4.4000000000000004,4.5,4.3,0]
[]
["Source: USDA Quick Stats 2.0, Annual Red Meat Production. Available online by state: http://quickstats.nass.usda.gov. Choose Survey, Animals & Products, Livestock, Red Meat, Production, Red Meat Slaughter Commercial Production Measured in LB (Don't choose Total in the Domain), Choose National AND State, Select All States (including US Total), 1990-20XX, Annual, Year, Get Data."]

{"sheet":"Data Sources","index":14,"n_rows":24,"n_cols":14,"rows_kept":24,"cut":false,"hidden":false,"merged":[[15,2,15,9],[23,2,23,9],[1,1,1,9],[21,2,21,8]]}
[null,null,null,null,null,null,null,null,null,null,null,null,null,"Municipal WW, CH4"]
[null,"Recommended Data Sources for Wastewater Treatment Activity Data"]
[]
[]
[]
[null,"Methane Emissions from Municipal Wastewater Treatment"]
[]
[null,null,"- State agencies responsible for handling demographic or census information"]
[null,null,"- State and local public works agencies (for BOD5 and wastewater characteristics)"]
[]
[]
[]
[null,"Nitrous Oxide Emissions from Municipal Wastewater Treatment (Formerly “Human Sewage”)"]
[]
[null,null,"- State data, if available"]
[null,null,"- See Inventory of U.S. Greenhouse Gas Emissions and Sinks (U.S. EPA 2020) Table 7-16, for data on annual per capita protein consumption for the United States"]
[]
[]
[]
[null,"Methane Emissions from Industrial Wastewater Treatment"]
[]
[null,null,"- Published data on annual production are not readily available. "]
[]
[null,null,"- Default factors for wastewater outflow, industry-specific COD, and the fraction of industrial wastewater that is anaerobically treated that are used to estimate emissions from industrial wastewater in the Inventory of U.S. Greenhouse Gas Emissions and Sinks (U.S. EPA 2020) are provided in the control sheet. "]

{"sheet":"Lookups","index":15,"n_rows":55,"n_cols":11,"rows_kept":55,"cut":false,"hidden":false,"merged":[]}
[null,"Select a state . . .",{"$f":"VLOOKUP(SelectedState,$B$3:$C$55,2,FALSE)","v":"XX"},{"$f":"VLOOKUP(SelectedState,$B$3:$D$55,3,FALSE)","v":0},null,1,null,{"$f":"VLOOKUP($F$1,$F$3:$H$18,3,FALSE)","v":"Control"}]
[null,"State","StateAbbr.","State ID",null,null,"SheetList","Sheet.name",null,"VersionNumber",0]
[null,"Select a State . . .","XX",0,null,1,"Control Panel","Control",null,"VersionDate","2020-10-06"]
[null,"Alabama","AL",1,null,2,"Domestic - Methane Emissions","Dom WW"]
[null,"Alaska","AK",2,null,3,"Domestic - Nitrous Oxide Emissions","Human Sewage"]
[null,"Arizona","AZ",3,null,4,"Industrial - Fruits and Vegetables (Methane)","Ind WW Fruit"]
[null,"Arkansas","AR",4,null,5,"Industrial - Red Meat and Poultry (Methane)","Ind WW Meat"]
[null,"California","CA",5,null,6,"Industrial - Pulp and Paper (Methane)","Ind WW P&P"]
[null,"Colorado","CO",6,null,7,"Summary","Summary"]
[null,"Connecticut","CT",7,null,8]
[null,"Delaware","DE",8,null,9]
[null,"District of Columbia","DC",9,null,10]
[null,"Florida","FL",10,null,11]
[null,"Georgia","GA",11,null,12]
[null,"Hawaii","HI",12,null,13]
[null,"Idaho","ID",13,null,14]
[null,"Illinois","IL",14,null,15]
[null,"Indiana","IN",15,null,16]
[null,"Iowa","IA",16]
[null,"Kansas","KS",17,null,"Conversions"]
[null,"Kentucky","KY",18,null,"C_CO2",{"$f":"44/12","v":3.6666666666666665}]
[null,"Louisiana","LA",19]
[null,"Maine","ME",20]
[null,"Maryland","MD",21]
[null,"Massachusetts","MA",22]
[null,"Michigan","MI",23]
[null,"Minnesota","MN",24]
[null,"Mississippi","MS",25]
[null,"Missouri","MO",26]
[null,"Montana","MT",27]
[null,"Nebraska","NE",28]
[null,"Nevada","NV",29]
[null,"New Hampshire","NH",30]
[null,"New Jersey","NJ",31]
[null,"New Mexico","NM",32]
[null,"New York","NY",33]
[null,"North Carolina","NC",34]
[null,"North Dakota","ND",35]
[null,"Ohio","OH",36]
[null,"Oklahoma","OK",37]
[null,"Oregon","OR",38]
[null,"Pennsylvania","PA",39]
[null,"Rhode Island","RI",40]
[null,"South Carolina","SC",41]
[null,"South Dakota","SD",42]
[null,"Tennessee","TN",43]
[null,"Texas","TX",44]
[null,"Utah","UT",45]
[null,"Vermont","VT",46]
[null,"Virginia","VA",47]
[null,"Washington","WA",48]
[null,"West Virginia","WV",49]
[null,"Wisconsin","WI",50]
[null,"Wyoming","WY",51]
[null,"United States","US",52]

{"sheet":"Notes","index":16,"n_rows":4,"n_cols":26,"rows_kept":4,"cut":false,"hidden":false,"merged":[]}
[null,null,null,null,null,null,null,null,null,null,null,null,null,null,null,null,null,null,null,null,null,null,null,null,null,"Control"]
[null,null,null,null,null,null,null,null,null,null,null,null,null,null,null,null,null,null,null,null,null,null,null,null,null,"$E$12"]
["Notes and Comments"]
["Use this sheet to keep a record of data sources, edits, or any other useful notes about the use of this tool."]