{"text_format":"1","workbook":"xlsx","n_sheets":21,"sheets":["Lists","Welcome","Company_Information","Compliance_Options","Semiannual_Report","Deviation_Compliant_Coating","Deviation_Without_Addon","Deviation_w_Addon_Malfunction","Deviation_w_Addon_EmLimits","Deviation_w_Addon_CPMS1","Deviation_w_Addon_CPMS2","Deviation_w_Addon_CPMSSummary","Deviation_w_Addon_OpLimit","Deviation_w_Addon_OpLimSummary","Deviation_w_Addon_WorkPrac","Deviation_Equiv_ER","Description_of_Changes","Number_of_Deviations","Semiannual_Certification","Revisions","Worksheet Map"],"not_rendered":{"charts":0,"images":1,"macros":0,"external_links":0,"defined_names":16,"comments":0,"pivot_tables":0},"unopened":[],"bounds":{"document_bytes":16777216,"sheet_cells":100000,"rows_first":2000,"rows_last":500,"rows_between":2000,"halvings":0,"cell_chars":16384,"cell_head_chars":4096},"cells_cut":0,"cells_raw":0,"read":"whole","date_system":"1900"}

{"sheet":"Lists","index":0,"n_rows":501,"n_cols":31,"rows_kept":501,"cut":false,"hidden":true,"merged":[]}
["Rank","Company Name","Company List","Column1",null,"Rank","Operation Name","Operation List","Column1",null,"Rank","CPMS Name","CPMS List","Column1",null,null,null,"Column5","Column1","Column2","Column22","Column3","Column4","Column42","Column43","Column44","Company ID","Process Name","Column6",null,"State"]
[{"$f":"+IF(D2=\"\",\"\",MAX(A1:A$1)+1)","v":""},{"$f":"IF(Company_Information!B24=\"\",\"\",Company_Information!B24)","v":""},{"$f":"+IFERROR(INDEX($B$2:$B$101,MATCH(ROW()-ROW($C$1),$A$2:$A$101,0)),\"\")","v":""},{"$f":"IF(COUNTIF(B$2:B2,B2)=1,B2,\"\")","v":""},null,{"$f":"+IF(I2=\"\",\"\",MAX(F1:F$1)+1)","v":""},{"$f":"IF(Compliance_Options!C24=\"\",\"\",Compliance_Options!C24)","v":""},{"$f":"+IFERROR(INDEX($G$2:$G$191,MATCH(ROW()-ROW($H$1),$F$2:$F$191,0)),\"\")","v":""},{"$f":"IF(COUNTIF(G$2:G2,G2)=1,G2,\"\")","v":""},null,{"$f":"+IF(N2=\"\",\"\",MAX(K1:K$1)+1)","v":""},{"$f":"IF(Deviation_w_Addon_CPMS1!D24=\"\",\"\",Deviation_w_Addon_CPMS1!D24)","v":""},{"$f":"+IFERROR(INDEX($L$2:$L$501,MATCH(ROW()-ROW($M$1),$K$2:$K$501,0)),\"\")","v":""},{"$f":"IF(COUNTIF(L$2:L2,L2)=1,L2,\"\")","v":""},null,"WebCoatingandPrinting",null,{"$f":"+IF(W2=\"\",\"\",MAX(R1:R$1)+1)","v":""},{"$f":"IF(Compliance_Options!B24=\"\",\"\",Compliance_Options!B24)","v":""},{"$f":"IF(Compliance_Options!C24=\"\",\"\",Compliance_Options!C24)","v":""},{"$f":"IF(Compliance_Options!E24=\"\",\"\",Compliance_Options!E24)","v":""},{"$f":"S2&T2&Table29[[#This Row],[Column22]]","v":""},{"$f":"IF(COUNTIF(V$2:V2,V2)=1,V2,\"\")","v":""},{"$f":"IF(R2=\"\",\"\",S2)","v":""},{"$f":"IF(R2=\"\",\"\",T2)","v":""},{"$f":"IF(S2=\"\",\"\",U2)","v":""},{"$f":"IFERROR(INDEX($X$2:$X$78,MATCH(ROW()-ROW($AA$1),$R$2:$R$78,0)),\"\")","v":""},{"$f":"IFERROR(INDEX($Y$2:$Y$78,MATCH(ROW()-ROW($AA$1),$R$2:$R$78,0)),\"\")","v":""},{"$f":"IFERROR(INDEX($Z$2:$Z$78,MATCH(ROW()-ROW($AA$1),$R$2:$R$78,0)),\"\")","v":""},null,"AK"]
[{"$f":"+IF(D3=\"\",\"\",MAX(A$1:A2)+1)","v":""},{"$f":"IF(Company_Information!B25=\"\",\"\",Company_Information!B25)","v":""},"",{"$f":"IF(COUNTIF(B$2:B3,B3)=1,B3,\"\")","v":""},null,{"$f":"+IF(I3=\"\",\"\",MAX(F$1:F2)+1)","v":""},{"$f":"IF(Compliance_Options!C25=\"\",\"\",Compliance_Options!C25)","v":""},{"$f":"+IFERROR(INDEX($G$2:$G$191,MATCH(ROW()-ROW($H$1),$F$2:$F$191,0)),\"\")","v":""},{"$f":"IF(COUNTIF(G$2:G3,G3)=1,G3,\"\")","v":""},null,{"$f":"+IF(N3=\"\",\"\",MAX(K$1:K2)+1)","v":""},{"$f":"IF(Deviation_w_Addon_CPMS1!D25=\"\",\"\",Deviation_w_Addon_CPMS1!D25)","v":""},"",{"$f":"IF(COUNTIF(L$2:L3,L3)=1,L3,\"\")","v":""},null,"Compliant Material 63.4291(a)(1)",null,{"$f":"+IF(W3=\"\",\"\",MAX(R$1:R2)+1)","v":""},{"$f":"IF(Compliance_Options!B25=\"\",\"\",Compliance_Options!B25)","v":""},{"$f":"IF(Compliance_Options!C25=\"\",\"\",Compliance_Options!C25)","v":""},{"$f":"IF(Compliance_Options!E25=\"\",\"\",Compliance_Options!E25)","v":""},{"$f":"S3&T3&Table29[[#This Row],[Column22]]","v":""},{"$f":"IF(COUNTIF(V$2:V3,V3)=1,V3,\"\")","v":""},{"$f":"IF(R3=\"\",\"\",S3)","v":""},{"$f":"IF(R3=\"\",\"\",T3)","v":""},{"$f":"IF(S3=\"\",\"\",U3)","v":""},{"$f":"IFERROR(INDEX($X$2:$X$78,MATCH(ROW()-ROW($AA$1),$R$2:$R$78,0)),\"\")","v":""},{"$f":"IFERROR(INDEX($Y$2:$Y$78,MATCH(ROW()-ROW($AA$1),$R$2:$R$78,0)),\"\")","v":""},"",null,"AL"]
[{"$f":"+IF(D4=\"\",\"\",MAX(A$1:A3)+1)","v":""},{"$f":"IF(Company_Information!B26=\"\",\"\",Company_Information!B26)","v":""},"",{"$f":"IF(COUNTIF(B$2:B4,B4)=1,B4,\"\")","v":""},null,{"$f":"+IF(I4=\"\",\"\",MAX(F$1:F3)+1)","v":""},{"$f":"IF(Compliance_Options!C26=\"\",\"\",Compliance_Options!C26)","v":""},"",{"$f":"IF(COUNTIF(G$2:G4,G4)=1,G4,\"\")","v":""},null,{"$f":"+IF(N4=\"\",\"\",MAX(K$1:K3)+1)","v":""},{"$f":"IF(Deviation_w_Addon_CPMS1!D26=\"\",\"\",Deviation_w_Addon_CPMS1!D26)","v":""},"",{"$f":"IF(COUNTIF(L$2:L4,L4)=1,L4,\"\")","v":""},null,"Emission Rate Without Add-on Controls 63.4291(a)(2)",null,{"$f":"+IF(W4=\"\",\"\",MAX(R$1:R3)+1)","v":""},{"$f":"IF(Compliance_Options!B26=\"\",\"\",Compliance_Options!B26)","v":""},{"$f":"IF(Compliance_Options!C26=\"\",\"\",Compliance_Options!C26)","v":""},{"$f":"IF(Compliance_Options!E26=\"\",\"\",Compliance_Options!E26)","v":""},{"$f":"S4&T4&Table29[[#This Row],[Column22]]","v":""},{"$f":"IF(COUNTIF(V$2:V4,V4)=1,V4,\"\")","v":""},"","","","","","",null,"AR"]
[{"$f":"+IF(D5=\"\",\"\",MAX(A$1:A4)+1)","v":""},{"$f":"IF(Company_Information!B27=\"\",\"\",Company_Information!B27)","v":""},"",{"$f":"IF(COUNTIF(B$2:B5,B5)=1,B5,\"\")","v":""},null,{"$f":"+IF(I5=\"\",\"\",MAX(F$1:F4)+1)","v":""},{"$f":"IF(Compliance_Options!C27=\"\",\"\",Compliance_Options!C27)","v":""},"",{"$f":"IF(COUNTIF(G$2:G5,G5)=1,G5,\"\")","v":""},null,{"$f":"+IF(N5=\"\",\"\",MAX(K$1:K4)+1)","v":""},{"$f":"IF(Deviation_w_Addon_CPMS1!D27=\"\",\"\",Deviation_w_Addon_CPMS1!D27)","v":""},"",{"$f":"IF(COUNTIF(L$2:L5,L5)=1,L5,\"\")","v":""},null,"Emission Rate With Add-on Controls 63.4291(a)(3)",null,{"$f":"+IF(W5=\"\",\"\",MAX(R$1:R4)+1)","v":""},{"$f":"IF(Compliance_Options!B27=\"\",\"\",Compliance_Options!B27)","v":""},{"$f":"IF(Compliance_Options!C27=\"\",\"\",Compliance_Options!C27)","v":""},{"$f":"IF(Compliance_Options!E27=\"\",\"\",Compliance_Options!E27)","v":""},{"$f":"S5&T5&Table29[[#This Row],[Column22]]","v":""},{"$f":"IF(COUNTIF(V$2:V5,V5)=1,V5,\"\")","v":""},"","","","","","",null,"AS"]
[{"$f":"+IF(D6=\"\",\"\",MAX(A$1:A5)+1)","v":""},{"$f":"IF(Company_Information!B28=\"\",\"\",Company_Information!B28)","v":""},"",{"$f":"IF(COUNTIF(B$2:B6,B6)=1,B6,\"\")","v":""},null,{"$f":"+IF(I6=\"\",\"\",MAX(F$1:F5)+1)","v":""},{"$f":"IF(Compliance_Options!C28=\"\",\"\",Compliance_Options!C28)","v":""},"",{"$f":"IF(COUNTIF(G$2:G6,G6)=1,G6,\"\")","v":""},null,{"$f":"+IF(N6=\"\",\"\",MAX(K$1:K5)+1)","v":""},{"$f":"IF(Deviation_w_Addon_CPMS1!D28=\"\",\"\",Deviation_w_Addon_CPMS1!D28)","v":""},"",{"$f":"IF(COUNTIF(L$2:L6,L6)=1,L6,\"\")","v":""},null,"Organic HAP Overall Control Efficiency 63.4291(a)(4)",null,{"$f":"+IF(W6=\"\",\"\",MAX(R$1:R5)+1)","v":""},{"$f":"IF(Compliance_Options!B28=\"\",\"\",Compliance_Options!B28)","v":""},{"$f":"IF(Compliance_Options!C28=\"\",\"\",Compliance_Options!C28)","v":""},{"$f":"IF(Compliance_Options!E28=\"\",\"\",Compliance_Options!E28)","v":""},{"$f":"S6&T6&Table29[[#This Row],[Column22]]","v":""},{"$f":"IF(COUNTIF(V$2:V6,V6)=1,V6,\"\")","v":""},"","","","","","",null,"AZ"]
[{"$f":"+IF(D7=\"\",\"\",MAX(A$1:A6)+1)","v":""},{"$f":"IF(Company_Information!B29=\"\",\"\",Company_Information!B29)","v":""},"",{"$f":"IF(COUNTIF(B$2:B7,B7)=1,B7,\"\")","v":""},null,{"$f":"+IF(I7=\"\",\"\",MAX(F$1:F6)+1)","v":""},{"$f":"IF(Compliance_Options!C29=\"\",\"\",Compliance_Options!C29)","v":""},"",{"$f":"IF(COUNTIF(G$2:G7,G7)=1,G7,\"\")","v":""},null,{"$f":"+IF(N7=\"\",\"\",MAX(K$1:K6)+1)","v":""},{"$f":"IF(Deviation_w_Addon_CPMS1!D29=\"\",\"\",Deviation_w_Addon_CPMS1!D29)","v":""},"",{"$f":"IF(COUNTIF(L$2:L7,L7)=1,L7,\"\")","v":""},null,"Oxidizer Outlet Organic HAP Concentration Limit 63.4291(a)(5)",null,{"$f":"+IF(W7=\"\",\"\",MAX(R$1:R6)+1)","v":""},{"$f":"IF(Compliance_Options!B29=\"\",\"\",Compliance_Options!B29)","v":""},{"$f":"IF(Compliance_Options!C29=\"\",\"\",Compliance_Options!C29)","v":""},{"$f":"IF(Compliance_Options!E29=\"\",\"\",Compliance_Options!E29)","v":""},{"$f":"S7&T7&Table29[[#This Row],[Column22]]","v":""},{"$f":"IF(COUNTIF(V$2:V7,V7)=1,V7,\"\")","v":""},"","","","","","",null,"CA"]
[{"$f":"+IF(D8=\"\",\"\",MAX(A$1:A7)+1)","v":""},{"$f":"IF(Company_Information!B30=\"\",\"\",Company_Information!B30)","v":""},"",{"$f":"IF(COUNTIF(B$2:B8,B8)=1,B8,\"\")","v":""},null,{"$f":"+IF(I8=\"\",\"\",MAX(F$1:F7)+1)","v":""},{"$f":"IF(Compliance_Options!C30=\"\",\"\",Compliance_Options!C30)","v":""},"",{"$f":"IF(COUNTIF(G$2:G8,G8)=1,G8,\"\")","v":""},null,{"$f":"+IF(N8=\"\",\"\",MAX(K$1:K7)+1)","v":""},{"$f":"IF(Deviation_w_Addon_CPMS1!D30=\"\",\"\",Deviation_w_Addon_CPMS1!D30)","v":""},"",{"$f":"IF(COUNTIF(L$2:L8,L8)=1,L8,\"\")","v":""},null,null,null,{"$f":"+IF(W8=\"\",\"\",MAX(R$1:R7)+1)","v":""},{"$f":"IF(Compliance_Options!B30=\"\",\"\",Compliance_Options!B30)","v":""},{"$f":"IF(Compliance_Options!C30=\"\",\"\",Compliance_Options!C30)","v":""},{"$f":"IF(Compliance_Options!E30=\"\",\"\",Compliance_Options!E30)","v":""},{"$f":"S8&T8&Table29[[#This Row],[Column22]]","v":""},{"$f":"IF(COUNTIF(V$2:V8,V8)=1,V8,\"\")","v":""},"","","","","","",null,"CO"]
{"$rows_left_out":494}
{"sheet":"Welcome","index":1,"n_rows":23,"n_cols":3,"rows_kept":23,"cut":false,"hidden":false,"merged":[]}
["DO NOT REMOVE OR EDIT INFORMATION IN THIS SECTION\nFOR INTERNAL USE ONLY"]
["Template Name","63.4311(a) Semiannual Compliance Report (Spreadsheet Template)"]
["CitationID","63.4311(a)"]
["Template Version","v2.01"]
["Last Updated Date",43963]
[null,"OMB Control Number: 2060-0522, Expiration: March 31, 2019","WSemiannualAddonEmisLimit"]
[null,"40 CFR Part 63, Subpart OOOO National Emission Standards for Hazardous Air Pollutants: Printing, Coating,"]
[null," and Dyeing of Fabrics and Other Textiles - "]
{"$rows_left_out":16}
{"sheet":"Company_Information","index":2,"n_rows":33,"n_cols":15,"rows_kept":33,"cut":false,"hidden":false,"merged":[]}
[null,"DO NOT REMOVE OR EDIT INFORMATION IN THIS SECTION FOR INTERNAL USE ONLY"]
[null,"Template Name",{"$f":"+Welcome!B2","v":"63.4311(a) Semiannual Compliance Report (Spreadsheet Template)"}]
[null,"CitationID",{"$f":"+Welcome!B3","v":"63.4311(a)"}]
[null,"Template Version",{"$f":"+Welcome!B4","v":"v2.01"}]
[null,"Last Updated Date",{"$f":"+Welcome!B5","v":43963}]
[null,{"$f":"+Welcome!B6","v":"OMB Control Number: 2060-0522, Expiration: March 31, 2019"}]
[null,"40 CFR Part 63, Subpart OOOO National Emission Standards for Hazardous Air Pollutants: Printing, Coating, and Dyeing of Fabrics and Other Textiles - §63.4311(a) Semiannual Compliance Report Spreadsheet Template"]
[null,"\n"]
{"$rows_left_out":26}
{"sheet":"Compliance_Options","index":3,"n_rows":15,"n_cols":7,"rows_kept":15,"cut":false,"hidden":false,"merged":[]}
[null,"DO NOT REMOVE OR EDIT INFORMATION IN THIS SECTION\nFOR INTERNAL USE ONLY"]
[null,"Template Name",{"$f":"+Welcome!B2","v":"63.4311(a) Semiannual Compliance Report (Spreadsheet Template)"}]
[null,"CitationID",{"$f":"+Welcome!B3","v":"63.4311(a)"}]
[null,"Template Version",{"$f":"+Welcome!B4","v":"v2.01"}]
[null,"Last Updated Date",{"$f":"+Welcome!B5","v":43963}]
[null,{"$f":"+Welcome!B6","v":"OMB Control Number: 2060-0522, Expiration: March 31, 2019"}]
[null,"40 CFR Part 63, Subpart OOOO National Emission Standards for Hazardous Air Pollutants: Printing, Coating, and Dyeing of Fabrics and Other Textiles -"]
[null,"§63.4311(a) Semiannual Compliance Report Spreadsheet Template"]
{"$rows_left_out":8}
{"sheet":"Semiannual_Report","index":4,"n_rows":14,"n_cols":9,"rows_kept":14,"cut":false,"hidden":false,"merged":[]}
[null,"DO NOT REMOVE OR EDIT INFORMATION IN THIS SECTION\nFOR INTERNAL USE ONLY"]
[null,"Template Name",{"$f":"+Welcome!B2","v":"63.4311(a) Semiannual Compliance Report (Spreadsheet Template)"}]
[null,"CitationID",{"$f":"+Welcome!B3","v":"63.4311(a)"}]
[null,"Template Version",{"$f":"+Welcome!B4","v":"v2.01"}]
[null,"Last Updated Date",{"$f":"+Welcome!B5","v":43963}]
[null,{"$f":"+Welcome!B6","v":"OMB Control Number: 2060-0522, Expiration: March 31, 2019"}]
[null,"40 CFR Part 63, Subpart OOOO National Emission Standards for Hazardous Air Pollutants: Printing, Coating, and Dyeing of Fabrics and Other Textiles - §63.4311(a) Semiannual Compliance Report Spreadsheet Template"]
[null,"\n"]
{"$rows_left_out":7}
{"sheet":"Deviation_Compliant_Coating","index":5,"n_rows":23,"n_cols":12,"rows_kept":23,"cut":false,"hidden":false,"merged":[]}
[null,"DO NOT REMOVE OR EDIT INFORMATION IN THIS SECTION\nFOR INTERNAL USE ONLY"]
[null,"Template Name",{"$f":"+Welcome!B2","v":"63.4311(a) Semiannual Compliance Report (Spreadsheet Template)"}]
[null,"CitationID",{"$f":"+Welcome!B3","v":"63.4311(a)"}]
[null,"Template Version",{"$f":"+Welcome!B4","v":"v2.01"}]
[null,"Last Updated Date",{"$f":"+Welcome!B5","v":43963}]
[null,{"$f":"+Welcome!B6","v":"OMB Control Number: 2060-0522, Expiration: March 31, 2019"}]
[null,"40 CFR Part 63, Subpart OOOO National Emission Standards for Hazardous Air Pollutants: Printing, Coating, and Dyeing of Fabrics and Other Textiles - §63.4311(a) Semiannual Compliance Report Spreadsheet Template"]
[null,"\n"]
{"$rows_left_out":16}
{"sheet":"Deviation_Without_Addon","index":6,"n_rows":708,"n_cols":9,"rows_kept":708,"cut":false,"hidden":false,"merged":[]}
[null,"DO NOT REMOVE OR EDIT INFORMATION IN THIS SECTION\nFOR INTERNAL USE ONLY"]
[null,"Template Name",{"$f":"+Welcome!B2","v":"63.4311(a) Semiannual Compliance Report (Spreadsheet Template)"}]
[null,"CitationID",{"$f":"+Welcome!B3","v":"63.4311(a)"}]
[null,"Template Version",{"$f":"+Welcome!B4","v":"v2.01"}]
[null,"Last Updated Date",{"$f":"+Welcome!B5","v":43963}]
[null,{"$f":"+Welcome!B6","v":"OMB Control Number: 2060-0522, Expiration: March 31, 2019"}]
[null,"40 CFR Part 63, Subpart OOOO National Emission Standards for Hazardous Air Pollutants: Printing, Coating, and Dyeing of Fabrics and Other Textiles - §63.4311(a) Semiannual Compliance Report Spreadsheet Template"]
[null,"\n"]
{"$rows_left_out":701}
{"sheet":"Deviation_w_Addon_Malfunction","index":7,"n_rows":14,"n_cols":7,"rows_kept":14,"cut":false,"hidden":false,"merged":[]}
[null,"DO NOT REMOVE OR EDIT INFORMATION IN THIS SECTION\nFOR INTERNAL USE ONLY"]
[null,"Template Name",{"$f":"+Welcome!B2","v":"63.4311(a) Semiannual Compliance Report (Spreadsheet Template)"}]
[null,"CitationID",{"$f":"+Welcome!B3","v":"63.4311(a)"}]
[null,"Template Version",{"$f":"+Welcome!B4","v":"v2.01"}]
[null,"Last Updated Date",{"$f":"+Welcome!B5","v":43963}]
[null,{"$f":"+Welcome!B6","v":"OMB Control Number: 2060-0522, Expiration: March 31, 2019"}]
["R","40 CFR Part 63, Subpart OOOO National Emission Standards for Hazardous Air Pollutants: Printing, Coating, and Dyeing of Fabrics and Other Textiles "]
[null,"§63.4311(a) Semiannual Compliance Report Spreadsheet Template"]
{"$rows_left_out":7}
{"sheet":"Deviation_w_Addon_EmLimits","index":8,"n_rows":708,"n_cols":10,"rows_kept":708,"cut":false,"hidden":false,"merged":[]}
[null,"DO NOT REMOVE OR EDIT INFORMATION IN THIS SECTION FOR INTERNAL USE ONLY"]
[null,"Template Name",{"$f":"+Welcome!B2","v":"63.4311(a) Semiannual Compliance Report (Spreadsheet Template)"}]
[null,"CitationID",{"$f":"+Welcome!B3","v":"63.4311(a)"}]
[null,"Template Version",{"$f":"+Welcome!B4","v":"v2.01"}]
[null,"Last Updated Date",{"$f":"+Welcome!B5","v":43963}]
[null,{"$f":"+Welcome!B6","v":"OMB Control Number: 2060-0522, Expiration: March 31, 2019"}]
[null,"40 CFR Part 63, Subpart OOOO National Emission Standards for Hazardous Air Pollutants: Printing, Coating, and Dyeing of Fabrics and Other Textiles - §63.4311(a) Semiannual Compliance Report Spreadsheet Template"]
[null,"\n"]
{"$rows_left_out":701}
{"sheet":"Deviation_w_Addon_CPMS1","index":9,"n_rows":14,"n_cols":5,"rows_kept":14,"cut":false,"hidden":false,"merged":[]}
[null,"DO NOT REMOVE OR EDIT INFORMATION IN THIS SECTION\nFOR INTERNAL USE ONLY"]
[null,"Template Name",{"$f":"+Welcome!B2","v":"63.4311(a) Semiannual Compliance Report (Spreadsheet Template)"}]
[null,"CitationID",{"$f":"+Welcome!B3","v":"63.4311(a)"}]
[null,"Template Version",{"$f":"+Welcome!B4","v":"v2.01"}]
[null,"Last Updated Date",{"$f":"+Welcome!B5","v":43963}]
[null,{"$f":"+Welcome!B6","v":"OMB Control Number: 2060-0522, Expiration: March 31, 2019"}]
[null,"40 CFR Part 63, Subpart OOOO National Emission Standards for Hazardous Air Pollutants: Printing, Coating,"]
[null," and Dyeing of Fabrics and Other Textiles - §63.4311(a) Semiannual Compliance Report Spreadsheet Template"]
{"$rows_left_out":7}
{"sheet":"Deviation_w_Addon_CPMS2","index":10,"n_rows":14,"n_cols":10,"rows_kept":14,"cut":false,"hidden":false,"merged":[]}
[null,"DO NOT REMOVE OR EDIT INFORMATION IN THIS SECTION\nFOR INTERNAL USE ONLY"]
[null,"Template Name",{"$f":"+Welcome!B2","v":"63.4311(a) Semiannual Compliance Report (Spreadsheet Template)"}]
[null,"CitationID",{"$f":"+Welcome!B3","v":"63.4311(a)"}]
[null,"Template Version",{"$f":"+Welcome!B4","v":"v2.01"}]
[null,"Last Updated Date",{"$f":"+Welcome!B5","v":43963}]
[null,{"$f":"+Welcome!B6","v":"OMB Control Number: 2060-0522, Expiration: March 31, 2019"}]
[null,"40 CFR Part 63, Subpart OOOO National Emission Standards for Hazardous Air Pollutants: Printing, Coating, and Dyeing of Fabrics and Other Textiles - §63.4311(a) Semiannual Compliance Report Spreadsheet Template"]
[null,"\n"]
{"$rows_left_out":7}
{"sheet":"Deviation_w_Addon_CPMSSummary","index":11,"n_rows":100,"n_cols":7,"rows_kept":100,"cut":false,"hidden":false,"merged":[]}
[null,"DO NOT REMOVE OR EDIT INFORMATION IN THIS SECTION FOR INTERNAL USE ONLY"]
[null,"Template Name",{"$f":"+Welcome!B2","v":"63.4311(a) Semiannual Compliance Report (Spreadsheet Template)"}]
[null,"CitationID",{"$f":"+Welcome!B3","v":"63.4311(a)"}]
[null,"Template Version",{"$f":"+Welcome!B4","v":"v2.01"}]
[null,"Last Updated Date",{"$f":"+Welcome!B5","v":43963}]
[null,{"$f":"+Welcome!B6","v":"OMB Control Number: 2060-0522, Expiration: March 31, 2019"}]
[null,"40 CFR Part 63, Subpart OOOO National Emission Standards for Hazardous Air Pollutants: Printing, Coating, and Dyeing of Fabrics and Other Textiles - §63.4311(a) Semiannual Compliance Report Spreadsheet Template"]
[null,"\n"]
{"$rows_left_out":93}
{"sheet":"Deviation_w_Addon_OpLimit","index":12,"n_rows":14,"n_cols":8,"rows_kept":14,"cut":false,"hidden":false,"merged":[]}
[null,"DO NOT REMOVE OR EDIT INFORMATION IN THIS SECTION\nFOR INTERNAL USE ONLY"]
[null,"Template Name",{"$f":"+Welcome!B2","v":"63.4311(a) Semiannual Compliance Report (Spreadsheet Template)"}]
[null,"CitationID",{"$f":"+Welcome!B3","v":"63.4311(a)"}]
[null,"Template Version",{"$f":"+Welcome!B4","v":"v2.01"}]
[null,"Last Updated Date",{"$f":"+Welcome!B5","v":43963}]
[null,{"$f":"+Welcome!B6","v":"OMB Control Number: 2060-0522, Expiration: March 31, 2019"}]
[null,"40 CFR Part 63, Subpart OOOO National Emission Standards for Hazardous Air Pollutants: Printing, Coating, and Dyeing of Fabrics and Other Textiles - §63.4311(a) Semiannual Compliance Report Spreadsheet Template"]
[null,"\n"]
{"$rows_left_out":7}
{"sheet":"Deviation_w_Addon_OpLimSummary","index":13,"n_rows":100,"n_cols":11,"rows_kept":100,"cut":false,"hidden":false,"merged":[]}
[null,"DO NOT REMOVE OR EDIT INFORMATION IN THIS SECTION FOR INTERNAL USE ONLY"]
[null,"Template Name",{"$f":"+Welcome!B2","v":"63.4311(a) Semiannual Compliance Report (Spreadsheet Template)"}]
[null,"CitationID",{"$f":"+Welcome!B3","v":"63.4311(a)"}]
[null,"Template Version",{"$f":"+Welcome!B4","v":"v2.01"}]
[null,"Last Updated Date",{"$f":"+Welcome!B5","v":43963}]
[null,{"$f":"+Welcome!B6","v":"OMB Control Number: 2060-0522, Expiration: March 31, 2019"}]
[null,"40 CFR Part 63, Subpart OOOO National Emission Standards for Hazardous Air Pollutants: Printing, Coating, and Dyeing of Fabrics and Other Textiles - §63.4311(a) Semiannual Compliance Report Spreadsheet Template"]
[null,"\n"]
{"$rows_left_out":93}
{"sheet":"Deviation_w_Addon_WorkPrac","index":14,"n_rows":14,"n_cols":10,"rows_kept":14,"cut":false,"hidden":false,"merged":[]}
[null,"DO NOT REMOVE OR EDIT INFORMATION IN THIS SECTION FOR INTERNAL USE ONLY"]
[null,"Template Name",{"$f":"+Welcome!B2","v":"63.4311(a) Semiannual Compliance Report (Spreadsheet Template)"}]
[null,"CitationID",{"$f":"+Welcome!B3","v":"63.4311(a)"}]
[null,"Template Version",{"$f":"+Welcome!B4","v":"v2.01"}]
[null,"Last Updated Date",{"$f":"+Welcome!B5","v":43963}]
[null,{"$f":"+Welcome!B6","v":"OMB Control Number: 2060-0522, Expiration: March 31, 2019"}]
[null,"40 CFR Part 63, Subpart OOOO National Emission Standards for Hazardous Air Pollutants: Printing, Coating, and Dyeing of Fabrics and Other Textiles - §63.4311(a) Semiannual Compliance Report Spreadsheet Template"]
[null,"\n"]
{"$rows_left_out":7}
{"sheet":"Deviation_Equiv_ER","index":15,"n_rows":14,"n_cols":14,"rows_kept":14,"cut":false,"hidden":false,"merged":[]}
[null,"DO NOT REMOVE OR EDIT INFORMATION IN THIS SECTION \nFOR INTERNAL USE ONLY"]
[null,"Template Name",{"$f":"+Welcome!B2","v":"63.4311(a) Semiannual Compliance Report (Spreadsheet Template)"}]
[null,"CitationID",{"$f":"+Welcome!B3","v":"63.4311(a)"}]
[null,"Template Version",{"$f":"+Welcome!B4","v":"v2.01"}]
[null,"Last Updated Date",{"$f":"+Welcome!B5","v":43963}]
[null,{"$f":"+Welcome!B6","v":"OMB Control Number: 2060-0522, Expiration: March 31, 2019"}]
[null,"40 CFR Part 63, Subpart OOOO National Emission Standards for Hazardous Air Pollutants: Printing, Coating, and Dyeing of Fabrics and Other Textiles - §63.4311(a) Semiannual Compliance Report Spreadsheet Template"]
[null,"\n"]
{"$rows_left_out":7}
{"sheet":"Description_of_Changes","index":16,"n_rows":14,"n_cols":3,"rows_kept":14,"cut":false,"hidden":false,"merged":[]}
[null,"DO NOT REMOVE OR EDIT INFORMATION IN THIS SECTION \nFOR INTERNAL USE ONLY"]
[null,"Template Name",{"$f":"+Welcome!B2","v":"63.4311(a) Semiannual Compliance Report (Spreadsheet Template)"}]
[null,"CitationID",{"$f":"+Welcome!B3","v":"63.4311(a)"}]
[null,"Template Version",{"$f":"+Welcome!B4","v":"v2.01"}]
[null,"Last Updated Date",{"$f":"+Welcome!B5","v":43963}]
[null,{"$f":"+Welcome!B6","v":"OMB Control Number: 2060-0522, Expiration: March 31, 2019"}]
[null,"40 CFR Part 63, Subpart OOOO National Emission Standards for Hazardous Air Pollutants: Printing, Coating, and Dyeing of Fabrics and Other Textiles - "]
[null,"§63.4311(a) Semiannual Compliance Report Spreadsheet Template"]
{"$rows_left_out":7}
{"sheet":"Number_of_Deviations","index":17,"n_rows":100,"n_cols":8,"rows_kept":100,"cut":false,"hidden":false,"merged":[]}
[null,"DO NOT REMOVE OR EDIT INFORMATION IN THIS SECTION\nFOR INTERNAL USE ONLY"]
[null,"Template Name",{"$f":"+Welcome!B2","v":"63.4311(a) Semiannual Compliance Report (Spreadsheet Template)"}]
[null,"CitationID",{"$f":"+Welcome!B3","v":"63.4311(a)"}]
[null,"Template Version",{"$f":"+Welcome!B4","v":"v2.01"}]
[null,"Last Updated Date",{"$f":"+Welcome!B5","v":43963}]
[null,{"$f":"+Welcome!B6","v":"OMB Control Number: 2060-0522, Expiration: March 31, 2019"}]
[null,"40 CFR Part 63, Subpart OOOO National Emission Standards for Hazardous Air Pollutants: Printing, Coating, and Dyeing of Fabrics and Other Textiles -"]
[null,"§63.4311(a) Semiannual Compliance Report Spreadsheet Template"]
{"$rows_left_out":93}
{"sheet":"Semiannual_Certification","index":18,"n_rows":14,"n_cols":4,"rows_kept":14,"cut":false,"hidden":false,"merged":[]}
[null,"DO NOT REMOVE OR EDIT INFORMATION IN THIS SECTION\nFOR INTERNAL USE ONLY"]
[null,"Template Name",{"$f":"+Welcome!B2","v":"63.4311(a) Semiannual Compliance Report (Spreadsheet Template)"}]
[null,"CitationID",{"$f":"+Welcome!B3","v":"63.4311(a)"}]
[null,"Template Version",{"$f":"+Welcome!B4","v":"v2.01"}]
[null,"Last Updated Date",{"$f":"+Welcome!B5","v":43963}]
[null,{"$f":"+Welcome!B6","v":"OMB Control Number: 2060-0522, Expiration: March 31, 2019"}]
[null,"40 CFR Part 63, Subpart OOOO National Emission Standards for Hazardous Air Pollutants: "]
[null,"Printing, Coating, and Dyeing of Fabrics and Other Textiles "]
{"$rows_left_out":7}
{"sheet":"Revisions","index":19,"n_rows":6,"n_cols":3,"rows_kept":6,"cut":false,"hidden":false,"merged":[]}
["Revision Number","Date","Revisions"]
[1,43518,"Initial Release Version"]
[1.01,43537,"Updated the State dropdown to include VI, PR, AS, MP, and GU."]
[1.02,43914,"Removed all NOCS records from template; added filtering to tables"]
[2,43917,"Added hidden mapping sheet and hidden column A to allow for parsing by CEDRI EXCEL JSON Parser"]
[2.0099999999999998,43963,"Updated CBI Disclaimer."]

{"sheet":"Worksheet Map","index":20,"n_rows":18,"n_cols":5,"rows_kept":18,"cut":false,"hidden":true,"merged":[]}
["Worksheet Name","Parent","JSON Key","Parent Primary Key","Child Foreign Key"]
["Company_Information",null,"records"]
["Compliance_Options","records","ComplianceOptions","RecordId","RecordId"]
["Semiannual_Report","records","SemiannualReport","RecordId","RecordId"]
["Deviation_Compliant_Coating","records","DeviationCompliantCoating","RecordId","RecordId"]
["Deviation_Without_Addon","records","DeviationWithoutAddon","RecordId","RecordId"]
["Deviation_w_Addon_Malfunction","records","DeviationWAddonMalfunction","RecordId","RecordId"]
["Deviation_w_Addon_EmLimits","records","DeviationWAddonEmLimits","RecordId","RecordId"]
{"$rows_left_out":10}